Hospital Service Area,Hospital County,Operating Certificate Number,Permanent Facility Id,Facility Name,Age Group,Zip Code - 3 digits,Gender,Race,Ethnicity,Length of Stay,Type of Admission,Patient Disposition,Discharge Year,CCS Diagnosis Code,CCS Diagnosis Description,CCS Procedure Code,CCS Procedure Description,APR DRG Code,APR DRG Description,APR MDC Code,APR MDC Description,APR Severity of Illness Code,APR Severity of Illness Description,APR Risk of Mortality,APR Medical Surgical Description,Payment Typology 1,Payment Typology 2,Payment Typology 3,Birth Weight,Abortion Edit Indicator,Emergency Department Indicator,Total Charges,Total Costs
New York City,Manhattan,7002024,001456,Mount Sinai Hospital,70 or Older,115,F,Other Race,Not Span/Hispanic,1,Elective,Home w/ Home Health Services,2020,MUS006,OSTEOARTHRITIS,MST007,HIP ARTHROPLASTY,301,HIP JOINT REPLACEMENT,08,DISEASES AND DISORDERS OF THE MUSCULOSKELETAL SYSTEM AND CONNECTIVE TISSUE,1,Minor,Minor,Surgical,Medicare,Blue Cross/Blue Shield,Self-Pay,,,N,41283.23,13301.28
Hudson Valley,Westchester,5904001,001072,Montefiore New Rochelle Hospital,50 to 69,108,F,Black/African American,Unknown,6,Elective,Inpatient Rehabilitation Facility,2020,MUS006,OSTEOARTHRITIS,MST007,HIP ARTHROPLASTY,301,HIP JOINT REPLACEMENT,08,DISEASES AND DISORDERS OF THE MUSCULOSKELETAL SYSTEM AND CONNECTIVE TISSUE,2,Moderate,Minor,Surgical,Blue Cross/Blue Shield,Self-Pay,,,,N,105223.18,42548.43
New York City,Manhattan,7002024,001456,Mount Sinai Hospital,70 or Older,100,F,White,Not Span/Hispanic,7,Urgent,Home w/ Home Health Services,2020,INJ035,"COMPLICATION OF INTERNAL ORTHOPEDIC DEVICE OR IMPLANT, INITIAL ENCOUNTER",MST007,HIP ARTHROPLASTY,301,HIP JOINT REPLACEMENT,08,DISEASES AND DISORDERS OF THE MUSCULOSKELETAL SYSTEM AND CONNECTIVE TISSUE,1,Minor,Minor,Surgical,Medicare,Blue Cross/Blue Shield,Self-Pay,,,N,100381.8,27801.14
New York City,Manhattan,7002024,001456,Mount Sinai Hospital,50 to 69,100,F,White,Not Span/Hispanic,2,Elective,Home w/ Home Health Services,2020,INJ035,"COMPLICATION OF INTERNAL ORTHOPEDIC DEVICE OR IMPLANT, INITIAL ENCOUNTER",MST007,HIP ARTHROPLASTY,301,HIP JOINT REPLACEMENT,08,DISEASES AND DISORDERS OF THE MUSCULOSKELETAL SYSTEM AND CONNECTIVE TISSUE,1,Minor,Minor,Surgical,Private Health Insurance,Self-Pay,,,,N,46942.08,12855.92
New York City,Manhattan,7002032,001469,Mount Sinai Morningside,70 or Older,100,M,White,Not Span/Hispanic,4,Emergency,Inpatient Rehabilitation Facility,2020,INJ006,"FRACTURE OF THE NECK OF THE FEMUR (HIP), INITIAL ENCOUNTER",MST007,HIP ARTHROPLASTY,301,HIP JOINT REPLACEMENT,08,DISEASES AND DISORDERS OF THE MUSCULOSKELETAL SYSTEM AND CONNECTIVE TISSUE,1,Minor,Minor,Surgical,Medicare,Private Health Insurance,Self-Pay,,,Y,83689.65,20514.59
New York City,Manhattan,7002032,001469,Mount Sinai Morningside,70 or Older,100,M,White,Not Span/Hispanic,2,Elective,Home w/ Home Health Services,2020,MUS006,OSTEOARTHRITIS,MST007,HIP ARTHROPLASTY,301,HIP JOINT REPLACEMENT,08,DISEASES AND DISORDERS OF THE MUSCULOSKELETAL SYSTEM AND CONNECTIVE TISSUE,1,Minor,Minor,Surgical,Medicare,Private Health Insurance,Self-Pay,,,N,63713.31,16987.07
New York City,Manhattan,7002032,001469,Mount Sinai Morningside,50 to 69,104,M,Black/African American,Not Span/Hispanic,2,Elective,Home w/ Home Health Services,2020,MUS006,OSTEOARTHRITIS,MST007,HIP ARTHROPLASTY,301,HIP JOINT REPLACEMENT,08,DISEASES AND DISORDERS OF THE MUSCULOSKELETAL SYSTEM AND CONNECTIVE TISSUE,2,Moderate,Minor,Surgical,Medicaid,Self-Pay,,,,N,65655.69,17594.66
New York City,Manhattan,7002032,001469,Mount Sinai Morningside,70 or Older,101,M,White,Not Span/Hispanic,6,Urgent,Inpatient Rehabilitation Facility,2020,INJ006,"FRACTURE OF THE NECK OF THE FEMUR (HIP), INITIAL ENCOUNTER",MST007,HIP ARTHROPLASTY,301,HIP JOINT REPLACEMENT,08,DISEASES AND DISORDERS OF THE MUSCULOSKELETAL SYSTEM AND CONNECTIVE TISSUE,1,Minor,Moderate,Surgical,Private Health Insurance,Medicare,Self-Pay,,,N,99255.93,23395.87
New York City,Manhattan,7002032,001469,Mount Sinai Morningside,70 or Older,100,F,Black/African American,Not Span/Hispanic,11,Urgent,Skilled Nursing Home,2020,INJ006,"FRACTURE OF THE NECK OF THE FEMUR (HIP), INITIAL ENCOUNTER",MST007,HIP ARTHROPLASTY,301,HIP JOINT REPLACEMENT,08,DISEASES AND DISORDERS OF THE MUSCULOSKELETAL SYSTEM AND CONNECTIVE TISSUE,2,Moderate,Major,Surgical,Medicare,Medicare,Medicaid,,,N,143469.68,32751.25
New York City,Manhattan,7002032,001466,Mount Sinai West,70 or Older,117,F,Other Race,Not Span/Hispanic,4,Emergency,Inpatient Rehabilitation Facility,2020,INJ006,"FRACTURE OF THE NECK OF THE FEMUR (HIP), INITIAL ENCOUNTER",MST007,HIP ARTHROPLASTY,301,HIP JOINT REPLACEMENT,08,DISEASES AND DISORDERS OF THE MUSCULOSKELETAL SYSTEM AND CONNECTIVE TISSUE,1,Minor,Minor,Surgical,Medicare,Private Health Insurance,Self-Pay,,,Y,89245.58,22889.46
New York City,Manhattan,7002032,001466,Mount Sinai West,50 to 69,112,M,Black/African American,Not Span/Hispanic,2,Elective,Home w/ Home Health Services,2020,MUS006,OSTEOARTHRITIS,MST007,HIP ARTHROPLASTY,301,HIP JOINT REPLACEMENT,08,DISEASES AND DISORDERS OF THE MUSCULOSKELETAL SYSTEM AND CONNECTIVE TISSUE,1,Minor,Minor,Surgical,Blue Cross/Blue Shield,Self-Pay,,,,N,54413.26,14276.31
New York City,Manhattan,7002032,001466,Mount Sinai West,50 to 69,100,M,Black/African American,Not Span/Hispanic,3,Elective,Skilled Nursing Home,2020,MUS006,OSTEOARTHRITIS,MST007,HIP ARTHROPLASTY,301,HIP JOINT REPLACEMENT,08,DISEASES AND DISORDERS OF THE MUSCULOSKELETAL SYSTEM AND CONNECTIVE TISSUE,2,Moderate,Moderate,Surgical,Medicaid,Medicaid,Self-Pay,,,N,69518.11,17487.97
New York City,Manhattan,7002032,001466,Mount Sinai West,70 or Older,100,F,White,Not Span/Hispanic,4,Emergency,Skilled Nursing Home,2020,INJ006,"FRACTURE OF THE NECK OF THE FEMUR (HIP), INITIAL ENCOUNTER",MST007,HIP ARTHROPLASTY,301,HIP JOINT REPLACEMENT,08,DISEASES AND DISORDERS OF THE MUSCULOSKELETAL SYSTEM AND CONNECTIVE TISSUE,1,Minor,Major,Surgical,Medicare,Private Health Insurance,Self-Pay,,,Y,80302.85,19280.77
New York City,Manhattan,7002032,001466,Mount Sinai West,50 to 69,103,M,White,Not Span/Hispanic,1,Elective,Home w/ Home Health Services,2020,MUS006,OSTEOARTHRITIS,MST007,HIP ARTHROPLASTY,301,HIP JOINT REPLACEMENT,08,DISEASES AND DISORDERS OF THE MUSCULOSKELETAL SYSTEM AND CONNECTIVE TISSUE,2,Moderate,Minor,Surgical,Medicare,Private Health Insurance,Self-Pay,,,N,46229.3,12340.42
New York City,Manhattan,7002032,001466,Mount Sinai West,50 to 69,114,F,Black/African American,Not Span/Hispanic,3,Elective,Home w/ Home Health Services,2020,MUS006,OSTEOARTHRITIS,MST007,HIP ARTHROPLASTY,301,HIP JOINT REPLACEMENT,08,DISEASES AND DISORDERS OF THE MUSCULOSKELETAL SYSTEM AND CONNECTIVE TISSUE,2,Moderate,Moderate,Surgical,Medicare,Medicare,Self-Pay,,,N,68052.72,17233.68
New York City,Manhattan,7002032,001466,Mount Sinai West,70 or Older,100,F,White,Not Span/Hispanic,3,Emergency,Skilled Nursing Home,2020,INJ006,"FRACTURE OF THE NECK OF THE FEMUR (HIP), INITIAL ENCOUNTER",MST007,HIP ARTHROPLASTY,301,HIP JOINT REPLACEMENT,08,DISEASES AND DISORDERS OF THE MUSCULOSKELETAL SYSTEM AND CONNECTIVE TISSUE,1,Minor,Minor,Surgical,Medicare,Medicare,Self-Pay,,,Y,74761.82,18622.47
New York City,Manhattan,7002032,001466,Mount Sinai West,50 to 69,100,F,Other Race,Spanish/Hispanic,3,Emergency,Inpatient Rehabilitation Facility,2020,INJ006,"FRACTURE OF THE NECK OF THE FEMUR (HIP), INITIAL ENCOUNTER",MST007,HIP ARTHROPLASTY,301,HIP JOINT REPLACEMENT,08,DISEASES AND DISORDERS OF THE MUSCULOSKELETAL SYSTEM AND CONNECTIVE TISSUE,3,Major,Major,Surgical,Medicaid,Medicaid,Self-Pay,,,Y,75786.9,19780.96
New York City,Manhattan,7002032,001466,Mount Sinai West,50 to 69,108,M,White,Not Span/Hispanic,1,Elective,Home w/ Home Health Services,2020,MUS006,OSTEOARTHRITIS,MST007,HIP ARTHROPLASTY,301,HIP JOINT REPLACEMENT,08,DISEASES AND DISORDERS OF THE MUSCULOSKELETAL SYSTEM AND CONNECTIVE TISSUE,2,Moderate,Minor,Surgical,Blue Cross/Blue Shield,Self-Pay,,,,N,65187.16,18725.44
New York City,Manhattan,7002032,001466,Mount Sinai West,50 to 69,103,F,White,Not Span/Hispanic,10,Emergency,Skilled Nursing Home,2020,INJ035,"COMPLICATION OF INTERNAL ORTHOPEDIC DEVICE OR IMPLANT, INITIAL ENCOUNTER",MST007,HIP ARTHROPLASTY,301,HIP JOINT REPLACEMENT,08,DISEASES AND DISORDERS OF THE MUSCULOSKELETAL SYSTEM AND CONNECTIVE TISSUE,3,Major,Major,Surgical,Blue Cross/Blue Shield,Self-Pay,,,,Y,150583.7,34723.34
New York City,Manhattan,7002032,001466,Mount Sinai West,50 to 69,104,M,White,Spanish/Hispanic,2,Elective,Home w/ Home Health Services,2020,MUS006,OSTEOARTHRITIS,MST007,HIP ARTHROPLASTY,301,HIP JOINT REPLACEMENT,08,DISEASES AND DISORDERS OF THE MUSCULOSKELETAL SYSTEM AND CONNECTIVE TISSUE,1,Minor,Minor,Surgical,Medicare,Medicare,Medicaid,,,N,56572.35,14646.97
New York City,Manhattan,7002032,001466,Mount Sinai West,50 to 69,OOS,F,White,Not Span/Hispanic,2,Elective,Home w/ Home Health Services,2020,MUS006,OSTEOARTHRITIS,MST007,HIP ARTHROPLASTY,301,HIP JOINT REPLACEMENT,08,DISEASES AND DISORDERS OF THE MUSCULOSKELETAL SYSTEM AND CONNECTIVE TISSUE,1,Minor,Minor,Surgical,Medicare,Self-Pay,,,,N,60619.89,15837.1
New York City,Manhattan,7002032,001466,Mount Sinai West,50 to 69,100,M,Black/African American,Not Span/Hispanic,2,Elective,Home w/ Home Health Services,2020,INJ035,"COMPLICATION OF INTERNAL ORTHOPEDIC DEVICE OR IMPLANT, INITIAL ENCOUNTER",MST007,HIP ARTHROPLASTY,301,HIP JOINT REPLACEMENT,08,DISEASES AND DISORDERS OF THE MUSCULOSKELETAL SYSTEM AND CONNECTIVE TISSUE,2,Moderate,Minor,Surgical,Medicare,Medicare,Self-Pay,,,N,49749.27,12812.33
New York City,Manhattan,7002032,001466,Mount Sinai West,70 or Older,100,F,White,Not Span/Hispanic,3,Emergency,Skilled Nursing Home,2020,INJ006,"FRACTURE OF THE NECK OF THE FEMUR (HIP), INITIAL ENCOUNTER",MST007,HIP ARTHROPLASTY,301,HIP JOINT REPLACEMENT,08,DISEASES AND DISORDERS OF THE MUSCULOSKELETAL SYSTEM AND CONNECTIVE TISSUE,1,Minor,Major,Surgical,Medicare,Self-Pay,,,,Y,71981.74,17976.19
New York City,Manhattan,7002032,001466,Mount Sinai West,30 to 49,114,M,Other Race,Spanish/Hispanic,1,Elective,Home w/ Home Health Services,2020,MUS006,OSTEOARTHRITIS,MST007,HIP ARTHROPLASTY,301,HIP JOINT REPLACEMENT,08,DISEASES AND DISORDERS OF THE MUSCULOSKELETAL SYSTEM AND CONNECTIVE TISSUE,2,Moderate,Minor,Surgical,Miscellaneous/Other,Self-Pay,,,,N,55451.06,15311.48
New York City,Manhattan,7002032,001466,Mount Sinai West,70 or Older,112,F,White,Not Span/Hispanic,2,Elective,Home w/ Home Health Services,2020,MUS006,OSTEOARTHRITIS,MST007,HIP ARTHROPLASTY,301,HIP JOINT REPLACEMENT,08,DISEASES AND DISORDERS OF THE MUSCULOSKELETAL SYSTEM AND CONNECTIVE TISSUE,1,Minor,Minor,Surgical,Medicare,Blue Cross/Blue Shield,Self-Pay,,,N,60721.85,16047.62
Hudson Valley,Westchester,5901000,001039,NewYork-Presbyterian/Hudson Valley Hospital,50 to 69,105,M,White,Not Span/Hispanic,1,Elective,Home or Self Care,2020,MUS006,OSTEOARTHRITIS,MST007,HIP ARTHROPLASTY,301,HIP JOINT REPLACEMENT,08,DISEASES AND DISORDERS OF THE MUSCULOSKELETAL SYSTEM AND CONNECTIVE TISSUE,1,Minor,Minor,Surgical,Medicare,,,,,N,88126.17,18903.88
Hudson Valley,Westchester,5901000,001039,NewYork-Presbyterian/Hudson Valley Hospital,50 to 69,105,F,White,Not Span/Hispanic,1,Elective,Home or Self Care,2020,MUS006,OSTEOARTHRITIS,MST007,HIP ARTHROPLASTY,301,HIP JOINT REPLACEMENT,08,DISEASES AND DISORDERS OF THE MUSCULOSKELETAL SYSTEM AND CONNECTIVE TISSUE,2,Moderate,Minor,Surgical,Medicare,Private Health Insurance,,,,N,55819.46,13180.19
Hudson Valley,Westchester,5901000,001039,NewYork-Presbyterian/Hudson Valley Hospital,70 or Older,105,F,White,Not Span/Hispanic,2,Elective,Home w/ Home Health Services,2020,MUS006,OSTEOARTHRITIS,MST007,HIP ARTHROPLASTY,301,HIP JOINT REPLACEMENT,08,DISEASES AND DISORDERS OF THE MUSCULOSKELETAL SYSTEM AND CONNECTIVE TISSUE,1,Minor,Minor,Surgical,Medicare,,,,,N,107696.78,22498.45
Hudson Valley,Westchester,5901000,001039,NewYork-Presbyterian/Hudson Valley Hospital,50 to 69,126,F,White,Not Span/Hispanic,1,Elective,Home or Self Care,2020,INJ035,"COMPLICATION OF INTERNAL ORTHOPEDIC DEVICE OR IMPLANT, INITIAL ENCOUNTER",MST007,HIP ARTHROPLASTY,301,HIP JOINT REPLACEMENT,08,DISEASES AND DISORDERS OF THE MUSCULOSKELETAL SYSTEM AND CONNECTIVE TISSUE,1,Minor,Minor,Surgical,Blue Cross/Blue Shield,,,,,N,73381.76,15739.81
Hudson Valley,Westchester,5901000,001039,NewYork-Presbyterian/Hudson Valley Hospital,70 or Older,125,F,White,Not Span/Hispanic,2,Elective,Home w/ Home Health Services,2020,MUS006,OSTEOARTHRITIS,MST007,HIP ARTHROPLASTY,301,HIP JOINT REPLACEMENT,08,DISEASES AND DISORDERS OF THE MUSCULOSKELETAL SYSTEM AND CONNECTIVE TISSUE,2,Moderate,Minor,Surgical,Medicare,,,,,N,131653.91,26006.33
New York City,Manhattan,7002024,001456,Mount Sinai Hospital,50 to 69,OOS,M,White,Not Span/Hispanic,4,Elective,Home w/ Home Health Services,2020,INJ035,"COMPLICATION OF INTERNAL ORTHOPEDIC DEVICE OR IMPLANT, INITIAL ENCOUNTER",MST007,HIP ARTHROPLASTY,301,HIP JOINT REPLACEMENT,08,DISEASES AND DISORDERS OF THE MUSCULOSKELETAL SYSTEM AND CONNECTIVE TISSUE,2,Moderate,Minor,Surgical,Blue Cross/Blue Shield,Self-Pay,,,,N,116316.53,40902.07
New York City,Manhattan,7002024,001456,Mount Sinai Hospital,70 or Older,103,F,White,Not Span/Hispanic,3,Elective,Home w/ Home Health Services,2020,MUS006,OSTEOARTHRITIS,MST007,HIP ARTHROPLASTY,301,HIP JOINT REPLACEMENT,08,DISEASES AND DISORDERS OF THE MUSCULOSKELETAL SYSTEM AND CONNECTIVE TISSUE,2,Moderate,Moderate,Surgical,Medicare,Medicare,Self-Pay,,,N,77692.47,23295.53
New York City,Manhattan,7002024,001456,Mount Sinai Hospital,50 to 69,110,F,Other Race,Spanish/Hispanic,2,Elective,Home w/ Home Health Services,2020,MUS006,OSTEOARTHRITIS,MST007,HIP ARTHROPLASTY,301,HIP JOINT REPLACEMENT,08,DISEASES AND DISORDERS OF THE MUSCULOSKELETAL SYSTEM AND CONNECTIVE TISSUE,2,Moderate,Minor,Surgical,Private Health Insurance,Self-Pay,,,,N,51073.65,16186.6
New York City,Manhattan,7002024,001456,Mount Sinai Hospital,50 to 69,113,F,Other Race,Spanish/Hispanic,23,Urgent,Inpatient Rehabilitation Facility,2020,INJ006,"FRACTURE OF THE NECK OF THE FEMUR (HIP), INITIAL ENCOUNTER",MST007,HIP ARTHROPLASTY,301,HIP JOINT REPLACEMENT,08,DISEASES AND DISORDERS OF THE MUSCULOSKELETAL SYSTEM AND CONNECTIVE TISSUE,3,Major,Extreme,Surgical,Medicare,Self-Pay,,,,N,316404.14,82012.41
New York City,Manhattan,7002024,001456,Mount Sinai Hospital,50 to 69,104,F,White,Not Span/Hispanic,1,Elective,Home w/ Home Health Services,2020,MUS006,OSTEOARTHRITIS,MST007,HIP ARTHROPLASTY,301,HIP JOINT REPLACEMENT,08,DISEASES AND DISORDERS OF THE MUSCULOSKELETAL SYSTEM AND CONNECTIVE TISSUE,1,Minor,Minor,Surgical,Blue Cross/Blue Shield,Self-Pay,,,,N,41153.43,13315.76
New York City,Manhattan,7002024,001456,Mount Sinai Hospital,50 to 69,101,F,White,Not Span/Hispanic,3,Elective,Home w/ Home Health Services,2020,MUS006,OSTEOARTHRITIS,MST007,HIP ARTHROPLASTY,301,HIP JOINT REPLACEMENT,08,DISEASES AND DISORDERS OF THE MUSCULOSKELETAL SYSTEM AND CONNECTIVE TISSUE,4,Extreme,Extreme,Surgical,Blue Cross/Blue Shield,Self-Pay,,,,N,64134.11,19363.19
New York City,Bronx,7000006,001168,Montefiore Medical Center-Wakefield Hospital,30 to 49,104,M,Black/African American,Not Span/Hispanic,4,Elective,Home w/ Home Health Services,2020,MUS030,ASEPTIC NECROSIS AND OSTEONECROSIS,MST007,HIP ARTHROPLASTY,301,HIP JOINT REPLACEMENT,08,DISEASES AND DISORDERS OF THE MUSCULOSKELETAL SYSTEM AND CONNECTIVE TISSUE,2,Moderate,Minor,Surgical,Medicare,Medicaid,,,,N,118166.82,26886.41
New York City,Bronx,7000006,001168,Montefiore Medical Center-Wakefield Hospital,50 to 69,104,M,Other Race,Spanish/Hispanic,1,Elective,Home w/ Home Health Services,2020,MUS006,OSTEOARTHRITIS,MST007,HIP ARTHROPLASTY,301,HIP JOINT REPLACEMENT,08,DISEASES AND DISORDERS OF THE MUSCULOSKELETAL SYSTEM AND CONNECTIVE TISSUE,2,Moderate,Minor,Surgical,Private Health Insurance,,,,,N,70954.18,18632.04
New York City,Bronx,7000006,001168,Montefiore Medical Center-Wakefield Hospital,50 to 69,OOS,F,Other Race,Spanish/Hispanic,6,Emergency,Skilled Nursing Home,2020,MUS006,OSTEOARTHRITIS,MST007,HIP ARTHROPLASTY,301,HIP JOINT REPLACEMENT,08,DISEASES AND DISORDERS OF THE MUSCULOSKELETAL SYSTEM AND CONNECTIVE TISSUE,2,Moderate,Minor,Surgical,Private Health Insurance,,,,,N,126137.02,30491.17
New York City,Bronx,7000006,001168,Montefiore Medical Center-Wakefield Hospital,70 or Older,107,F,Other Race,Unknown,1,Elective,Home w/ Home Health Services,2020,MUS006,OSTEOARTHRITIS,MST007,HIP ARTHROPLASTY,301,HIP JOINT REPLACEMENT,08,DISEASES AND DISORDERS OF THE MUSCULOSKELETAL SYSTEM AND CONNECTIVE TISSUE,1,Minor,Moderate,Surgical,Medicare,Blue Cross/Blue Shield,,,,N,71054.89,19124.44
New York City,Bronx,7000006,001168,Montefiore Medical Center-Wakefield Hospital,70 or Older,107,F,Black/African American,Not Span/Hispanic,14,Elective,Skilled Nursing Home,2020,INJ035,"COMPLICATION OF INTERNAL ORTHOPEDIC DEVICE OR IMPLANT, INITIAL ENCOUNTER",MST007,HIP ARTHROPLASTY,301,HIP JOINT REPLACEMENT,08,DISEASES AND DISORDERS OF THE MUSCULOSKELETAL SYSTEM AND CONNECTIVE TISSUE,2,Moderate,Minor,Surgical,Medicare,Medicaid,,,,N,271233.15,70620.34
New York City,Bronx,7000006,001168,Montefiore Medical Center-Wakefield Hospital,70 or Older,104,F,Other Race,Spanish/Hispanic,5,Emergency,Home w/ Home Health Services,2020,INJ006,"FRACTURE OF THE NECK OF THE FEMUR (HIP), INITIAL ENCOUNTER",MST007,HIP ARTHROPLASTY,301,HIP JOINT REPLACEMENT,08,DISEASES AND DISORDERS OF THE MUSCULOSKELETAL SYSTEM AND CONNECTIVE TISSUE,2,Moderate,Moderate,Surgical,Medicare,Medicaid,,,,Y,133182.25,28614.4
New York City,Bronx,7000006,001168,Montefiore Medical Center-Wakefield Hospital,70 or Older,104,F,White,Not Span/Hispanic,9,Emergency,Medicaid Cert Nursing Facility,2020,INJ006,"FRACTURE OF THE NECK OF THE FEMUR (HIP), INITIAL ENCOUNTER",MST007,HIP ARTHROPLASTY,301,HIP JOINT REPLACEMENT,08,DISEASES AND DISORDERS OF THE MUSCULOSKELETAL SYSTEM AND CONNECTIVE TISSUE,2,Moderate,Extreme,Surgical,Medicare,Private Health Insurance,Medicaid,,,Y,184876.47,37275.7
New York City,Bronx,7000006,001168,Montefiore Medical Center-Wakefield Hospital,50 to 69,104,M,Other Race,Not Span/Hispanic,1,Elective,Home w/ Home Health Services,2020,MUS006,OSTEOARTHRITIS,MST007,HIP ARTHROPLASTY,301,HIP JOINT REPLACEMENT,08,DISEASES AND DISORDERS OF THE MUSCULOSKELETAL SYSTEM AND CONNECTIVE TISSUE,2,Moderate,Minor,Surgical,Medicare,,,,,N,80466,21274.52
New York City,Bronx,7000006,001168,Montefiore Medical Center-Wakefield Hospital,70 or Older,104,M,Other Race,Spanish/Hispanic,6,Emergency,Skilled Nursing Home,2020,INJ006,"FRACTURE OF THE NECK OF THE FEMUR (HIP), INITIAL ENCOUNTER",MST007,HIP ARTHROPLASTY,301,HIP JOINT REPLACEMENT,08,DISEASES AND DISORDERS OF THE MUSCULOSKELETAL SYSTEM AND CONNECTIVE TISSUE,1,Minor,Major,Surgical,Medicare,Medicaid,,,,Y,150288.09,31811.99
New York City,Bronx,7000006,001168,Montefiore Medical Center-Wakefield Hospital,70 or Older,104,M,Other Race,Unknown,3,Elective,Home w/ Home Health Services,2020,MUS006,OSTEOARTHRITIS,MST007,HIP ARTHROPLASTY,301,HIP JOINT REPLACEMENT,08,DISEASES AND DISORDERS OF THE MUSCULOSKELETAL SYSTEM AND CONNECTIVE TISSUE,3,Major,Major,Surgical,Medicare,,,,,N,111216.1,27718.29
New York City,Bronx,7000006,001168,Montefiore Medical Center-Wakefield Hospital,50 to 69,104,F,Black/African American,Not Span/Hispanic,3,Elective,Home w/ Home Health Services,2020,MUS006,OSTEOARTHRITIS,MST007,HIP ARTHROPLASTY,301,HIP JOINT REPLACEMENT,08,DISEASES AND DISORDERS OF THE MUSCULOSKELETAL SYSTEM AND CONNECTIVE TISSUE,2,Moderate,Moderate,Surgical,Medicare,,,,,N,109411.78,25579.2
New York City,Bronx,7000006,001168,Montefiore Medical Center-Wakefield Hospital,70 or Older,104,F,Other Race,Spanish/Hispanic,2,Emergency,Skilled Nursing Home,2020,MUS006,OSTEOARTHRITIS,MST007,HIP ARTHROPLASTY,301,HIP JOINT REPLACEMENT,08,DISEASES AND DISORDERS OF THE MUSCULOSKELETAL SYSTEM AND CONNECTIVE TISSUE,1,Minor,Minor,Surgical,Medicare,Medicare,,,,N,89758.49,23422.54
Hudson Valley,Westchester,5904001,001072,Montefiore New Rochelle Hospital,70 or Older,108,M,White,Not Span/Hispanic,10,Emergency,Home or Self Care,2020,INJ006,"FRACTURE OF THE NECK OF THE FEMUR (HIP), INITIAL ENCOUNTER",MST007,HIP ARTHROPLASTY,301,HIP JOINT REPLACEMENT,08,DISEASES AND DISORDERS OF THE MUSCULOSKELETAL SYSTEM AND CONNECTIVE TISSUE,2,Moderate,Major,Surgical,Blue Cross/Blue Shield,Medicare,Self-Pay,,,Y,110058.45,38781.38
Hudson Valley,Westchester,5904001,001072,Montefiore New Rochelle Hospital,70 or Older,107,M,Other Race,Unknown,2,Elective,Home w/ Home Health Services,2020,MUS006,OSTEOARTHRITIS,MST007,HIP ARTHROPLASTY,301,HIP JOINT REPLACEMENT,08,DISEASES AND DISORDERS OF THE MUSCULOSKELETAL SYSTEM AND CONNECTIVE TISSUE,1,Minor,Minor,Surgical,Medicare,Medicare,Blue Cross/Blue Shield,,,N,50269.26,20975.42
Hudson Valley,Westchester,5904001,001072,Montefiore New Rochelle Hospital,50 to 69,104,F,White,Unknown,3,Elective,Home or Self Care,2020,MUS006,OSTEOARTHRITIS,MST007,HIP ARTHROPLASTY,301,HIP JOINT REPLACEMENT,08,DISEASES AND DISORDERS OF THE MUSCULOSKELETAL SYSTEM AND CONNECTIVE TISSUE,2,Moderate,Minor,Surgical,Medicare,Medicare,Blue Cross/Blue Shield,,,N,55182.62,22080.54
Hudson Valley,Westchester,5904001,001072,Montefiore New Rochelle Hospital,50 to 69,105,F,White,Multi-ethnic,2,Elective,Home w/ Home Health Services,2020,MUS006,OSTEOARTHRITIS,MST007,HIP ARTHROPLASTY,301,HIP JOINT REPLACEMENT,08,DISEASES AND DISORDERS OF THE MUSCULOSKELETAL SYSTEM AND CONNECTIVE TISSUE,1,Minor,Minor,Surgical,Blue Cross/Blue Shield,Self-Pay,,,,N,53800.46,23866.68
Hudson Valley,Westchester,5904001,001072,Montefiore New Rochelle Hospital,70 or Older,,F,Other Race,Spanish/Hispanic,2,Elective,Home w/ Home Health Services,2020,MUS006,OSTEOARTHRITIS,MST007,HIP ARTHROPLASTY,301,HIP JOINT REPLACEMENT,08,DISEASES AND DISORDERS OF THE MUSCULOSKELETAL SYSTEM AND CONNECTIVE TISSUE,1,Minor,Minor,Surgical,Medicare,Medicare,Blue Cross/Blue Shield,,,N,47728.6,19905.15
Hudson Valley,Westchester,5904001,001072,Montefiore New Rochelle Hospital,50 to 69,108,F,White,Unknown,3,Elective,Home w/ Home Health Services,2020,MUS006,OSTEOARTHRITIS,MST007,HIP ARTHROPLASTY,301,HIP JOINT REPLACEMENT,08,DISEASES AND DISORDERS OF THE MUSCULOSKELETAL SYSTEM AND CONNECTIVE TISSUE,1,Minor,Minor,Surgical,Blue Cross/Blue Shield,Self-Pay,,,,N,52818.38,21391.94
New York City,Manhattan,7002012,001447,Hospital for Special Surgery,50 to 69,115,F,White,Not Span/Hispanic,1,Elective,Home w/ Home Health Services,2020,MUS006,OSTEOARTHRITIS,MST007,HIP ARTHROPLASTY,301,HIP JOINT REPLACEMENT,08,DISEASES AND DISORDERS OF THE MUSCULOSKELETAL SYSTEM AND CONNECTIVE TISSUE,1,Minor,Moderate,Surgical,Private Health Insurance,,,,,N,69475,24802.42
New York City,Manhattan,7002012,001447,Hospital for Special Surgery,50 to 69,117,F,White,Not Span/Hispanic,2,Elective,Home w/ Home Health Services,2020,MUS006,OSTEOARTHRITIS,MST007,HIP ARTHROPLASTY,301,HIP JOINT REPLACEMENT,08,DISEASES AND DISORDERS OF THE MUSCULOSKELETAL SYSTEM AND CONNECTIVE TISSUE,2,Moderate,Minor,Surgical,Medicare,Private Health Insurance,,,,N,73049,28039.76
New York City,Manhattan,7002012,001447,Hospital for Special Surgery,70 or Older,OOS,F,White,Not Span/Hispanic,2,Elective,Home or Self Care,2020,MUS006,OSTEOARTHRITIS,MST007,HIP ARTHROPLASTY,301,HIP JOINT REPLACEMENT,08,DISEASES AND DISORDERS OF THE MUSCULOSKELETAL SYSTEM AND CONNECTIVE TISSUE,2,Moderate,Minor,Surgical,Medicare,Private Health Insurance,,,,N,79660,30069.94
New York City,Manhattan,7002012,001447,Hospital for Special Surgery,50 to 69,105,M,White,Not Span/Hispanic,1,Elective,Home w/ Home Health Services,2020,MUS006,OSTEOARTHRITIS,MST007,HIP ARTHROPLASTY,301,HIP JOINT REPLACEMENT,08,DISEASES AND DISORDERS OF THE MUSCULOSKELETAL SYSTEM AND CONNECTIVE TISSUE,1,Minor,Moderate,Surgical,Blue Cross/Blue Shield,,,,,N,72978,26106.6