Hospital Service Area,Hospital County,Operating Certificate Number,Permanent Facility Id,Facility Name,Age Group,Zip Code - 3 digits,Gender,Race,Ethnicity,Length of Stay,Type of Admission,Patient Disposition,Discharge Year,CCS Diagnosis Code,CCS Diagnosis Description,CCS Procedure Code,CCS Procedure Description,APR DRG Code,APR DRG Description,APR MDC Code,APR MDC Description,APR Severity of Illness Code,APR Severity of Illness Description,APR Risk of Mortality,APR Medical Surgical Description,Payment Typology 1,Payment Typology 2,Payment Typology 3,Birth Weight,Abortion Edit Indicator,Emergency Department Indicator,Total Charges,Total Costs
New York City,Manhattan,7002053,001463,NYU Langone Hospitals,70 or Older,112,F,White,Not Span/Hispanic,3,Elective,Skilled Nursing Home,2017,203,Osteoarthritis,152,ARTHROPLASTY KNEE,302,Knee joint replacement,08,Diseases and Disorders of the Musculoskeletal System and Conn Tissue,2,Moderate,Moderate,Surgical,Medicare,,,,N,N,116452.32,24485.89
New York City,Manhattan,7002053,001463,NYU Langone Hospitals,50 to 69,100,F,Other Race,Spanish/Hispanic,3,Elective,Home w/ Home Health Services,2017,203,Osteoarthritis,152,ARTHROPLASTY KNEE,302,Knee joint replacement,08,Diseases and Disorders of the Musculoskeletal System and Conn Tissue,1,Minor,Minor,Surgical,Medicaid,,,,N,N,137592.11,33117.07
New York City,Manhattan,7002053,001463,NYU Langone Hospitals,70 or Older,OOS,F,White,Not Span/Hispanic,8,Emergency,Home w/ Home Health Services,2017,237,Complication of device; implant or graft,162,OT OR THER PRC ON JOINT,302,Knee joint replacement,08,Diseases and Disorders of the Musculoskeletal System and Conn Tissue,3,Major,Moderate,Surgical,Private Health Insurance,,,,N,Y,193083.71,63669.30
New York City,Manhattan,7002053,001463,NYU Langone Hospitals,50 to 69,117,F,White,Not Span/Hispanic,2,Elective,Home w/ Home Health Services,2017,203,Osteoarthritis,152,ARTHROPLASTY KNEE,302,Knee joint replacement,08,Diseases and Disorders of the Musculoskeletal System and Conn Tissue,1,Minor,Minor,Surgical,Medicare,,,,N,N,85525.97,19188.42
New York City,Manhattan,7002053,001463,NYU Langone Hospitals,50 to 69,115,M,White,Not Span/Hispanic,3,Elective,Home w/ Home Health Services,2017,203,Osteoarthritis,152,ARTHROPLASTY KNEE,302,Knee joint replacement,08,Diseases and Disorders of the Musculoskeletal System and Conn Tissue,1,Minor,Minor,Surgical,Medicare,,,,N,N,114055.55,28246.91
New York City,Manhattan,7002053,001463,NYU Langone Hospitals,50 to 69,100,F,Other Race,Spanish/Hispanic,2,Elective,Home w/ Home Health Services,2017,203,Osteoarthritis,152,ARTHROPLASTY KNEE,302,Knee joint replacement,08,Diseases and Disorders of the Musculoskeletal System and Conn Tissue,1,Minor,Minor,Surgical,Medicaid,,,,N,N,109644.82,23541.34
New York City,Manhattan,7002053,001463,NYU Langone Hospitals,50 to 69,112,F,Other Race,Not Span/Hispanic,2,Elective,Home w/ Home Health Services,2017,203,Osteoarthritis,152,ARTHROPLASTY KNEE,302,Knee joint replacement,08,Diseases and Disorders of the Musculoskeletal System and Conn Tissue,2,Moderate,Minor,Surgical,Medicare,,,,N,N,86080.44,19818.85
New York City,Manhattan,7002053,001463,NYU Langone Hospitals,30 to 49,,M,Other Race,Spanish/Hispanic,3,Emergency,Home or Self Care,2017,237,Complication of device; implant or graft,175,OT OR THER PRC SKN/BRST,302,Knee joint replacement,08,Diseases and Disorders of the Musculoskeletal System and Conn Tissue,2,Moderate,Moderate,Surgical,Medicaid,,,,N,Y,137758.54,39912.22
New York City,Manhattan,7002053,001463,NYU Langone Hospitals,50 to 69,100,F,Black/African American,Not Span/Hispanic,14,Elective,Skilled Nursing Home,2017,203,Osteoarthritis,152,ARTHROPLASTY KNEE,302,Knee joint replacement,08,Diseases and Disorders of the Musculoskeletal System and Conn Tissue,3,Major,Major,Surgical,Private Health Insurance,,,,N,N,453339.18,151085.37
New York City,Manhattan,7002053,001463,NYU Langone Hospitals,50 to 69,,M,White,Not Span/Hispanic,2,Elective,Home w/ Home Health Services,2017,237,Complication of device; implant or graft,152,ARTHROPLASTY KNEE,302,Knee joint replacement,08,Diseases and Disorders of the Musculoskeletal System and Conn Tissue,2,Moderate,Minor,Surgical,Medicare,,,,N,N,197047.28,40542.85
New York City,Manhattan,7002053,001463,NYU Langone Hospitals,50 to 69,113,M,Other Race,Spanish/Hispanic,4,Elective,Home w/ Home Health Services,2017,237,Complication of device; implant or graft,162,OT OR THER PRC ON JOINT,302,Knee joint replacement,08,Diseases and Disorders of the Musculoskeletal System and Conn Tissue,3,Major,Major,Surgical,Medicare,,,,N,N,167429.28,45967.40
New York City,Manhattan,7002053,001463,NYU Langone Hospitals,70 or Older,100,M,White,Not Span/Hispanic,5,Emergency,Home w/ Home Health Services,2017,237,Complication of device; implant or graft,152,ARTHROPLASTY KNEE,302,Knee joint replacement,08,Diseases and Disorders of the Musculoskeletal System and Conn Tissue,2,Moderate,Moderate,Surgical,Medicare,,,,N,Y,180796.04,52160.34
New York City,Manhattan,7002053,001463,NYU Langone Hospitals,70 or Older,112,M,Other Race,Not Span/Hispanic,2,Elective,Home w/ Home Health Services,2017,203,Osteoarthritis,152,ARTHROPLASTY KNEE,302,Knee joint replacement,08,Diseases and Disorders of the Musculoskeletal System and Conn Tissue,1,Minor,Minor,Surgical,Medicaid,,,,N,N,86842.09,22330.00
New York City,Manhattan,7002053,001463,NYU Langone Hospitals,50 to 69,OOS,F,White,Not Span/Hispanic,2,Elective,Home w/ Home Health Services,2017,203,Osteoarthritis,152,ARTHROPLASTY KNEE,302,Knee joint replacement,08,Diseases and Disorders of the Musculoskeletal System and Conn Tissue,2,Moderate,Moderate,Surgical,Medicare,,,,N,N,137926.13,28922.55
New York City,Manhattan,7002053,001463,NYU Langone Hospitals,50 to 69,116,M,White,Not Span/Hispanic,5,Elective,Home w/ Home Health Services,2017,203,Osteoarthritis,152,ARTHROPLASTY KNEE,302,Knee joint replacement,08,Diseases and Disorders of the Musculoskeletal System and Conn Tissue,1,Minor,Minor,Surgical,Private Health Insurance,,,,N,N,106456.03,30098.73
New York City,Manhattan,7002053,001463,NYU Langone Hospitals,50 to 69,113,M,Other Race,Not Span/Hispanic,3,Elective,Home w/ Home Health Services,2017,203,Osteoarthritis,152,ARTHROPLASTY KNEE,302,Knee joint replacement,08,Diseases and Disorders of the Musculoskeletal System and Conn Tissue,1,Minor,Minor,Surgical,Medicaid,,,,N,N,252419.00,52044.34
New York City,Manhattan,7002053,001463,NYU Langone Hospitals,50 to 69,100,F,White,Not Span/Hispanic,2,Elective,Home w/ Home Health Services,2017,203,Osteoarthritis,152,ARTHROPLASTY KNEE,302,Knee joint replacement,08,Diseases and Disorders of the Musculoskeletal System and Conn Tissue,1,Minor,Minor,Surgical,Private Health Insurance,,,,N,N,164907.66,33956.31
New York City,Manhattan,7002053,001463,NYU Langone Hospitals,50 to 69,112,M,White,Not Span/Hispanic,2,Elective,Home or Self Care,2017,203,Osteoarthritis,152,ARTHROPLASTY KNEE,302,Knee joint replacement,08,Diseases and Disorders of the Musculoskeletal System and Conn Tissue,1,Minor,Minor,Surgical,Blue Cross/Blue Shield,,,,N,N,98086.45,24288.74
New York City,Manhattan,7002053,001463,NYU Langone Hospitals,50 to 69,104,M,Other Race,Not Span/Hispanic,2,Elective,Home w/ Home Health Services,2017,203,Osteoarthritis,152,ARTHROPLASTY KNEE,302,Knee joint replacement,08,Diseases and Disorders of the Musculoskeletal System and Conn Tissue,1,Minor,Minor,Surgical,Medicare,,,,N,N,84279.48,19170.94
New York City,Manhattan,7002053,001463,NYU Langone Hospitals,70 or Older,114,M,Other Race,Spanish/Hispanic,7,Elective,Skilled Nursing Home,2017,203,Osteoarthritis,152,ARTHROPLASTY KNEE,302,Knee joint replacement,08,Diseases and Disorders of the Musculoskeletal System and Conn Tissue,2,Moderate,Moderate,Surgical,Medicaid,,,,N,N,202343.27,60772.29
New York City,Manhattan,7002053,001463,NYU Langone Hospitals,50 to 69,111,F,Other Race,Spanish/Hispanic,1,Elective,Home w/ Home Health Services,2017,203,Osteoarthritis,152,ARTHROPLASTY KNEE,302,Knee joint replacement,08,Diseases and Disorders of the Musculoskeletal System and Conn Tissue,2,Moderate,Moderate,Surgical,Medicaid,,,,N,N,105404.54,23353.19
New York City,Manhattan,7002053,001463,NYU Langone Hospitals,50 to 69,113,F,White,Not Span/Hispanic,1,Elective,Home w/ Home Health Services,2017,203,Osteoarthritis,152,ARTHROPLASTY KNEE,302,Knee joint replacement,08,Diseases and Disorders of the Musculoskeletal System and Conn Tissue,2,Moderate,Minor,Surgical,Medicare,,,,N,N,73100.34,15268.81
New York City,Manhattan,7002053,001463,NYU Langone Hospitals,70 or Older,112,F,Other Race,Not Span/Hispanic,3,Elective,Skilled Nursing Home,2017,203,Osteoarthritis,152,ARTHROPLASTY KNEE,302,Knee joint replacement,08,Diseases and Disorders of the Musculoskeletal System and Conn Tissue,2,Moderate,Minor,Surgical,Medicaid,,,,N,N,145258.33,31996.19
New York City,Manhattan,7002053,001463,NYU Langone Hospitals,50 to 69,111,F,Black/African American,Not Span/Hispanic,1,Elective,Home w/ Home Health Services,2017,203,Osteoarthritis,152,ARTHROPLASTY KNEE,302,Knee joint replacement,08,Diseases and Disorders of the Musculoskeletal System and Conn Tissue,1,Minor,Minor,Surgical,Blue Cross/Blue Shield,,,,N,N,110230.87,24140.22
New York City,Manhattan,7002053,001463,NYU Langone Hospitals,70 or Older,112,M,White,Not Span/Hispanic,3,Elective,Skilled Nursing Home,2017,237,Complication of device; implant or graft,162,OT OR THER PRC ON JOINT,302,Knee joint replacement,08,Diseases and Disorders of the Musculoskeletal System and Conn Tissue,2,Moderate,Major,Surgical,Medicaid,,,,N,N,80357.14,18790.75
New York City,Manhattan,7002053,001463,NYU Langone Hospitals,70 or Older,OOS,M,White,Not Span/Hispanic,3,Elective,Skilled Nursing Home,2017,209,Other acquired deformities,152,ARTHROPLASTY KNEE,302,Knee joint replacement,08,Diseases and Disorders of the Musculoskeletal System and Conn Tissue,2,Moderate,Minor,Surgical,Medicare,,,,N,N,146121.14,38168.48
New York City,Manhattan,7002053,001463,NYU Langone Hospitals,70 or Older,112,M,Black/African American,Not Span/Hispanic,2,Elective,Skilled Nursing Home,2017,203,Osteoarthritis,152,ARTHROPLASTY KNEE,302,Knee joint replacement,08,Diseases and Disorders of the Musculoskeletal System and Conn Tissue,2,Moderate,Minor,Surgical,Medicare,,,,N,N,91469.07,23084.79
New York City,Manhattan,7002053,001463,NYU Langone Hospitals,50 to 69,112,F,White,Not Span/Hispanic,3,Elective,Skilled Nursing Home,2017,203,Osteoarthritis,152,ARTHROPLASTY KNEE,302,Knee joint replacement,08,Diseases and Disorders of the Musculoskeletal System and Conn Tissue,2,Moderate,Minor,Surgical,Medicare,,,,N,N,120784.53,30330.64
New York City,Manhattan,7002053,001463,NYU Langone Hospitals,50 to 69,112,M,White,Not Span/Hispanic,10,Emergency,Skilled Nursing Home,2017,237,Complication of device; implant or graft,152,ARTHROPLASTY KNEE,302,Knee joint replacement,08,Diseases and Disorders of the Musculoskeletal System and Conn Tissue,4,Extreme,Extreme,Surgical,Medicare,,,,N,Y,223448.86,81061.43
New York City,Manhattan,7002053,001463,NYU Langone Hospitals,50 to 69,112,F,Other Race,Not Span/Hispanic,1,Elective,Home or Self Care,2017,203,Osteoarthritis,152,ARTHROPLASTY KNEE,302,Knee joint replacement,08,Diseases and Disorders of the Musculoskeletal System and Conn Tissue,2,Moderate,Minor,Surgical,Medicaid,,,,N,N,99311.23,22089.15
New York City,Manhattan,7002053,001463,NYU Langone Hospitals,50 to 69,100,M,Other Race,Spanish/Hispanic,3,Elective,Skilled Nursing Home,2017,203,Osteoarthritis,152,ARTHROPLASTY KNEE,302,Knee joint replacement,08,Diseases and Disorders of the Musculoskeletal System and Conn Tissue,2,Moderate,Minor,Surgical,Private Health Insurance,,,,N,N,101051.83,24318.54
New York City,Manhattan,7002053,001463,NYU Langone Hospitals,30 to 49,112,F,Other Race,Not Span/Hispanic,1,Elective,Home w/ Home Health Services,2017,202,Rheumatoid arthritis and related disease,152,ARTHROPLASTY KNEE,302,Knee joint replacement,08,Diseases and Disorders of the Musculoskeletal System and Conn Tissue,2,Moderate,Minor,Surgical,Medicaid,,,,N,N,97077.24,19477.85
New York City,Manhattan,7002053,001463,NYU Langone Hospitals,50 to 69,100,F,Other Race,Spanish/Hispanic,4,Elective,Home w/ Home Health Services,2017,237,Complication of device; implant or graft,162,OT OR THER PRC ON JOINT,302,Knee joint replacement,08,Diseases and Disorders of the Musculoskeletal System and Conn Tissue,2,Moderate,Moderate,Surgical,Medicaid,,,,N,N,247100.78,54425.71
New York City,Manhattan,7002053,001463,NYU Langone Hospitals,50 to 69,,F,Other Race,Spanish/Hispanic,3,Elective,Skilled Nursing Home,2017,203,Osteoarthritis,152,ARTHROPLASTY KNEE,302,Knee joint replacement,08,Diseases and Disorders of the Musculoskeletal System and Conn Tissue,3,Major,Moderate,Surgical,Medicare,,,,N,N,117489.42,27661.46
New York City,Manhattan,7002053,001463,NYU Langone Hospitals,50 to 69,111,M,White,Not Span/Hispanic,1,Elective,Home w/ Home Health Services,2017,203,Osteoarthritis,152,ARTHROPLASTY KNEE,302,Knee joint replacement,08,Diseases and Disorders of the Musculoskeletal System and Conn Tissue,2,Moderate,Minor,Surgical,Private Health Insurance,,,,N,N,93873.00,19018.12
New York City,Manhattan,7002053,001463,NYU Langone Hospitals,50 to 69,111,F,White,Not Span/Hispanic,7,Emergency,Skilled Nursing Home,2017,237,Complication of device; implant or graft,162,OT OR THER PRC ON JOINT,302,Knee joint replacement,08,Diseases and Disorders of the Musculoskeletal System and Conn Tissue,2,Moderate,Minor,Surgical,Medicare,,,,N,Y,129499.97,36749.54
New York City,Manhattan,7002053,001463,NYU Langone Hospitals,70 or Older,104,F,Black/African American,Not Span/Hispanic,2,Elective,Skilled Nursing Home,2017,203,Osteoarthritis,152,ARTHROPLASTY KNEE,302,Knee joint replacement,08,Diseases and Disorders of the Musculoskeletal System and Conn Tissue,3,Major,Moderate,Surgical,Medicare,,,,N,N,103541.97,25868.71
New York City,Manhattan,7002053,001463,NYU Langone Hospitals,50 to 69,116,F,White,Not Span/Hispanic,2,Elective,Home w/ Home Health Services,2017,203,Osteoarthritis,152,ARTHROPLASTY KNEE,302,Knee joint replacement,08,Diseases and Disorders of the Musculoskeletal System and Conn Tissue,2,Moderate,Minor,Surgical,Private Health Insurance,,,,N,N,93033.04,20794.52
New York City,Manhattan,7002053,001463,NYU Langone Hospitals,50 to 69,110,F,Multi-racial,Spanish/Hispanic,13,Emergency,Home w/ Home Health Services,2017,237,Complication of device; implant or graft,152,ARTHROPLASTY KNEE,302,Knee joint replacement,08,Diseases and Disorders of the Musculoskeletal System and Conn Tissue,3,Major,Moderate,Surgical,Private Health Insurance,,,,N,Y,234203.02,71244.82
New York City,Manhattan,7002053,001463,NYU Langone Hospitals,70 or Older,112,M,White,Not Span/Hispanic,3,Elective,Home w/ Home Health Services,2017,203,Osteoarthritis,152,ARTHROPLASTY KNEE,302,Knee joint replacement,08,Diseases and Disorders of the Musculoskeletal System and Conn Tissue,2,Moderate,Moderate,Surgical,Medicare,,,,N,N,104116.16,25006.11
New York City,Manhattan,7002053,001463,NYU Langone Hospitals,50 to 69,112,M,White,Not Span/Hispanic,2,Elective,Home w/ Home Health Services,2017,203,Osteoarthritis,152,ARTHROPLASTY KNEE,302,Knee joint replacement,08,Diseases and Disorders of the Musculoskeletal System and Conn Tissue,1,Minor,Minor,Surgical,Medicaid,,,,N,N,90370.66,20614.57
New York City,Manhattan,7002053,001463,NYU Langone Hospitals,50 to 69,112,M,White,Not Span/Hispanic,1,Elective,Home w/ Home Health Services,2017,203,Osteoarthritis,152,ARTHROPLASTY KNEE,302,Knee joint replacement,08,Diseases and Disorders of the Musculoskeletal System and Conn Tissue,1,Minor,Minor,Surgical,Medicare,,,,N,N,82679.04,19280.70
New York City,Manhattan,7002053,001463,NYU Langone Hospitals,70 or Older,113,F,Other Race,Not Span/Hispanic,2,Elective,Skilled Nursing Home,2017,203,Osteoarthritis,152,ARTHROPLASTY KNEE,302,Knee joint replacement,08,Diseases and Disorders of the Musculoskeletal System and Conn Tissue,1,Minor,Minor,Surgical,Private Health Insurance,,,,N,N,95667.40,21473.65
New York City,Manhattan,7002053,001463,NYU Langone Hospitals,70 or Older,100,M,White,Not Span/Hispanic,3,Emergency,Home w/ Home Health Services,2017,237,Complication of device; implant or graft,162,OT OR THER PRC ON JOINT,302,Knee joint replacement,08,Diseases and Disorders of the Musculoskeletal System and Conn Tissue,3,Major,Major,Surgical,Private Health Insurance,,,,N,Y,117988.65,31839.96
New York City,Manhattan,7002053,001463,NYU Langone Hospitals,50 to 69,103,M,Other Race,Spanish/Hispanic,1,Elective,Home w/ Home Health Services,2017,203,Osteoarthritis,152,ARTHROPLASTY KNEE,302,Knee joint replacement,08,Diseases and Disorders of the Musculoskeletal System and Conn Tissue,2,Moderate,Moderate,Surgical,Medicare,,,,N,N,107586.20,23587.65
New York City,Manhattan,7002053,001463,NYU Langone Hospitals,50 to 69,112,F,White,Unknown,8,Elective,Skilled Nursing Home,2017,203,Osteoarthritis,152,ARTHROPLASTY KNEE,302,Knee joint replacement,08,Diseases and Disorders of the Musculoskeletal System and Conn Tissue,2,Moderate,Minor,Surgical,Medicaid,,,,N,N,204552.47,58038.71
New York City,Manhattan,7002053,001463,NYU Langone Hospitals,70 or Older,112,F,White,Not Span/Hispanic,2,Elective,Skilled Nursing Home,2017,203,Osteoarthritis,152,ARTHROPLASTY KNEE,302,Knee joint replacement,08,Diseases and Disorders of the Musculoskeletal System and Conn Tissue,2,Moderate,Minor,Surgical,Medicare,,,,N,N,119859.70,28738.04
New York City,Manhattan,7002053,001463,NYU Langone Hospitals,50 to 69,112,M,Black/African American,Not Span/Hispanic,2,Elective,Home w/ Home Health Services,2017,203,Osteoarthritis,152,ARTHROPLASTY KNEE,302,Knee joint replacement,08,Diseases and Disorders of the Musculoskeletal System and Conn Tissue,1,Minor,Minor,Surgical,Medicaid,,,,N,N,98940.27,22289.83
New York City,Manhattan,7002053,001463,NYU Langone Hospitals,50 to 69,114,F,Black/African American,Not Span/Hispanic,1,Elective,Home w/ Home Health Services,2017,203,Osteoarthritis,152,ARTHROPLASTY KNEE,302,Knee joint replacement,08,Diseases and Disorders of the Musculoskeletal System and Conn Tissue,2,Moderate,Minor,Surgical,Medicare,,,,N,N,80578.80,16506.45
New York City,Manhattan,7002053,001463,NYU Langone Hospitals,50 to 69,100,M,White,Not Span/Hispanic,2,Elective,Home w/ Home Health Services,2017,203,Osteoarthritis,152,ARTHROPLASTY KNEE,302,Knee joint replacement,08,Diseases and Disorders of the Musculoskeletal System and Conn Tissue,1,Minor,Minor,Surgical,Medicare,,,,N,N,105339.03,23408.14
New York City,Manhattan,7002053,001463,NYU Langone Hospitals,50 to 69,103,M,White,Not Span/Hispanic,7,Elective,Inpatient Rehabilitation Facility,2017,203,Osteoarthritis,152,ARTHROPLASTY KNEE,302,Knee joint replacement,08,Diseases and Disorders of the Musculoskeletal System and Conn Tissue,3,Major,Moderate,Surgical,Medicare,,,,N,N,320164.13,81835.91
New York City,Manhattan,7002053,001463,NYU Langone Hospitals,70 or Older,OOS,M,White,Not Span/Hispanic,3,Elective,Home w/ Home Health Services,2017,237,Complication of device; implant or graft,152,ARTHROPLASTY KNEE,302,Knee joint replacement,08,Diseases and Disorders of the Musculoskeletal System and Conn Tissue,2,Moderate,Moderate,Surgical,Medicare,,,,N,N,169731.07,37679.92
