Hospital Service Area,Hospital County,Operating Certificate Number,Permanent Facility Id,Facility Name,Age Group,Zip Code - 3 digits,Gender,Race,Ethnicity,Length of Stay,Type of Admission,Patient Disposition,Discharge Year,CCS Diagnosis Code,CCS Diagnosis Description,CCS Procedure Code,CCS Procedure Description,APR DRG Code,APR DRG Description,APR MDC Code,APR MDC Description,APR Severity of Illness Code,APR Severity of Illness Description,APR Risk of Mortality,APR Medical Surgical Description,Payment Typology 1,Payment Typology 2,Payment Typology 3,Birth Weight,Abortion Edit Indicator,Emergency Department Indicator,Total Charges,Total Costs
Long Island,Nassau,2908000,000511,NYU Winthrop Hospital,70 or Older,117,F,White,Not Span/Hispanic,2,Elective,Home w/ Home Health Services,2017,203,Osteoarthritis,152,ARTHROPLASTY KNEE,302,Knee joint replacement,08,Diseases and Disorders of the Musculoskeletal System and Conn Tissue,2,Moderate,Minor,Surgical,Medicare,Medicare,,,N,N,90033.18,25057.94
Long Island,Nassau,2908000,000511,NYU Winthrop Hospital,70 or Older,115,F,White,Not Span/Hispanic,2,Elective,Home w/ Home Health Services,2017,203,Osteoarthritis,152,ARTHROPLASTY KNEE,302,Knee joint replacement,08,Diseases and Disorders of the Musculoskeletal System and Conn Tissue,2,Moderate,Minor,Surgical,Medicare,Medicare,Private Health Insurance,,N,N,69572.34,19769.04
Long Island,Nassau,2908000,000511,NYU Winthrop Hospital,50 to 69,117,M,White,Not Span/Hispanic,3,Elective,Home w/ Home Health Services,2017,203,Osteoarthritis,152,ARTHROPLASTY KNEE,302,Knee joint replacement,08,Diseases and Disorders of the Musculoskeletal System and Conn Tissue,1,Minor,Minor,Surgical,Private Health Insurance,,,,N,N,75319.16,21265.98
Long Island,Nassau,2908000,000511,NYU Winthrop Hospital,70 or Older,115,F,Black/African American,Not Span/Hispanic,3,Elective,Home w/ Home Health Services,2017,203,Osteoarthritis,152,ARTHROPLASTY KNEE,302,Knee joint replacement,08,Diseases and Disorders of the Musculoskeletal System and Conn Tissue,2,Moderate,Major,Surgical,Medicare,Medicare,,,N,N,85221.05,22577.24
Long Island,Nassau,2908000,000511,NYU Winthrop Hospital,50 to 69,110,F,White,Not Span/Hispanic,2,Elective,Home w/ Home Health Services,2017,203,Osteoarthritis,152,ARTHROPLASTY KNEE,302,Knee joint replacement,08,Diseases and Disorders of the Musculoskeletal System and Conn Tissue,2,Moderate,Minor,Surgical,Blue Cross/Blue Shield,,,,N,N,71348.16,20482.39
Long Island,Nassau,2908000,000511,NYU Winthrop Hospital,50 to 69,115,M,White,Not Span/Hispanic,2,Elective,Home w/ Home Health Services,2017,203,Osteoarthritis,152,ARTHROPLASTY KNEE,302,Knee joint replacement,08,Diseases and Disorders of the Musculoskeletal System and Conn Tissue,1,Minor,Minor,Surgical,Blue Cross/Blue Shield,,,,N,N,66376.25,18679.48
Long Island,Nassau,2908000,000511,NYU Winthrop Hospital,70 or Older,117,F,White,Not Span/Hispanic,2,Elective,Home w/ Home Health Services,2017,203,Osteoarthritis,152,ARTHROPLASTY KNEE,302,Knee joint replacement,08,Diseases and Disorders of the Musculoskeletal System and Conn Tissue,2,Moderate,Minor,Surgical,Private Health Insurance,Medicare,,,N,N,66369.97,18827.30
Long Island,Nassau,2908000,000511,NYU Winthrop Hospital,50 to 69,115,F,White,Not Span/Hispanic,2,Elective,Home w/ Home Health Services,2017,202,Rheumatoid arthritis and related disease,152,ARTHROPLASTY KNEE,302,Knee joint replacement,08,Diseases and Disorders of the Musculoskeletal System and Conn Tissue,2,Moderate,Minor,Surgical,Private Health Insurance,,,,N,N,69020.88,19494.63
Long Island,Nassau,2908000,000511,NYU Winthrop Hospital,50 to 69,110,M,White,Not Span/Hispanic,3,Elective,Home w/ Home Health Services,2017,203,Osteoarthritis,152,ARTHROPLASTY KNEE,302,Knee joint replacement,08,Diseases and Disorders of the Musculoskeletal System and Conn Tissue,1,Minor,Minor,Surgical,Blue Cross/Blue Shield,,,,N,N,69951.59,19873.96
Long Island,Nassau,2908000,000511,NYU Winthrop Hospital,50 to 69,115,F,White,Not Span/Hispanic,3,Elective,Home w/ Home Health Services,2017,203,Osteoarthritis,152,ARTHROPLASTY KNEE,302,Knee joint replacement,08,Diseases and Disorders of the Musculoskeletal System and Conn Tissue,1,Minor,Minor,Surgical,Medicare,Medicare,Private Health Insurance,,N,N,77491.82,20263.93
Long Island,Nassau,2908000,000511,NYU Winthrop Hospital,70 or Older,110,F,White,Not Span/Hispanic,3,Elective,Skilled Nursing Home,2017,202,Rheumatoid arthritis and related disease,152,ARTHROPLASTY KNEE,302,Knee joint replacement,08,Diseases and Disorders of the Musculoskeletal System and Conn Tissue,3,Major,Moderate,Surgical,Medicare,Medicare,Private Health Insurance,,N,N,77972.26,21828.95
Long Island,Nassau,2908000,000511,NYU Winthrop Hospital,70 or Older,117,F,White,Not Span/Hispanic,2,Elective,Home w/ Home Health Services,2017,203,Osteoarthritis,152,ARTHROPLASTY KNEE,302,Knee joint replacement,08,Diseases and Disorders of the Musculoskeletal System and Conn Tissue,1,Minor,Minor,Surgical,Medicare,Medicare,Blue Cross/Blue Shield,,N,N,67379.20,19065.44
Long Island,Nassau,2908000,000511,NYU Winthrop Hospital,30 to 49,117,F,White,Not Span/Hispanic,2,Elective,Home w/ Home Health Services,2017,203,Osteoarthritis,152,ARTHROPLASTY KNEE,302,Knee joint replacement,08,Diseases and Disorders of the Musculoskeletal System and Conn Tissue,1,Minor,Minor,Surgical,Blue Cross/Blue Shield,,,,N,N,67506.83,18945.78
Long Island,Nassau,2908000,000511,NYU Winthrop Hospital,70 or Older,115,F,White,Not Span/Hispanic,2,Elective,Home w/ Home Health Services,2017,203,Osteoarthritis,152,ARTHROPLASTY KNEE,302,Knee joint replacement,08,Diseases and Disorders of the Musculoskeletal System and Conn Tissue,1,Minor,Minor,Surgical,Medicare,Medicare,Private Health Insurance,,N,N,67100.60,18950.65
Long Island,Nassau,2908000,000511,NYU Winthrop Hospital,70 or Older,117,F,White,Not Span/Hispanic,2,Elective,Skilled Nursing Home,2017,203,Osteoarthritis,152,ARTHROPLASTY KNEE,302,Knee joint replacement,08,Diseases and Disorders of the Musculoskeletal System and Conn Tissue,2,Moderate,Moderate,Surgical,Medicare,Medicare,Private Health Insurance,,N,N,105399.73,28994.28
Long Island,Nassau,2908000,000511,NYU Winthrop Hospital,70 or Older,115,F,White,Not Span/Hispanic,4,Elective,Home w/ Home Health Services,2017,203,Osteoarthritis,152,ARTHROPLASTY KNEE,302,Knee joint replacement,08,Diseases and Disorders of the Musculoskeletal System and Conn Tissue,2,Moderate,Moderate,Surgical,Medicare,Medicare,Private Health Insurance,,N,N,124382.19,34197.70
Long Island,Nassau,2908000,000511,NYU Winthrop Hospital,70 or Older,117,F,White,Not Span/Hispanic,3,Elective,Home w/ Home Health Services,2017,203,Osteoarthritis,152,ARTHROPLASTY KNEE,302,Knee joint replacement,08,Diseases and Disorders of the Musculoskeletal System and Conn Tissue,2,Moderate,Minor,Surgical,Medicare,Medicare,Private Health Insurance,,N,N,95670.73,26613.64
Long Island,Nassau,2908000,000511,NYU Winthrop Hospital,70 or Older,110,F,White,Unknown,2,Elective,Skilled Nursing Home,2017,203,Osteoarthritis,152,ARTHROPLASTY KNEE,302,Knee joint replacement,08,Diseases and Disorders of the Musculoskeletal System and Conn Tissue,1,Minor,Minor,Surgical,Medicare,Medicare,Blue Cross/Blue Shield,,N,N,88283.20,24670.52
Long Island,Nassau,2908000,000511,NYU Winthrop Hospital,70 or Older,115,F,White,Not Span/Hispanic,2,Elective,Home w/ Home Health Services,2017,203,Osteoarthritis,152,ARTHROPLASTY KNEE,302,Knee joint replacement,08,Diseases and Disorders of the Musculoskeletal System and Conn Tissue,2,Moderate,Moderate,Surgical,Medicare,Medicare,Private Health Insurance,,N,N,85727.89,23982.61
Long Island,Nassau,2908000,000511,NYU Winthrop Hospital,70 or Older,117,F,White,Spanish/Hispanic,2,Elective,Home w/ Home Health Services,2017,203,Osteoarthritis,152,ARTHROPLASTY KNEE,302,Knee joint replacement,08,Diseases and Disorders of the Musculoskeletal System and Conn Tissue,2,Moderate,Moderate,Surgical,Medicare,Medicare,,,N,N,159017.78,42566.74
Long Island,Nassau,2908000,000511,NYU Winthrop Hospital,70 or Older,110,F,White,Not Span/Hispanic,2,Elective,Home w/ Home Health Services,2017,203,Osteoarthritis,152,ARTHROPLASTY KNEE,302,Knee joint replacement,08,Diseases and Disorders of the Musculoskeletal System and Conn Tissue,1,Minor,Minor,Surgical,Medicare,Medicare,Blue Cross/Blue Shield,,N,N,70822.25,20295.26
Long Island,Nassau,2908000,000511,NYU Winthrop Hospital,70 or Older,110,M,White,Not Span/Hispanic,2,Elective,Home w/ Home Health Services,2017,203,Osteoarthritis,152,ARTHROPLASTY KNEE,302,Knee joint replacement,08,Diseases and Disorders of the Musculoskeletal System and Conn Tissue,1,Minor,Moderate,Surgical,Medicare,Medicare,,,N,N,200795.20,53841.55
Long Island,Nassau,2908000,000511,NYU Winthrop Hospital,70 or Older,115,F,White,Not Span/Hispanic,4,Elective,Skilled Nursing Home,2017,203,Osteoarthritis,152,ARTHROPLASTY KNEE,302,Knee joint replacement,08,Diseases and Disorders of the Musculoskeletal System and Conn Tissue,1,Minor,Minor,Surgical,Medicare,Medicare,Blue Cross/Blue Shield,,N,N,80425.93,22974.01
Long Island,Nassau,2908000,000511,NYU Winthrop Hospital,50 to 69,110,F,White,Not Span/Hispanic,2,Elective,Home w/ Home Health Services,2017,203,Osteoarthritis,152,ARTHROPLASTY KNEE,302,Knee joint replacement,08,Diseases and Disorders of the Musculoskeletal System and Conn Tissue,2,Moderate,Minor,Surgical,Medicare,Medicare,,,N,N,72573.79,20610.74
Long Island,Nassau,2908000,000511,NYU Winthrop Hospital,70 or Older,115,M,White,Not Span/Hispanic,2,Elective,Home or Self Care,2017,203,Osteoarthritis,152,ARTHROPLASTY KNEE,302,Knee joint replacement,08,Diseases and Disorders of the Musculoskeletal System and Conn Tissue,2,Moderate,Minor,Surgical,Medicare,Medicare,Blue Cross/Blue Shield,,N,N,76739.32,20168.88
Long Island,Nassau,2908000,000511,NYU Winthrop Hospital,70 or Older,117,F,White,Not Span/Hispanic,3,Elective,Skilled Nursing Home,2017,203,Osteoarthritis,152,ARTHROPLASTY KNEE,302,Knee joint replacement,08,Diseases and Disorders of the Musculoskeletal System and Conn Tissue,2,Moderate,Minor,Surgical,Medicare,Medicare,Blue Cross/Blue Shield,,N,N,75607.74,20799.33
Long Island,Nassau,2908000,000511,NYU Winthrop Hospital,50 to 69,110,M,White,Not Span/Hispanic,9,Elective,Skilled Nursing Home,2017,203,Osteoarthritis,152,ARTHROPLASTY KNEE,302,Knee joint replacement,08,Diseases and Disorders of the Musculoskeletal System and Conn Tissue,3,Major,Moderate,Surgical,Private Health Insurance,,,,N,N,139759.15,39174.00
Long Island,Nassau,2908000,000511,NYU Winthrop Hospital,50 to 69,117,F,White,Not Span/Hispanic,2,Elective,Skilled Nursing Home,2017,203,Osteoarthritis,152,ARTHROPLASTY KNEE,302,Knee joint replacement,08,Diseases and Disorders of the Musculoskeletal System and Conn Tissue,2,Moderate,Minor,Surgical,Medicare,Medicare,,,N,N,122335.03,33780.14
Long Island,Nassau,2908000,000511,NYU Winthrop Hospital,50 to 69,114,F,White,Spanish/Hispanic,4,Elective,Skilled Nursing Home,2017,203,Osteoarthritis,152,ARTHROPLASTY KNEE,302,Knee joint replacement,08,Diseases and Disorders of the Musculoskeletal System and Conn Tissue,1,Minor,Minor,Surgical,Medicare,Medicaid,Medicare,,N,N,80122.22,22665.30
Long Island,Nassau,2908000,000511,NYU Winthrop Hospital,70 or Older,110,F,White,Not Span/Hispanic,2,Elective,Home w/ Home Health Services,2017,203,Osteoarthritis,152,ARTHROPLASTY KNEE,302,Knee joint replacement,08,Diseases and Disorders of the Musculoskeletal System and Conn Tissue,1,Minor,Minor,Surgical,Miscellaneous/Other,,,,N,N,114241.77,31555.90
Long Island,Nassau,2908000,000511,NYU Winthrop Hospital,70 or Older,110,F,White,Not Span/Hispanic,3,Elective,Skilled Nursing Home,2017,203,Osteoarthritis,152,ARTHROPLASTY KNEE,302,Knee joint replacement,08,Diseases and Disorders of the Musculoskeletal System and Conn Tissue,1,Minor,Minor,Surgical,Medicare,Medicare,Blue Cross/Blue Shield,,N,N,74860.06,21427.80
Long Island,Nassau,2908000,000511,NYU Winthrop Hospital,50 to 69,117,F,White,Not Span/Hispanic,3,Elective,Home w/ Home Health Services,2017,203,Osteoarthritis,152,ARTHROPLASTY KNEE,302,Knee joint replacement,08,Diseases and Disorders of the Musculoskeletal System and Conn Tissue,1,Minor,Minor,Surgical,Medicare,Medicare,Medicaid,,N,N,78747.56,21798.60
Long Island,Nassau,2908000,000511,NYU Winthrop Hospital,70 or Older,117,F,White,Not Span/Hispanic,2,Elective,Home w/ Home Health Services,2017,203,Osteoarthritis,152,ARTHROPLASTY KNEE,302,Knee joint replacement,08,Diseases and Disorders of the Musculoskeletal System and Conn Tissue,1,Minor,Minor,Surgical,Medicare,Medicare,,,N,N,70596.09,20028.24
Long Island,Nassau,2908000,000511,NYU Winthrop Hospital,50 to 69,115,F,White,Not Span/Hispanic,2,Elective,Home w/ Home Health Services,2017,203,Osteoarthritis,152,ARTHROPLASTY KNEE,302,Knee joint replacement,08,Diseases and Disorders of the Musculoskeletal System and Conn Tissue,1,Minor,Minor,Surgical,Blue Cross/Blue Shield,,,,N,N,82194.32,22982.13
Long Island,Nassau,2908000,000511,NYU Winthrop Hospital,50 to 69,117,M,White,Not Span/Hispanic,2,Elective,Home w/ Home Health Services,2017,203,Osteoarthritis,152,ARTHROPLASTY KNEE,302,Knee joint replacement,08,Diseases and Disorders of the Musculoskeletal System and Conn Tissue,1,Minor,Minor,Surgical,Medicare,Medicare,Private Health Insurance,,N,N,77631.62,21686.87
Long Island,Nassau,2908000,000511,NYU Winthrop Hospital,50 to 69,118,M,White,Not Span/Hispanic,2,Elective,Home w/ Home Health Services,2017,203,Osteoarthritis,152,ARTHROPLASTY KNEE,302,Knee joint replacement,08,Diseases and Disorders of the Musculoskeletal System and Conn Tissue,1,Minor,Minor,Surgical,Private Health Insurance,,,,N,N,95177.47,26604.07
Long Island,Nassau,2908000,000511,NYU Winthrop Hospital,50 to 69,110,F,White,Not Span/Hispanic,2,Elective,Home w/ Home Health Services,2017,203,Osteoarthritis,152,ARTHROPLASTY KNEE,302,Knee joint replacement,08,Diseases and Disorders of the Musculoskeletal System and Conn Tissue,2,Moderate,Minor,Surgical,Blue Cross/Blue Shield,,,,N,N,68842.72,19795.42
Long Island,Nassau,2908000,000511,NYU Winthrop Hospital,50 to 69,117,F,White,Not Span/Hispanic,2,Elective,Home w/ Home Health Services,2017,203,Osteoarthritis,152,ARTHROPLASTY KNEE,302,Knee joint replacement,08,Diseases and Disorders of the Musculoskeletal System and Conn Tissue,1,Minor,Minor,Surgical,Blue Cross/Blue Shield,,,,N,N,151341.55,41439.56
Long Island,Nassau,2908000,000511,NYU Winthrop Hospital,70 or Older,,F,Black/African American,Spanish/Hispanic,2,Elective,Home w/ Home Health Services,2017,203,Osteoarthritis,152,ARTHROPLASTY KNEE,302,Knee joint replacement,08,Diseases and Disorders of the Musculoskeletal System and Conn Tissue,2,Moderate,Moderate,Surgical,Medicare,Medicare,Self-Pay,,N,N,68821.08,19767.31
Long Island,Nassau,2908000,000511,NYU Winthrop Hospital,70 or Older,117,F,Other Race,Not Span/Hispanic,2,Elective,Home w/ Home Health Services,2017,203,Osteoarthritis,152,ARTHROPLASTY KNEE,302,Knee joint replacement,08,Diseases and Disorders of the Musculoskeletal System and Conn Tissue,1,Minor,Minor,Surgical,Medicare,Medicare,,,N,N,73288.45,20516.00
Long Island,Nassau,2908000,000511,NYU Winthrop Hospital,50 to 69,117,M,White,Not Span/Hispanic,1,Elective,Home or Self Care,2017,203,Osteoarthritis,152,ARTHROPLASTY KNEE,302,Knee joint replacement,08,Diseases and Disorders of the Musculoskeletal System and Conn Tissue,1,Minor,Minor,Surgical,Private Health Insurance,,,,N,N,92090.34,25730.31
Long Island,Nassau,2908000,000511,NYU Winthrop Hospital,50 to 69,117,M,White,Not Span/Hispanic,14,Elective,Inpatient Rehabilitation Facility,2017,203,Osteoarthritis,152,ARTHROPLASTY KNEE,302,Knee joint replacement,08,Diseases and Disorders of the Musculoskeletal System and Conn Tissue,4,Extreme,Major,Surgical,Medicare,Medicare,,,N,N,286079.24,62657.44
Long Island,Nassau,2908000,000511,NYU Winthrop Hospital,70 or Older,115,M,Other Race,Not Span/Hispanic,2,Elective,Home w/ Home Health Services,2017,203,Osteoarthritis,152,ARTHROPLASTY KNEE,302,Knee joint replacement,08,Diseases and Disorders of the Musculoskeletal System and Conn Tissue,1,Minor,Minor,Surgical,Medicare,Medicare,Private Health Insurance,,N,N,71928.94,20498.06
Long Island,Nassau,2908000,000511,NYU Winthrop Hospital,70 or Older,115,F,White,Not Span/Hispanic,3,Elective,Home w/ Home Health Services,2017,203,Osteoarthritis,152,ARTHROPLASTY KNEE,302,Knee joint replacement,08,Diseases and Disorders of the Musculoskeletal System and Conn Tissue,1,Minor,Minor,Surgical,Medicare,Medicare,Blue Cross/Blue Shield,,N,N,150031.15,40998.79
Long Island,Nassau,2908000,000511,NYU Winthrop Hospital,70 or Older,110,M,White,Not Span/Hispanic,2,Elective,Inpatient Rehabilitation Facility,2017,203,Osteoarthritis,152,ARTHROPLASTY KNEE,302,Knee joint replacement,08,Diseases and Disorders of the Musculoskeletal System and Conn Tissue,2,Moderate,Moderate,Surgical,Medicare,Medicare,,,N,N,82001.20,22717.21
Long Island,Nassau,2908000,000511,NYU Winthrop Hospital,70 or Older,117,F,White,Not Span/Hispanic,7,Elective,Skilled Nursing Home,2017,203,Osteoarthritis,152,ARTHROPLASTY KNEE,302,Knee joint replacement,08,Diseases and Disorders of the Musculoskeletal System and Conn Tissue,2,Moderate,Minor,Surgical,Blue Cross/Blue Shield,Medicare,Medicare,,N,N,106485.78,30226.48
Long Island,Nassau,2908000,000511,NYU Winthrop Hospital,70 or Older,110,M,White,Not Span/Hispanic,2,Elective,Home w/ Home Health Services,2017,203,Osteoarthritis,152,ARTHROPLASTY KNEE,302,Knee joint replacement,08,Diseases and Disorders of the Musculoskeletal System and Conn Tissue,1,Minor,Minor,Surgical,Medicare,Medicare,Private Health Insurance,,N,N,125303.12,34705.04
Long Island,Nassau,2908000,000511,NYU Winthrop Hospital,70 or Older,115,F,White,Not Span/Hispanic,2,Elective,Home w/ Home Health Services,2017,203,Osteoarthritis,152,ARTHROPLASTY KNEE,302,Knee joint replacement,08,Diseases and Disorders of the Musculoskeletal System and Conn Tissue,1,Minor,Minor,Surgical,Medicare,Medicare,Private Health Insurance,,N,N,151050.69,41236.56
Long Island,Nassau,2908000,000511,NYU Winthrop Hospital,50 to 69,117,M,White,Not Span/Hispanic,2,Elective,Home w/ Home Health Services,2017,203,Osteoarthritis,152,ARTHROPLASTY KNEE,302,Knee joint replacement,08,Diseases and Disorders of the Musculoskeletal System and Conn Tissue,1,Minor,Minor,Surgical,Medicare,Medicare,Private Health Insurance,,N,N,94219.47,26410.09
Long Island,Nassau,2908000,000511,NYU Winthrop Hospital,50 to 69,115,M,White,Not Span/Hispanic,2,Elective,Home w/ Home Health Services,2017,203,Osteoarthritis,152,ARTHROPLASTY KNEE,302,Knee joint replacement,08,Diseases and Disorders of the Musculoskeletal System and Conn Tissue,2,Moderate,Minor,Surgical,Blue Cross/Blue Shield,,,,N,N,76798.94,22244.20
Long Island,Nassau,2908000,000511,NYU Winthrop Hospital,70 or Older,117,F,White,Not Span/Hispanic,2,Elective,Skilled Nursing Home,2017,203,Osteoarthritis,152,ARTHROPLASTY KNEE,302,Knee joint replacement,08,Diseases and Disorders of the Musculoskeletal System and Conn Tissue,2,Moderate,Minor,Surgical,Medicare,Medicare,Private Health Insurance,,N,N,146381.45,39963.34
Long Island,Nassau,2908000,000511,NYU Winthrop Hospital,50 to 69,118,F,White,Not Span/Hispanic,2,Elective,Home w/ Home Health Services,2017,202,Rheumatoid arthritis and related disease,152,ARTHROPLASTY KNEE,302,Knee joint replacement,08,Diseases and Disorders of the Musculoskeletal System and Conn Tissue,2,Moderate,Minor,Surgical,Blue Cross/Blue Shield,,,,N,N,87820.01,24521.52
Long Island,Nassau,2908000,000511,NYU Winthrop Hospital,70 or Older,115,F,White,Not Span/Hispanic,2,Elective,Home w/ Home Health Services,2017,203,Osteoarthritis,152,ARTHROPLASTY KNEE,302,Knee joint replacement,08,Diseases and Disorders of the Musculoskeletal System and Conn Tissue,1,Minor,Minor,Surgical,Medicare,Medicare,Blue Cross/Blue Shield,,N,N,73198.34,20824.07
Long Island,Nassau,2908000,000511,NYU Winthrop Hospital,70 or Older,115,F,White,Not Span/Hispanic,2,Elective,Home w/ Home Health Services,2017,203,Osteoarthritis,152,ARTHROPLASTY KNEE,302,Knee joint replacement,08,Diseases and Disorders of the Musculoskeletal System and Conn Tissue,1,Minor,Minor,Surgical,Private Health Insurance,Medicare,,,N,N,71198.56,20197.61
Long Island,Nassau,2908000,000511,NYU Winthrop Hospital,50 to 69,117,M,White,Not Span/Hispanic,2,Elective,Home w/ Home Health Services,2017,203,Osteoarthritis,152,ARTHROPLASTY KNEE,302,Knee joint replacement,08,Diseases and Disorders of the Musculoskeletal System and Conn Tissue,2,Moderate,Minor,Surgical,Miscellaneous/Other,,,,N,N,69097.47,19262.01
Long Island,Nassau,2908000,000511,NYU Winthrop Hospital,50 to 69,117,M,White,Not Span/Hispanic,1,Elective,Home w/ Home Health Services,2017,203,Osteoarthritis,152,ARTHROPLASTY KNEE,302,Knee joint replacement,08,Diseases and Disorders of the Musculoskeletal System and Conn Tissue,1,Minor,Minor,Surgical,Medicare,Medicare,Blue Cross/Blue Shield,,N,N,90693.48,24381.15
Long Island,Nassau,2908000,000511,NYU Winthrop Hospital,70 or Older,115,F,White,Not Span/Hispanic,2,Elective,Home w/ Home Health Services,2017,203,Osteoarthritis,152,ARTHROPLASTY KNEE,302,Knee joint replacement,08,Diseases and Disorders of the Musculoskeletal System and Conn Tissue,1,Minor,Minor,Surgical,Medicare,Medicare,Private Health Insurance,,N,N,80182.95,22446.42
Long Island,Nassau,2908000,000511,NYU Winthrop Hospital,70 or Older,117,F,White,Not Span/Hispanic,2,Elective,Home w/ Home Health Services,2017,203,Osteoarthritis,152,ARTHROPLASTY KNEE,302,Knee joint replacement,08,Diseases and Disorders of the Musculoskeletal System and Conn Tissue,1,Minor,Minor,Surgical,Medicare,Medicare,,,N,N,143395.96,39113.91
Long Island,Nassau,2908000,000511,NYU Winthrop Hospital,70 or Older,110,F,Other Race,Not Span/Hispanic,2,Elective,Home w/ Home Health Services,2017,203,Osteoarthritis,152,ARTHROPLASTY KNEE,302,Knee joint replacement,08,Diseases and Disorders of the Musculoskeletal System and Conn Tissue,1,Minor,Minor,Surgical,Blue Cross/Blue Shield,,,,N,N,85814.67,24069.81
Long Island,Nassau,2908000,000511,NYU Winthrop Hospital,70 or Older,115,F,Black/African American,Not Span/Hispanic,4,Elective,Home w/ Home Health Services,2017,203,Osteoarthritis,152,ARTHROPLASTY KNEE,302,Knee joint replacement,08,Diseases and Disorders of the Musculoskeletal System and Conn Tissue,2,Moderate,Minor,Surgical,Medicare,Medicare,Private Health Insurance,,N,N,80204.74,23053.85
Long Island,Nassau,2908000,000511,NYU Winthrop Hospital,50 to 69,115,F,White,Not Span/Hispanic,4,Elective,Home w/ Home Health Services,2017,203,Osteoarthritis,152,ARTHROPLASTY KNEE,302,Knee joint replacement,08,Diseases and Disorders of the Musculoskeletal System and Conn Tissue,1,Minor,Minor,Surgical,Private Health Insurance,,,,N,N,111721.08,31271.35
Long Island,Nassau,2908000,000511,NYU Winthrop Hospital,50 to 69,117,M,White,Not Span/Hispanic,2,Elective,Home w/ Home Health Services,2017,203,Osteoarthritis,152,ARTHROPLASTY KNEE,302,Knee joint replacement,08,Diseases and Disorders of the Musculoskeletal System and Conn Tissue,1,Minor,Minor,Surgical,Private Health Insurance,,,,N,N,83792.01,23888.62
Long Island,Nassau,2908000,000511,NYU Winthrop Hospital,50 to 69,115,M,Other Race,Spanish/Hispanic,3,Elective,Home w/ Home Health Services,2017,203,Osteoarthritis,152,ARTHROPLASTY KNEE,302,Knee joint replacement,08,Diseases and Disorders of the Musculoskeletal System and Conn Tissue,2,Moderate,Minor,Surgical,Blue Cross/Blue Shield,,,,N,N,74819.99,20990.36
Long Island,Nassau,2908000,000511,NYU Winthrop Hospital,70 or Older,115,F,White,Not Span/Hispanic,3,Elective,Home w/ Home Health Services,2017,203,Osteoarthritis,152,ARTHROPLASTY KNEE,302,Knee joint replacement,08,Diseases and Disorders of the Musculoskeletal System and Conn Tissue,1,Minor,Minor,Surgical,Medicare,Medicare,Private Health Insurance,,N,N,72709.10,20391.61