Hospital Service Area,Hospital County,Operating Certificate Number,Permanent Facility Id,Facility Name,Age Group,Zip Code - 3 digits,Gender,Race,Ethnicity,Length of Stay,Type of Admission,Patient Disposition,Discharge Year,CCS Diagnosis Code,CCS Diagnosis Description,CCS Procedure Code,CCS Procedure Description,APR DRG Code,APR DRG Description,APR MDC Code,APR MDC Description,APR Severity of Illness Code,APR Severity of Illness Description,APR Risk of Mortality,APR Medical Surgical Description,Payment Typology 1,Payment Typology 2,Payment Typology 3,Birth Weight,Abortion Edit Indicator,Emergency Department Indicator,Total Charges,Total Costs
New York City,Kings,7002053,001304,NYU Langone Hospital-Brooklyn,50 to 69,112,F,White,Not Span/Hispanic,2,Elective,Skilled Nursing Home,2019,MUS006,OSTEOARTHRITIS,MST006,KNEE ARTHROPLASTY,302,KNEE JOINT REPLACEMENT,08,DISEASES AND DISORDERS OF THE MUSCULOSKELETAL SYSTEM AND CONNECTIVE TISSUE,1,Minor,Minor,Surgical,Private Health Insurance,,,,,false,88717.96,17091.89
New York City,Kings,7002053,001304,NYU Langone Hospital-Brooklyn,70 or Older,112,F,Other Race,Spanish/Hispanic,3,Elective,Skilled Nursing Home,2019,MUS006,OSTEOARTHRITIS,MST006,KNEE ARTHROPLASTY,302,KNEE JOINT REPLACEMENT,08,DISEASES AND DISORDERS OF THE MUSCULOSKELETAL SYSTEM AND CONNECTIVE TISSUE,1,Minor,Minor,Surgical,Medicare,Medicaid,,,,false,101364.64,21213.84
New York City,Kings,7002053,001304,NYU Langone Hospital-Brooklyn,50 to 69,112,F,White,Not Span/Hispanic,2,Elective,Home w/ Home Health Services,2019,MUS006,OSTEOARTHRITIS,MST006,KNEE ARTHROPLASTY,302,KNEE JOINT REPLACEMENT,08,DISEASES AND DISORDERS OF THE MUSCULOSKELETAL SYSTEM AND CONNECTIVE TISSUE,2,Moderate,Minor,Surgical,Medicare,Medicaid,,,,false,95006.42,17886.73
New York City,Kings,7002053,001304,NYU Langone Hospital-Brooklyn,70 or Older,103,F,White,Not Span/Hispanic,3,Elective,Skilled Nursing Home,2019,MUS006,OSTEOARTHRITIS,MST006,KNEE ARTHROPLASTY,302,KNEE JOINT REPLACEMENT,08,DISEASES AND DISORDERS OF THE MUSCULOSKELETAL SYSTEM AND CONNECTIVE TISSUE,2,Moderate,Minor,Surgical,Medicare,Medicare,,,,false,110512.13,21840.76
New York City,Kings,7002053,001304,NYU Langone Hospital-Brooklyn,50 to 69,112,F,Other Race,Spanish/Hispanic,2,Elective,Home w/ Home Health Services,2019,MUS006,OSTEOARTHRITIS,MST006,KNEE ARTHROPLASTY,302,KNEE JOINT REPLACEMENT,08,DISEASES AND DISORDERS OF THE MUSCULOSKELETAL SYSTEM AND CONNECTIVE TISSUE,1,Minor,Minor,Surgical,Medicaid,,,,,false,179087.19,30387.7
New York City,Kings,7002053,001304,NYU Langone Hospital-Brooklyn,50 to 69,112,F,White,Not Span/Hispanic,4,Elective,Skilled Nursing Home,2019,MUS006,OSTEOARTHRITIS,MST006,KNEE ARTHROPLASTY,302,KNEE JOINT REPLACEMENT,08,DISEASES AND DISORDERS OF THE MUSCULOSKELETAL SYSTEM AND CONNECTIVE TISSUE,1,Minor,Minor,Surgical,Medicare,Medicaid,,,,false,239669.67,44291.45
New York City,Kings,7002053,001304,NYU Langone Hospital-Brooklyn,50 to 69,114,F,Other Race,Spanish/Hispanic,3,Elective,Home w/ Home Health Services,2019,MUS006,OSTEOARTHRITIS,MST006,KNEE ARTHROPLASTY,302,KNEE JOINT REPLACEMENT,08,DISEASES AND DISORDERS OF THE MUSCULOSKELETAL SYSTEM AND CONNECTIVE TISSUE,2,Moderate,Minor,Surgical,Medicare,,,,,false,129559.88,23473.48
New York City,Kings,7002053,001304,NYU Langone Hospital-Brooklyn,70 or Older,112,M,White,Spanish/Hispanic,6,Elective,Home w/ Home Health Services,2019,MUS006,OSTEOARTHRITIS,MST006,KNEE ARTHROPLASTY,302,KNEE JOINT REPLACEMENT,08,DISEASES AND DISORDERS OF THE MUSCULOSKELETAL SYSTEM AND CONNECTIVE TISSUE,2,Moderate,Minor,Surgical,Medicare,,,,,false,133559.2,32704.65
New York City,Kings,7002053,001304,NYU Langone Hospital-Brooklyn,30 to 49,112,F,Black/African American,Not Span/Hispanic,3,Elective,Inpatient Rehabilitation Facility,2019,MUS006,OSTEOARTHRITIS,MST006,KNEE ARTHROPLASTY,302,KNEE JOINT REPLACEMENT,08,DISEASES AND DISORDERS OF THE MUSCULOSKELETAL SYSTEM AND CONNECTIVE TISSUE,2,Moderate,Minor,Surgical,Private Health Insurance,,,,,false,187192.49,33177.48
New York City,Kings,7002053,001304,NYU Langone Hospital-Brooklyn,70 or Older,112,F,Other Race,Spanish/Hispanic,2,Elective,Home w/ Home Health Services,2019,MUS006,OSTEOARTHRITIS,MST006,KNEE ARTHROPLASTY,302,KNEE JOINT REPLACEMENT,08,DISEASES AND DISORDERS OF THE MUSCULOSKELETAL SYSTEM AND CONNECTIVE TISSUE,2,Moderate,Moderate,Surgical,Medicaid,,,,,false,127594.54,22823.95
New York City,Kings,7002053,001304,NYU Langone Hospital-Brooklyn,50 to 69,112,M,White,Not Span/Hispanic,2,Elective,Home w/ Home Health Services,2019,MUS006,OSTEOARTHRITIS,MST006,KNEE ARTHROPLASTY,302,KNEE JOINT REPLACEMENT,08,DISEASES AND DISORDERS OF THE MUSCULOSKELETAL SYSTEM AND CONNECTIVE TISSUE,1,Minor,Minor,Surgical,Medicare,Private Health Insurance,Blue Cross/Blue Shield,,,false,110220.17,20235.71
New York City,Kings,7002053,001304,NYU Langone Hospital-Brooklyn,70 or Older,112,M,White,Spanish/Hispanic,2,Elective,Home w/ Home Health Services,2019,MUS006,OSTEOARTHRITIS,MST006,KNEE ARTHROPLASTY,302,KNEE JOINT REPLACEMENT,08,DISEASES AND DISORDERS OF THE MUSCULOSKELETAL SYSTEM AND CONNECTIVE TISSUE,1,Minor,Minor,Surgical,Medicare,Medicaid,,,,false,104659.97,19227.08
New York City,Kings,7002053,001304,NYU Langone Hospital-Brooklyn,50 to 69,112,F,White,Spanish/Hispanic,3,Elective,Skilled Nursing Home,2019,MUS006,OSTEOARTHRITIS,MST006,KNEE ARTHROPLASTY,302,KNEE JOINT REPLACEMENT,08,DISEASES AND DISORDERS OF THE MUSCULOSKELETAL SYSTEM AND CONNECTIVE TISSUE,2,Moderate,Minor,Surgical,Medicare,,,,,false,128073.12,25120.86
New York City,Kings,7002053,001304,NYU Langone Hospital-Brooklyn,50 to 69,112,F,Other Race,Not Span/Hispanic,4,Elective,Home w/ Home Health Services,2019,MUS006,OSTEOARTHRITIS,MST006,KNEE ARTHROPLASTY,302,KNEE JOINT REPLACEMENT,08,DISEASES AND DISORDERS OF THE MUSCULOSKELETAL SYSTEM AND CONNECTIVE TISSUE,2,Moderate,Minor,Surgical,Medicaid,,,,,false,188880.24,36484.79
New York City,Kings,7002053,001304,NYU Langone Hospital-Brooklyn,70 or Older,113,M,Other Race,Not Span/Hispanic,3,Elective,Skilled Nursing Home,2019,MUS006,OSTEOARTHRITIS,MST006,KNEE ARTHROPLASTY,302,KNEE JOINT REPLACEMENT,08,DISEASES AND DISORDERS OF THE MUSCULOSKELETAL SYSTEM AND CONNECTIVE TISSUE,1,Minor,Minor,Surgical,Medicare,Medicaid,,,,false,107842.91,22645.52
New York City,Kings,7002053,001304,NYU Langone Hospital-Brooklyn,50 to 69,112,F,Other Race,Spanish/Hispanic,2,Elective,Home w/ Home Health Services,2019,MUS006,OSTEOARTHRITIS,MST006,KNEE ARTHROPLASTY,302,KNEE JOINT REPLACEMENT,08,DISEASES AND DISORDERS OF THE MUSCULOSKELETAL SYSTEM AND CONNECTIVE TISSUE,2,Moderate,Minor,Surgical,Private Health Insurance,,,,,false,110811.36,20117.5
New York City,Kings,7002053,001304,NYU Langone Hospital-Brooklyn,50 to 69,112,F,Black/African American,Not Span/Hispanic,4,Elective,Home w/ Home Health Services,2019,MUS006,OSTEOARTHRITIS,MST006,KNEE ARTHROPLASTY,302,KNEE JOINT REPLACEMENT,08,DISEASES AND DISORDERS OF THE MUSCULOSKELETAL SYSTEM AND CONNECTIVE TISSUE,2,Moderate,Minor,Surgical,Private Health Insurance,,,,,false,124617.08,27310.2
New York City,Kings,7002053,001304,NYU Langone Hospital-Brooklyn,50 to 69,113,F,Other Race,Spanish/Hispanic,12,Emergency,Skilled Nursing Home,2019,INJ035,"COMPLICATION OF INTERNAL ORTHOPEDIC DEVICE OR IMPLANT, INITIAL ENCOUNTER",MST017,JOINT TISSUE EXCISION (EXCLUDING DISCECTOMY),302,KNEE JOINT REPLACEMENT,08,DISEASES AND DISORDERS OF THE MUSCULOSKELETAL SYSTEM AND CONNECTIVE TISSUE,2,Moderate,Minor,Surgical,Medicaid,,,,,true,156038.27,48703.34
New York City,Kings,7002053,001304,NYU Langone Hospital-Brooklyn,50 to 69,112,F,White,Not Span/Hispanic,2,Elective,Home w/ Home Health Services,2019,MUS006,OSTEOARTHRITIS,MST006,KNEE ARTHROPLASTY,302,KNEE JOINT REPLACEMENT,08,DISEASES AND DISORDERS OF THE MUSCULOSKELETAL SYSTEM AND CONNECTIVE TISSUE,1,Minor,Minor,Surgical,Private Health Insurance,,,,,false,93474.18,17801.28
New York City,Kings,7002053,001304,NYU Langone Hospital-Brooklyn,50 to 69,112,F,Other Race,Spanish/Hispanic,1,Elective,Home w/ Home Health Services,2019,MUS006,OSTEOARTHRITIS,MST006,KNEE ARTHROPLASTY,302,KNEE JOINT REPLACEMENT,08,DISEASES AND DISORDERS OF THE MUSCULOSKELETAL SYSTEM AND CONNECTIVE TISSUE,3,Major,Moderate,Surgical,Medicaid,,,,,false,95649.75,15809.22
New York City,Kings,7002053,001304,NYU Langone Hospital-Brooklyn,70 or Older,112,F,Black/African American,Not Span/Hispanic,2,Elective,Home w/ Home Health Services,2019,MUS006,OSTEOARTHRITIS,MST006,KNEE ARTHROPLASTY,302,KNEE JOINT REPLACEMENT,08,DISEASES AND DISORDERS OF THE MUSCULOSKELETAL SYSTEM AND CONNECTIVE TISSUE,1,Minor,Minor,Surgical,Medicare,,,,,false,155120.05,26971.79
New York City,Kings,7002053,001304,NYU Langone Hospital-Brooklyn,50 to 69,112,F,Black/African American,Not Span/Hispanic,4,Elective,Inpatient Rehabilitation Facility,2019,MUS006,OSTEOARTHRITIS,MST006,KNEE ARTHROPLASTY,302,KNEE JOINT REPLACEMENT,08,DISEASES AND DISORDERS OF THE MUSCULOSKELETAL SYSTEM AND CONNECTIVE TISSUE,2,Moderate,Minor,Surgical,Medicare,,,,,false,251702.51,46521.42
New York City,Kings,7002053,001304,NYU Langone Hospital-Brooklyn,70 or Older,112,M,White,Not Span/Hispanic,2,Elective,Home w/ Home Health Services,2019,MUS006,OSTEOARTHRITIS,MST006,KNEE ARTHROPLASTY,302,KNEE JOINT REPLACEMENT,08,DISEASES AND DISORDERS OF THE MUSCULOSKELETAL SYSTEM AND CONNECTIVE TISSUE,1,Minor,Minor,Surgical,Medicaid,,,,,false,95470.22,18061.68
New York City,Kings,7002053,001304,NYU Langone Hospital-Brooklyn,50 to 69,112,M,Black/African American,Not Span/Hispanic,2,Elective,Skilled Nursing Home,2019,MUS006,OSTEOARTHRITIS,MST006,KNEE ARTHROPLASTY,302,KNEE JOINT REPLACEMENT,08,DISEASES AND DISORDERS OF THE MUSCULOSKELETAL SYSTEM AND CONNECTIVE TISSUE,1,Minor,Minor,Surgical,Medicare,,,,,false,109634.03,20633.08
New York City,Kings,7002053,001304,NYU Langone Hospital-Brooklyn,70 or Older,112,F,White,Not Span/Hispanic,2,Elective,Skilled Nursing Home,2019,MUS006,OSTEOARTHRITIS,MST006,KNEE ARTHROPLASTY,302,KNEE JOINT REPLACEMENT,08,DISEASES AND DISORDERS OF THE MUSCULOSKELETAL SYSTEM AND CONNECTIVE TISSUE,1,Minor,Minor,Surgical,Medicare,Medicaid,,,,false,101231.31,18383.94
New York City,Kings,7002053,001304,NYU Langone Hospital-Brooklyn,50 to 69,112,F,Other Race,Not Span/Hispanic,3,Elective,Home w/ Home Health Services,2019,MUS006,OSTEOARTHRITIS,MST006,KNEE ARTHROPLASTY,302,KNEE JOINT REPLACEMENT,08,DISEASES AND DISORDERS OF THE MUSCULOSKELETAL SYSTEM AND CONNECTIVE TISSUE,1,Minor,Minor,Surgical,Private Health Insurance,,,,,false,112351.02,23306.68
New York City,Kings,7002053,001304,NYU Langone Hospital-Brooklyn,50 to 69,112,F,White,Not Span/Hispanic,2,Elective,Home w/ Home Health Services,2019,MUS006,OSTEOARTHRITIS,MST006,KNEE ARTHROPLASTY,302,KNEE JOINT REPLACEMENT,08,DISEASES AND DISORDERS OF THE MUSCULOSKELETAL SYSTEM AND CONNECTIVE TISSUE,2,Moderate,Moderate,Surgical,Private Health Insurance,,,,,false,94971.95,18070.96
New York City,Kings,7002053,001304,NYU Langone Hospital-Brooklyn,50 to 69,112,F,Black/African American,Spanish/Hispanic,3,Elective,Home w/ Home Health Services,2019,MUS006,OSTEOARTHRITIS,MST006,KNEE ARTHROPLASTY,302,KNEE JOINT REPLACEMENT,08,DISEASES AND DISORDERS OF THE MUSCULOSKELETAL SYSTEM AND CONNECTIVE TISSUE,1,Minor,Minor,Surgical,Medicaid,Private Health Insurance,,,,false,108803.24,22734.02
New York City,Kings,7002053,001304,NYU Langone Hospital-Brooklyn,70 or Older,112,F,Other Race,Spanish/Hispanic,3,Elective,Home w/ Home Health Services,2019,MUS006,OSTEOARTHRITIS,MST006,KNEE ARTHROPLASTY,302,KNEE JOINT REPLACEMENT,08,DISEASES AND DISORDERS OF THE MUSCULOSKELETAL SYSTEM AND CONNECTIVE TISSUE,2,Moderate,Minor,Surgical,Medicare,Medicaid,,,,false,193379.94,34915.35
New York City,Kings,7002053,001304,NYU Langone Hospital-Brooklyn,70 or Older,112,F,Other Race,Spanish/Hispanic,2,Elective,Home w/ Home Health Services,2019,MUS003,RHEUMATOID ARTHRITIS AND RELATED DISEASE,MST006,KNEE ARTHROPLASTY,302,KNEE JOINT REPLACEMENT,08,DISEASES AND DISORDERS OF THE MUSCULOSKELETAL SYSTEM AND CONNECTIVE TISSUE,3,Major,Minor,Surgical,Medicare,Medicaid,,,,false,96934.63,18334.07
New York City,Kings,7002053,001304,NYU Langone Hospital-Brooklyn,70 or Older,112,F,White,Not Span/Hispanic,2,Elective,Home w/ Home Health Services,2019,MUS006,OSTEOARTHRITIS,MST006,KNEE ARTHROPLASTY,302,KNEE JOINT REPLACEMENT,08,DISEASES AND DISORDERS OF THE MUSCULOSKELETAL SYSTEM AND CONNECTIVE TISSUE,1,Minor,Minor,Surgical,Medicare,Medicaid,,,,false,88376.97,16963.41
New York City,Kings,7002053,001304,NYU Langone Hospital-Brooklyn,50 to 69,113,F,White,Not Span/Hispanic,2,Elective,Home w/ Home Health Services,2019,MUS006,OSTEOARTHRITIS,MST006,KNEE ARTHROPLASTY,302,KNEE JOINT REPLACEMENT,08,DISEASES AND DISORDERS OF THE MUSCULOSKELETAL SYSTEM AND CONNECTIVE TISSUE,1,Minor,Minor,Surgical,Private Health Insurance,,,,,false,105908.81,19476.75
New York City,Kings,7002053,001304,NYU Langone Hospital-Brooklyn,50 to 69,112,F,White,Spanish/Hispanic,4,Elective,Home w/ Home Health Services,2019,MUS006,OSTEOARTHRITIS,MST006,KNEE ARTHROPLASTY,302,KNEE JOINT REPLACEMENT,08,DISEASES AND DISORDERS OF THE MUSCULOSKELETAL SYSTEM AND CONNECTIVE TISSUE,2,Moderate,Minor,Surgical,Medicare,Medicaid,,,,false,134072.22,28291.62
New York City,Kings,7002053,001304,NYU Langone Hospital-Brooklyn,50 to 69,100,F,Black/African American,Not Span/Hispanic,2,Elective,Home w/ Home Health Services,2019,MUS006,OSTEOARTHRITIS,MST006,KNEE ARTHROPLASTY,302,KNEE JOINT REPLACEMENT,08,DISEASES AND DISORDERS OF THE MUSCULOSKELETAL SYSTEM AND CONNECTIVE TISSUE,2,Moderate,Minor,Surgical,Medicare,,,,,false,106435.64,20129.58
New York City,Kings,7002053,001304,NYU Langone Hospital-Brooklyn,50 to 69,112,F,Other Race,Spanish/Hispanic,3,Elective,Skilled Nursing Home,2019,MUS006,OSTEOARTHRITIS,MST006,KNEE ARTHROPLASTY,302,KNEE JOINT REPLACEMENT,08,DISEASES AND DISORDERS OF THE MUSCULOSKELETAL SYSTEM AND CONNECTIVE TISSUE,2,Moderate,Minor,Surgical,Medicaid,,,,,false,126315.02,24691.48
New York City,Kings,7002053,001304,NYU Langone Hospital-Brooklyn,50 to 69,112,F,White,Not Span/Hispanic,2,Elective,Home w/ Home Health Services,2019,MUS006,OSTEOARTHRITIS,MST006,KNEE ARTHROPLASTY,302,KNEE JOINT REPLACEMENT,08,DISEASES AND DISORDERS OF THE MUSCULOSKELETAL SYSTEM AND CONNECTIVE TISSUE,1,Minor,Minor,Surgical,Private Health Insurance,,,,,false,135279.1,23980.77
New York City,Kings,7002053,001304,NYU Langone Hospital-Brooklyn,70 or Older,112,F,White,Not Span/Hispanic,3,Elective,Skilled Nursing Home,2019,MUS006,OSTEOARTHRITIS,MST006,KNEE ARTHROPLASTY,302,KNEE JOINT REPLACEMENT,08,DISEASES AND DISORDERS OF THE MUSCULOSKELETAL SYSTEM AND CONNECTIVE TISSUE,2,Moderate,Moderate,Surgical,Medicare,Blue Cross/Blue Shield,,,,false,122810.98,24313.14
New York City,Kings,7002053,001304,NYU Langone Hospital-Brooklyn,70 or Older,100,F,White,Not Span/Hispanic,6,Elective,Home w/ Home Health Services,2019,MUS006,OSTEOARTHRITIS,MST006,KNEE ARTHROPLASTY,302,KNEE JOINT REPLACEMENT,08,DISEASES AND DISORDERS OF THE MUSCULOSKELETAL SYSTEM AND CONNECTIVE TISSUE,3,Major,Major,Surgical,Medicare,Medicaid,,,,false,147120.03,33774.94
New York City,Kings,7002053,001304,NYU Langone Hospital-Brooklyn,70 or Older,112,F,White,Not Span/Hispanic,2,Elective,Home w/ Home Health Services,2019,MUS006,OSTEOARTHRITIS,MST006,KNEE ARTHROPLASTY,302,KNEE JOINT REPLACEMENT,08,DISEASES AND DISORDERS OF THE MUSCULOSKELETAL SYSTEM AND CONNECTIVE TISSUE,2,Moderate,Major,Surgical,Medicaid,,,,,false,98839.71,18524.03
New York City,Kings,7002053,001304,NYU Langone Hospital-Brooklyn,70 or Older,112,F,White,Spanish/Hispanic,4,Elective,Skilled Nursing Home,2019,MUS006,OSTEOARTHRITIS,MST006,KNEE ARTHROPLASTY,302,KNEE JOINT REPLACEMENT,08,DISEASES AND DISORDERS OF THE MUSCULOSKELETAL SYSTEM AND CONNECTIVE TISSUE,2,Moderate,Moderate,Surgical,Medicare,Medicaid,,,,false,117292.25,26186.46
New York City,Kings,7002053,001304,NYU Langone Hospital-Brooklyn,70 or Older,112,M,White,Spanish/Hispanic,4,Elective,Home w/ Home Health Services,2019,MUS006,OSTEOARTHRITIS,MST014,JOINT FUSION (EXCLUDING SPINE),302,KNEE JOINT REPLACEMENT,08,DISEASES AND DISORDERS OF THE MUSCULOSKELETAL SYSTEM AND CONNECTIVE TISSUE,2,Moderate,Moderate,Surgical,Medicaid,,,,,false,185964.08,34182.51
New York City,Kings,7002053,001304,NYU Langone Hospital-Brooklyn,30 to 49,112,F,Other Race,Spanish/Hispanic,3,Elective,Home w/ Home Health Services,2019,MUS006,OSTEOARTHRITIS,MST006,KNEE ARTHROPLASTY,302,KNEE JOINT REPLACEMENT,08,DISEASES AND DISORDERS OF THE MUSCULOSKELETAL SYSTEM AND CONNECTIVE TISSUE,2,Moderate,Minor,Surgical,Medicaid,,,,,false,112503.65,22630.29
New York City,Kings,7002053,001304,NYU Langone Hospital-Brooklyn,50 to 69,112,F,Black/African American,Not Span/Hispanic,3,Elective,Home w/ Home Health Services,2019,MUS006,OSTEOARTHRITIS,MST006,KNEE ARTHROPLASTY,302,KNEE JOINT REPLACEMENT,08,DISEASES AND DISORDERS OF THE MUSCULOSKELETAL SYSTEM AND CONNECTIVE TISSUE,1,Minor,Minor,Surgical,Blue Cross/Blue Shield,Medicare,,,,false,112091.85,22784.93
New York City,Kings,7002053,001304,NYU Langone Hospital-Brooklyn,70 or Older,113,F,White,Not Span/Hispanic,6,Elective,Skilled Nursing Home,2019,MUS006,OSTEOARTHRITIS,MST006,KNEE ARTHROPLASTY,302,KNEE JOINT REPLACEMENT,08,DISEASES AND DISORDERS OF THE MUSCULOSKELETAL SYSTEM AND CONNECTIVE TISSUE,2,Moderate,Moderate,Surgical,Blue Cross/Blue Shield,Medicaid,,,,false,137807.45,33379.99
New York City,Kings,7002053,001304,NYU Langone Hospital-Brooklyn,50 to 69,112,F,White,Not Span/Hispanic,3,Elective,Inpatient Rehabilitation Facility,2019,MUS006,OSTEOARTHRITIS,MST006,KNEE ARTHROPLASTY,302,KNEE JOINT REPLACEMENT,08,DISEASES AND DISORDERS OF THE MUSCULOSKELETAL SYSTEM AND CONNECTIVE TISSUE,2,Moderate,Minor,Surgical,Private Health Insurance,,,,,false,151309.16,28358.7
New York City,Kings,7002053,001304,NYU Langone Hospital-Brooklyn,50 to 69,112,F,White,Not Span/Hispanic,2,Elective,Home w/ Home Health Services,2019,MUS006,OSTEOARTHRITIS,MST006,KNEE ARTHROPLASTY,302,KNEE JOINT REPLACEMENT,08,DISEASES AND DISORDERS OF THE MUSCULOSKELETAL SYSTEM AND CONNECTIVE TISSUE,2,Moderate,Minor,Surgical,Medicare,Medicare,,,,false,100598.22,18818.02
New York City,Kings,7002053,001304,NYU Langone Hospital-Brooklyn,50 to 69,OOS,M,White,Not Span/Hispanic,2,Elective,Home w/ Home Health Services,2019,MUS006,OSTEOARTHRITIS,MST006,KNEE ARTHROPLASTY,302,KNEE JOINT REPLACEMENT,08,DISEASES AND DISORDERS OF THE MUSCULOSKELETAL SYSTEM AND CONNECTIVE TISSUE,2,Moderate,Minor,Surgical,Medicare,Medicare,,,,false,96974.54,18066.05
New York City,Kings,7002053,001304,NYU Langone Hospital-Brooklyn,70 or Older,112,F,White,Not Span/Hispanic,3,Elective,Skilled Nursing Home,2019,MUS006,OSTEOARTHRITIS,MST006,KNEE ARTHROPLASTY,302,KNEE JOINT REPLACEMENT,08,DISEASES AND DISORDERS OF THE MUSCULOSKELETAL SYSTEM AND CONNECTIVE TISSUE,2,Moderate,Minor,Surgical,Medicare,Blue Cross/Blue Shield,,,,false,103776.99,21293.1
New York City,Kings,7002053,001304,NYU Langone Hospital-Brooklyn,50 to 69,112,F,White,Not Span/Hispanic,2,Elective,Home w/ Home Health Services,2019,MUS006,OSTEOARTHRITIS,MST006,KNEE ARTHROPLASTY,302,KNEE JOINT REPLACEMENT,08,DISEASES AND DISORDERS OF THE MUSCULOSKELETAL SYSTEM AND CONNECTIVE TISSUE,2,Moderate,Minor,Surgical,Medicare,Medicaid,,,,false,97284.58,18068.14
New York City,Kings,7002053,001304,NYU Langone Hospital-Brooklyn,50 to 69,,F,White,Spanish/Hispanic,3,Elective,Home w/ Home Health Services,2019,MUS006,OSTEOARTHRITIS,MST006,KNEE ARTHROPLASTY,302,KNEE JOINT REPLACEMENT,08,DISEASES AND DISORDERS OF THE MUSCULOSKELETAL SYSTEM AND CONNECTIVE TISSUE,2,Moderate,Minor,Surgical,Medicare,,,,,false,108980.18,22282.65
New York City,Kings,7002053,001304,NYU Langone Hospital-Brooklyn,50 to 69,103,F,Other Race,Not Span/Hispanic,2,Elective,Home w/ Home Health Services,2019,MUS006,OSTEOARTHRITIS,MST006,KNEE ARTHROPLASTY,302,KNEE JOINT REPLACEMENT,08,DISEASES AND DISORDERS OF THE MUSCULOSKELETAL SYSTEM AND CONNECTIVE TISSUE,1,Minor,Minor,Surgical,Medicaid,,,,,false,96752.3,18751.02
New York City,Kings,7002053,001304,NYU Langone Hospital-Brooklyn,50 to 69,112,M,White,Not Span/Hispanic,2,Elective,Home w/ Home Health Services,2019,MUS006,OSTEOARTHRITIS,MST006,KNEE ARTHROPLASTY,302,KNEE JOINT REPLACEMENT,08,DISEASES AND DISORDERS OF THE MUSCULOSKELETAL SYSTEM AND CONNECTIVE TISSUE,2,Moderate,Minor,Surgical,Blue Cross/Blue Shield,,,,,false,120149.33,21768.71
New York City,Kings,7002053,001304,NYU Langone Hospital-Brooklyn,30 to 49,112,F,Other Race,Spanish/Hispanic,8,Elective,Skilled Nursing Home,2019,MUS006,OSTEOARTHRITIS,MST006,KNEE ARTHROPLASTY,302,KNEE JOINT REPLACEMENT,08,DISEASES AND DISORDERS OF THE MUSCULOSKELETAL SYSTEM AND CONNECTIVE TISSUE,2,Moderate,Minor,Surgical,Blue Cross/Blue Shield,,,,,false,192275.03,44932.95
New York City,Kings,7002053,001304,NYU Langone Hospital-Brooklyn,50 to 69,112,F,White,Not Span/Hispanic,6,Emergency,Skilled Nursing Home,2019,INJ005,"FRACTURE OF THE LOWER LIMB (EXCEPT HIP), INITIAL ENCOUNTER",MST006,KNEE ARTHROPLASTY,302,KNEE JOINT REPLACEMENT,08,DISEASES AND DISORDERS OF THE MUSCULOSKELETAL SYSTEM AND CONNECTIVE TISSUE,2,Moderate,Minor,Surgical,Medicare,Medicaid,,,,true,450544.79,79044.83
New York City,Kings,7002053,001304,NYU Langone Hospital-Brooklyn,50 to 69,112,F,White,Not Span/Hispanic,5,Elective,Home w/ Home Health Services,2019,MUS006,OSTEOARTHRITIS,MST006,KNEE ARTHROPLASTY,302,KNEE JOINT REPLACEMENT,08,DISEASES AND DISORDERS OF THE MUSCULOSKELETAL SYSTEM AND CONNECTIVE TISSUE,2,Moderate,Minor,Surgical,Blue Cross/Blue Shield,,,,,false,122803.03,28633.88
New York City,Kings,7002053,001304,NYU Langone Hospital-Brooklyn,50 to 69,112,F,White,Not Span/Hispanic,1,Elective,Home w/ Home Health Services,2019,MUS006,OSTEOARTHRITIS,MST006,KNEE ARTHROPLASTY,302,KNEE JOINT REPLACEMENT,08,DISEASES AND DISORDERS OF THE MUSCULOSKELETAL SYSTEM AND CONNECTIVE TISSUE,1,Minor,Minor,Surgical,Private Health Insurance,,,,,false,94042.46,16074.06
New York City,Kings,7002053,001304,NYU Langone Hospital-Brooklyn,70 or Older,112,F,White,Not Span/Hispanic,5,Elective,Home w/ Home Health Services,2019,MUS014,"PATHOLOGICAL FRACTURE, INITIAL ENCOUNTER",MST006,KNEE ARTHROPLASTY,302,KNEE JOINT REPLACEMENT,08,DISEASES AND DISORDERS OF THE MUSCULOSKELETAL SYSTEM AND CONNECTIVE TISSUE,2,Moderate,Moderate,Surgical,Medicare,Medicare,,,,false,208927.27,40969.61
New York City,Kings,7002053,001304,NYU Langone Hospital-Brooklyn,50 to 69,112,F,White,Unknown,2,Elective,Home w/ Home Health Services,2019,MUS006,OSTEOARTHRITIS,MST006,KNEE ARTHROPLASTY,302,KNEE JOINT REPLACEMENT,08,DISEASES AND DISORDERS OF THE MUSCULOSKELETAL SYSTEM AND CONNECTIVE TISSUE,2,Moderate,Minor,Surgical,Medicaid,,,,,false,124122.7,20888.45
New York City,Kings,7002053,001304,NYU Langone Hospital-Brooklyn,50 to 69,112,F,Other Race,Spanish/Hispanic,4,Elective,Home w/ Home Health Services,2019,INJ035,"COMPLICATION OF INTERNAL ORTHOPEDIC DEVICE OR IMPLANT, INITIAL ENCOUNTER",MST006,KNEE ARTHROPLASTY,302,KNEE JOINT REPLACEMENT,08,DISEASES AND DISORDERS OF THE MUSCULOSKELETAL SYSTEM AND CONNECTIVE TISSUE,2,Moderate,Minor,Surgical,Medicare,Medicaid,,,,false,400124.26,66405.96
New York City,Kings,7002053,001304,NYU Langone Hospital-Brooklyn,50 to 69,112,F,Black/African American,Not Span/Hispanic,5,Elective,Home w/ Home Health Services,2019,MUS006,OSTEOARTHRITIS,MST006,KNEE ARTHROPLASTY,302,KNEE JOINT REPLACEMENT,08,DISEASES AND DISORDERS OF THE MUSCULOSKELETAL SYSTEM AND CONNECTIVE TISSUE,1,Minor,Minor,Surgical,Blue Cross/Blue Shield,,,,,false,183158.98,37864.14
New York City,Kings,7002053,001304,NYU Langone Hospital-Brooklyn,50 to 69,112,F,White,Not Span/Hispanic,2,Elective,Home w/ Home Health Services,2019,MUS006,OSTEOARTHRITIS,MST006,KNEE ARTHROPLASTY,302,KNEE JOINT REPLACEMENT,08,DISEASES AND DISORDERS OF THE MUSCULOSKELETAL SYSTEM AND CONNECTIVE TISSUE,1,Minor,Minor,Surgical,Medicare,Private Health Insurance,,,,false,91345.86,17403.55