Hospital Service Area,Hospital County,Operating Certificate Number,Permanent Facility Id,Facility Name,Age Group,Zip Code - 3 digits,Gender,Race,Ethnicity,Length of Stay,Type of Admission,Patient Disposition,Discharge Year,CCS Diagnosis Code,CCS Diagnosis Description,CCS Procedure Code,CCS Procedure Description,APR DRG Code,APR DRG Description,APR MDC Code,APR MDC Description,APR Severity of Illness Code,APR Severity of Illness Description,APR Risk of Mortality,APR Medical Surgical Description,Payment Typology 1,Payment Typology 2,Payment Typology 3,Birth Weight,Abortion Edit Indicator,Emergency Department Indicator,Total Charges,Total Costs
Long Island,Suffolk,5123000,000885,Long Island Community Hospital,70 or Older,117,F,White,Not Span/Hispanic,2,Elective,Home w/ Home Health Services,2019,MUS006,OSTEOARTHRITIS,MST006,KNEE ARTHROPLASTY,302,KNEE JOINT REPLACEMENT,08,DISEASES AND DISORDERS OF THE MUSCULOSKELETAL SYSTEM AND CONNECTIVE TISSUE,1,Minor,Minor,Surgical,Medicare,Blue Cross/Blue Shield,,,,false,120548.33,19655.05
Long Island,Suffolk,5123000,000885,Long Island Community Hospital,50 to 69,117,F,White,Not Span/Hispanic,3,Elective,Home w/ Home Health Services,2019,MUS006,OSTEOARTHRITIS,MST006,KNEE ARTHROPLASTY,302,KNEE JOINT REPLACEMENT,08,DISEASES AND DISORDERS OF THE MUSCULOSKELETAL SYSTEM AND CONNECTIVE TISSUE,1,Minor,Minor,Surgical,Medicare,Medicare,Private Health Insurance,,,false,90141.08,16295.71
Long Island,Suffolk,5123000,000885,Long Island Community Hospital,30 to 49,117,F,Black/African American,Not Span/Hispanic,4,Elective,Home w/ Home Health Services,2019,MUS006,OSTEOARTHRITIS,MST006,KNEE ARTHROPLASTY,302,KNEE JOINT REPLACEMENT,08,DISEASES AND DISORDERS OF THE MUSCULOSKELETAL SYSTEM AND CONNECTIVE TISSUE,1,Minor,Minor,Surgical,Medicare,Medicare,Blue Cross/Blue Shield,,,false,92989.51,17204.82
Long Island,Suffolk,5123000,000885,Long Island Community Hospital,50 to 69,119,F,White,Not Span/Hispanic,3,Urgent,Home or Self Care,2019,MUS006,OSTEOARTHRITIS,MST006,KNEE ARTHROPLASTY,302,KNEE JOINT REPLACEMENT,08,DISEASES AND DISORDERS OF THE MUSCULOSKELETAL SYSTEM AND CONNECTIVE TISSUE,2,Moderate,Major,Surgical,Blue Cross/Blue Shield,Medicare,Medicare,,,false,94029.83,17122.49
Long Island,Suffolk,5123000,000885,Long Island Community Hospital,70 or Older,117,F,White,Not Span/Hispanic,2,Urgent,Home w/ Home Health Services,2019,MUS006,OSTEOARTHRITIS,MST006,KNEE ARTHROPLASTY,302,KNEE JOINT REPLACEMENT,08,DISEASES AND DISORDERS OF THE MUSCULOSKELETAL SYSTEM AND CONNECTIVE TISSUE,2,Moderate,Minor,Surgical,Medicare,Medicare,Blue Cross/Blue Shield,,,false,89925.39,15484.98
Long Island,Suffolk,5123000,000885,Long Island Community Hospital,50 to 69,119,F,White,Not Span/Hispanic,2,Elective,Home or Self Care,2019,MUS006,OSTEOARTHRITIS,MST006,KNEE ARTHROPLASTY,302,KNEE JOINT REPLACEMENT,08,DISEASES AND DISORDERS OF THE MUSCULOSKELETAL SYSTEM AND CONNECTIVE TISSUE,1,Minor,Minor,Surgical,Blue Cross/Blue Shield,Medicare,,,,false,81852.51,14552.23
Long Island,Suffolk,5123000,000885,Long Island Community Hospital,50 to 69,117,M,White,Not Span/Hispanic,4,Elective,Skilled Nursing Home,2019,MUS006,OSTEOARTHRITIS,MST006,KNEE ARTHROPLASTY,302,KNEE JOINT REPLACEMENT,08,DISEASES AND DISORDERS OF THE MUSCULOSKELETAL SYSTEM AND CONNECTIVE TISSUE,2,Moderate,Minor,Surgical,Medicare,Medicare,Medicaid,,,false,99040.89,18267.72
Long Island,Suffolk,5123000,000885,Long Island Community Hospital,50 to 69,117,M,White,Not Span/Hispanic,2,Urgent,Home or Self Care,2019,MUS006,OSTEOARTHRITIS,MST006,KNEE ARTHROPLASTY,302,KNEE JOINT REPLACEMENT,08,DISEASES AND DISORDERS OF THE MUSCULOSKELETAL SYSTEM AND CONNECTIVE TISSUE,1,Minor,Minor,Surgical,Private Health Insurance,Medicaid,,,,false,95789.47,16841.26
Long Island,Suffolk,5123000,000885,Long Island Community Hospital,50 to 69,117,F,White,Not Span/Hispanic,3,Elective,Home or Self Care,2019,MUS006,OSTEOARTHRITIS,MST006,KNEE ARTHROPLASTY,302,KNEE JOINT REPLACEMENT,08,DISEASES AND DISORDERS OF THE MUSCULOSKELETAL SYSTEM AND CONNECTIVE TISSUE,1,Minor,Minor,Surgical,Medicare,Medicare,Medicaid,,,false,88600.79,16276.71
Long Island,Suffolk,5123000,000885,Long Island Community Hospital,50 to 69,117,M,Other Race,Not Span/Hispanic,3,Elective,Skilled Nursing Home,2019,MUS006,OSTEOARTHRITIS,MST006,KNEE ARTHROPLASTY,302,KNEE JOINT REPLACEMENT,08,DISEASES AND DISORDERS OF THE MUSCULOSKELETAL SYSTEM AND CONNECTIVE TISSUE,1,Minor,Minor,Surgical,Medicare,Medicare,Private Health Insurance,,,false,79829.28,15051.6
Long Island,Suffolk,5123000,000885,Long Island Community Hospital,50 to 69,117,M,White,Not Span/Hispanic,3,Not Available,Home w/ Home Health Services,2019,MUS006,OSTEOARTHRITIS,MST006,KNEE ARTHROPLASTY,302,KNEE JOINT REPLACEMENT,08,DISEASES AND DISORDERS OF THE MUSCULOSKELETAL SYSTEM AND CONNECTIVE TISSUE,2,Moderate,Minor,Surgical,Medicare,Medicare,,,,false,82567.38,15286.73
Long Island,Suffolk,5123000,000885,Long Island Community Hospital,70 or Older,119,M,White,Not Span/Hispanic,7,Urgent,Skilled Nursing Home,2019,MUS006,OSTEOARTHRITIS,MST006,KNEE ARTHROPLASTY,302,KNEE JOINT REPLACEMENT,08,DISEASES AND DISORDERS OF THE MUSCULOSKELETAL SYSTEM AND CONNECTIVE TISSUE,2,Moderate,Minor,Surgical,Medicare,Medicare,Medicaid,,,false,116735.58,21951.3
Long Island,Suffolk,5123000,000885,Long Island Community Hospital,50 to 69,117,F,White,Not Span/Hispanic,5,Elective,Skilled Nursing Home,2019,MUS006,OSTEOARTHRITIS,MST006,KNEE ARTHROPLASTY,302,KNEE JOINT REPLACEMENT,08,DISEASES AND DISORDERS OF THE MUSCULOSKELETAL SYSTEM AND CONNECTIVE TISSUE,1,Minor,Minor,Surgical,Blue Cross/Blue Shield,,,,,false,108266.24,19792.18
Long Island,Suffolk,5123000,000885,Long Island Community Hospital,70 or Older,117,M,White,Not Span/Hispanic,5,Elective,Skilled Nursing Home,2019,MUS006,OSTEOARTHRITIS,MST006,KNEE ARTHROPLASTY,302,KNEE JOINT REPLACEMENT,08,DISEASES AND DISORDERS OF THE MUSCULOSKELETAL SYSTEM AND CONNECTIVE TISSUE,2,Moderate,Major,Surgical,Medicare,Medicare,Private Health Insurance,,,false,109303.48,19865.55
Long Island,Suffolk,5123000,000885,Long Island Community Hospital,50 to 69,119,F,White,Not Span/Hispanic,3,Urgent,Home w/ Home Health Services,2019,MUS006,OSTEOARTHRITIS,MST006,KNEE ARTHROPLASTY,302,KNEE JOINT REPLACEMENT,08,DISEASES AND DISORDERS OF THE MUSCULOSKELETAL SYSTEM AND CONNECTIVE TISSUE,1,Minor,Minor,Surgical,Private Health Insurance,,,,,false,86363.28,15674.66
Long Island,Suffolk,5123000,000885,Long Island Community Hospital,70 or Older,117,F,Black/African American,Not Span/Hispanic,3,Elective,Skilled Nursing Home,2019,MUS006,OSTEOARTHRITIS,MST006,KNEE ARTHROPLASTY,302,KNEE JOINT REPLACEMENT,08,DISEASES AND DISORDERS OF THE MUSCULOSKELETAL SYSTEM AND CONNECTIVE TISSUE,2,Moderate,Minor,Surgical,Medicare,,,,,false,121110.01,20390.08
Long Island,Suffolk,5123000,000885,Long Island Community Hospital,50 to 69,119,F,White,Not Span/Hispanic,5,Elective,Skilled Nursing Home,2019,MUS006,OSTEOARTHRITIS,MST006,KNEE ARTHROPLASTY,302,KNEE JOINT REPLACEMENT,08,DISEASES AND DISORDERS OF THE MUSCULOSKELETAL SYSTEM AND CONNECTIVE TISSUE,1,Minor,Minor,Surgical,Medicare,,,,,false,98541.93,18465.52
Long Island,Suffolk,5123000,000885,Long Island Community Hospital,70 or Older,117,F,White,Not Span/Hispanic,4,Elective,Skilled Nursing Home,2019,MUS006,OSTEOARTHRITIS,MST006,KNEE ARTHROPLASTY,302,KNEE JOINT REPLACEMENT,08,DISEASES AND DISORDERS OF THE MUSCULOSKELETAL SYSTEM AND CONNECTIVE TISSUE,1,Minor,Minor,Surgical,Medicare,Medicare,Private Health Insurance,,,false,98019.36,18118.94
Long Island,Suffolk,5123000,000885,Long Island Community Hospital,50 to 69,117,M,White,Not Span/Hispanic,3,Elective,Home w/ Home Health Services,2019,MUS006,OSTEOARTHRITIS,MST006,KNEE ARTHROPLASTY,302,KNEE JOINT REPLACEMENT,08,DISEASES AND DISORDERS OF THE MUSCULOSKELETAL SYSTEM AND CONNECTIVE TISSUE,2,Moderate,Minor,Surgical,Blue Cross/Blue Shield,Private Health Insurance,,,,false,100709.64,18155.09
Long Island,Suffolk,5123000,000885,Long Island Community Hospital,70 or Older,117,M,White,Not Span/Hispanic,1,Not Available,Home or Self Care,2019,MUS006,OSTEOARTHRITIS,MST006,KNEE ARTHROPLASTY,302,KNEE JOINT REPLACEMENT,08,DISEASES AND DISORDERS OF THE MUSCULOSKELETAL SYSTEM AND CONNECTIVE TISSUE,1,Minor,Minor,Surgical,Medicare,Medicare,Private Health Insurance,,,false,87618.83,14890.04
Long Island,Suffolk,5123000,000885,Long Island Community Hospital,50 to 69,117,F,White,Not Span/Hispanic,2,Urgent,Home w/ Home Health Services,2019,MUS006,OSTEOARTHRITIS,MST006,KNEE ARTHROPLASTY,302,KNEE JOINT REPLACEMENT,08,DISEASES AND DISORDERS OF THE MUSCULOSKELETAL SYSTEM AND CONNECTIVE TISSUE,2,Moderate,Minor,Surgical,Private Health Insurance,,,,,false,84533.11,14972.6
Long Island,Suffolk,5123000,000885,Long Island Community Hospital,70 or Older,117,M,White,Not Span/Hispanic,3,Urgent,Skilled Nursing Home,2019,MUS006,OSTEOARTHRITIS,MST006,KNEE ARTHROPLASTY,302,KNEE JOINT REPLACEMENT,08,DISEASES AND DISORDERS OF THE MUSCULOSKELETAL SYSTEM AND CONNECTIVE TISSUE,1,Minor,Minor,Surgical,Medicare,Medicare,Blue Cross/Blue Shield,,,false,90690.77,16356.36
Long Island,Suffolk,5123000,000885,Long Island Community Hospital,50 to 69,117,F,White,Not Span/Hispanic,4,Elective,Home w/ Home Health Services,2019,MUS006,OSTEOARTHRITIS,MST006,KNEE ARTHROPLASTY,302,KNEE JOINT REPLACEMENT,08,DISEASES AND DISORDERS OF THE MUSCULOSKELETAL SYSTEM AND CONNECTIVE TISSUE,1,Minor,Minor,Surgical,Private Health Insurance,,,,,false,102134.89,18407.16
Long Island,Suffolk,5123000,000885,Long Island Community Hospital,30 to 49,119,F,Other Race,Not Span/Hispanic,4,Elective,Home or Self Care,2019,MUS006,OSTEOARTHRITIS,MST006,KNEE ARTHROPLASTY,302,KNEE JOINT REPLACEMENT,08,DISEASES AND DISORDERS OF THE MUSCULOSKELETAL SYSTEM AND CONNECTIVE TISSUE,2,Moderate,Minor,Surgical,Private Health Insurance,Blue Cross/Blue Shield,,,,false,96670.88,15575.84
Long Island,Suffolk,5123000,000885,Long Island Community Hospital,70 or Older,119,F,White,Not Span/Hispanic,2,Elective,Home w/ Home Health Services,2019,MUS006,OSTEOARTHRITIS,MST006,KNEE ARTHROPLASTY,302,KNEE JOINT REPLACEMENT,08,DISEASES AND DISORDERS OF THE MUSCULOSKELETAL SYSTEM AND CONNECTIVE TISSUE,2,Moderate,Minor,Surgical,Medicare,Medicare,Private Health Insurance,,,false,87384.05,15559.42
Long Island,Suffolk,5123000,000885,Long Island Community Hospital,70 or Older,117,F,White,Not Span/Hispanic,5,Elective,Home or Self Care,2019,MUS006,OSTEOARTHRITIS,MST006,KNEE ARTHROPLASTY,302,KNEE JOINT REPLACEMENT,08,DISEASES AND DISORDERS OF THE MUSCULOSKELETAL SYSTEM AND CONNECTIVE TISSUE,2,Moderate,Moderate,Surgical,Medicare,Medicare,Private Health Insurance,,,false,135201.32,23371.48
Long Island,Suffolk,5123000,000885,Long Island Community Hospital,50 to 69,117,F,White,Not Span/Hispanic,3,Elective,Home or Self Care,2019,MUS006,OSTEOARTHRITIS,MST006,KNEE ARTHROPLASTY,302,KNEE JOINT REPLACEMENT,08,DISEASES AND DISORDERS OF THE MUSCULOSKELETAL SYSTEM AND CONNECTIVE TISSUE,1,Minor,Minor,Surgical,Private Health Insurance,,,,,false,94153.84,16798.41
Long Island,Suffolk,5123000,000885,Long Island Community Hospital,50 to 69,117,F,Black/African American,Not Span/Hispanic,2,Elective,Home w/ Home Health Services,2019,MUS006,OSTEOARTHRITIS,MST006,KNEE ARTHROPLASTY,302,KNEE JOINT REPLACEMENT,08,DISEASES AND DISORDERS OF THE MUSCULOSKELETAL SYSTEM AND CONNECTIVE TISSUE,1,Minor,Minor,Surgical,Medicare,Medicare,Blue Cross/Blue Shield,,,false,88263.56,15373.22
Long Island,Suffolk,5123000,000885,Long Island Community Hospital,50 to 69,117,M,White,Not Span/Hispanic,2,Elective,Home w/ Home Health Services,2019,MUS006,OSTEOARTHRITIS,MST006,KNEE ARTHROPLASTY,302,KNEE JOINT REPLACEMENT,08,DISEASES AND DISORDERS OF THE MUSCULOSKELETAL SYSTEM AND CONNECTIVE TISSUE,1,Minor,Minor,Surgical,Blue Cross/Blue Shield,,,,,false,84419.95,14916.62
Long Island,Suffolk,5123000,000885,Long Island Community Hospital,50 to 69,119,F,White,Not Span/Hispanic,3,Elective,Skilled Nursing Home,2019,MUS006,OSTEOARTHRITIS,MST006,KNEE ARTHROPLASTY,302,KNEE JOINT REPLACEMENT,08,DISEASES AND DISORDERS OF THE MUSCULOSKELETAL SYSTEM AND CONNECTIVE TISSUE,2,Moderate,Minor,Surgical,Medicare,Medicare,Blue Cross/Blue Shield,,,false,82968.28,15210.25
Long Island,Suffolk,5123000,000885,Long Island Community Hospital,70 or Older,119,F,Other Race,Not Span/Hispanic,4,Elective,Skilled Nursing Home,2019,MUS006,OSTEOARTHRITIS,MST006,KNEE ARTHROPLASTY,302,KNEE JOINT REPLACEMENT,08,DISEASES AND DISORDERS OF THE MUSCULOSKELETAL SYSTEM AND CONNECTIVE TISSUE,1,Minor,Minor,Surgical,Medicare,Medicare,Medicaid,,,false,87695.37,16334.52
Long Island,Suffolk,5123000,000885,Long Island Community Hospital,50 to 69,117,F,White,Not Span/Hispanic,6,Elective,Skilled Nursing Home,2019,MUS006,OSTEOARTHRITIS,MST006,KNEE ARTHROPLASTY,302,KNEE JOINT REPLACEMENT,08,DISEASES AND DISORDERS OF THE MUSCULOSKELETAL SYSTEM AND CONNECTIVE TISSUE,1,Minor,Minor,Surgical,Medicare,,,,,false,102378.32,19752.7
Long Island,Suffolk,5123000,000885,Long Island Community Hospital,70 or Older,117,F,White,Not Span/Hispanic,4,Elective,Skilled Nursing Home,2019,MUS006,OSTEOARTHRITIS,MST006,KNEE ARTHROPLASTY,302,KNEE JOINT REPLACEMENT,08,DISEASES AND DISORDERS OF THE MUSCULOSKELETAL SYSTEM AND CONNECTIVE TISSUE,2,Moderate,Moderate,Surgical,Medicare,Medicare,Blue Cross/Blue Shield,,,false,88804.11,16507.38
Long Island,Suffolk,5123000,000885,Long Island Community Hospital,70 or Older,119,M,White,Not Span/Hispanic,3,Elective,Skilled Nursing Home,2019,MUS006,OSTEOARTHRITIS,MST006,KNEE ARTHROPLASTY,302,KNEE JOINT REPLACEMENT,08,DISEASES AND DISORDERS OF THE MUSCULOSKELETAL SYSTEM AND CONNECTIVE TISSUE,1,Minor,Minor,Surgical,Private Health Insurance,,,,,false,95207.82,16357.95
Long Island,Suffolk,5123000,000885,Long Island Community Hospital,50 to 69,119,F,Black/African American,Not Span/Hispanic,2,Elective,Home w/ Home Health Services,2019,MUS006,OSTEOARTHRITIS,MST006,KNEE ARTHROPLASTY,302,KNEE JOINT REPLACEMENT,08,DISEASES AND DISORDERS OF THE MUSCULOSKELETAL SYSTEM AND CONNECTIVE TISSUE,1,Minor,Minor,Surgical,Private Health Insurance,,,,,false,78904.56,14250.49
Long Island,Suffolk,5123000,000885,Long Island Community Hospital,50 to 69,117,M,White,Not Span/Hispanic,2,Elective,Home w/ Home Health Services,2019,MUS006,OSTEOARTHRITIS,MST006,KNEE ARTHROPLASTY,302,KNEE JOINT REPLACEMENT,08,DISEASES AND DISORDERS OF THE MUSCULOSKELETAL SYSTEM AND CONNECTIVE TISSUE,2,Moderate,Minor,Surgical,Blue Cross/Blue Shield,,,,,false,88110.69,15565.19
Long Island,Suffolk,5123000,000885,Long Island Community Hospital,70 or Older,119,M,White,Not Span/Hispanic,2,Elective,Home w/ Home Health Services,2019,MUS006,OSTEOARTHRITIS,MST006,KNEE ARTHROPLASTY,302,KNEE JOINT REPLACEMENT,08,DISEASES AND DISORDERS OF THE MUSCULOSKELETAL SYSTEM AND CONNECTIVE TISSUE,2,Moderate,Minor,Surgical,Medicare,Medicare,Blue Cross/Blue Shield,,,false,77427.38,14055.98
Long Island,Suffolk,5123000,000885,Long Island Community Hospital,70 or Older,117,M,White,Not Span/Hispanic,3,Elective,Home or Self Care,2019,MUS006,OSTEOARTHRITIS,MST006,KNEE ARTHROPLASTY,302,KNEE JOINT REPLACEMENT,08,DISEASES AND DISORDERS OF THE MUSCULOSKELETAL SYSTEM AND CONNECTIVE TISSUE,2,Moderate,Moderate,Surgical,Medicare,Medicare,Private Health Insurance,,,false,100304.49,17831.98
Long Island,Suffolk,5123000,000885,Long Island Community Hospital,50 to 69,119,M,White,Not Span/Hispanic,3,Elective,Skilled Nursing Home,2019,MUS006,OSTEOARTHRITIS,MST006,KNEE ARTHROPLASTY,302,KNEE JOINT REPLACEMENT,08,DISEASES AND DISORDERS OF THE MUSCULOSKELETAL SYSTEM AND CONNECTIVE TISSUE,1,Minor,Minor,Surgical,Medicare,Medicare,Private Health Insurance,,,false,91354.32,16613.27
Long Island,Suffolk,5123000,000885,Long Island Community Hospital,70 or Older,119,M,White,Not Span/Hispanic,1,Elective,Home w/ Home Health Services,2019,MUS006,OSTEOARTHRITIS,MST006,KNEE ARTHROPLASTY,302,KNEE JOINT REPLACEMENT,08,DISEASES AND DISORDERS OF THE MUSCULOSKELETAL SYSTEM AND CONNECTIVE TISSUE,2,Moderate,Minor,Surgical,Medicare,Medicare,Private Health Insurance,,,false,73037.91,12903.72
Long Island,Suffolk,5123000,000885,Long Island Community Hospital,50 to 69,117,F,White,Not Span/Hispanic,3,Elective,Home w/ Home Health Services,2019,MUS006,OSTEOARTHRITIS,MST006,KNEE ARTHROPLASTY,302,KNEE JOINT REPLACEMENT,08,DISEASES AND DISORDERS OF THE MUSCULOSKELETAL SYSTEM AND CONNECTIVE TISSUE,1,Minor,Minor,Surgical,Medicare,Medicare,Medicaid,,,false,84552.63,15536.68
Long Island,Suffolk,5123000,000885,Long Island Community Hospital,50 to 69,117,F,White,Not Span/Hispanic,7,Elective,Skilled Nursing Home,2019,MUS006,OSTEOARTHRITIS,MST006,KNEE ARTHROPLASTY,302,KNEE JOINT REPLACEMENT,08,DISEASES AND DISORDERS OF THE MUSCULOSKELETAL SYSTEM AND CONNECTIVE TISSUE,2,Moderate,Minor,Surgical,Blue Cross/Blue Shield,,,,,false,100371.76,20104.69
Long Island,Suffolk,5123000,000885,Long Island Community Hospital,70 or Older,117,F,White,Not Span/Hispanic,5,Elective,Home w/ Home Health Services,2019,MUS006,OSTEOARTHRITIS,MST006,KNEE ARTHROPLASTY,302,KNEE JOINT REPLACEMENT,08,DISEASES AND DISORDERS OF THE MUSCULOSKELETAL SYSTEM AND CONNECTIVE TISSUE,2,Moderate,Minor,Surgical,Medicare,Medicare,,,,false,108396.04,19807.2
Long Island,Suffolk,5123000,000885,Long Island Community Hospital,50 to 69,117,M,White,Not Span/Hispanic,2,Elective,Home w/ Home Health Services,2019,MUS006,OSTEOARTHRITIS,MST006,KNEE ARTHROPLASTY,302,KNEE JOINT REPLACEMENT,08,DISEASES AND DISORDERS OF THE MUSCULOSKELETAL SYSTEM AND CONNECTIVE TISSUE,1,Minor,Minor,Surgical,Medicare,Medicare,Private Health Insurance,,,false,86591.56,15371.68
Long Island,Suffolk,5123000,000885,Long Island Community Hospital,50 to 69,119,F,White,Not Span/Hispanic,4,Elective,Skilled Nursing Home,2019,MUS006,OSTEOARTHRITIS,MST006,KNEE ARTHROPLASTY,302,KNEE JOINT REPLACEMENT,08,DISEASES AND DISORDERS OF THE MUSCULOSKELETAL SYSTEM AND CONNECTIVE TISSUE,2,Moderate,Minor,Surgical,Private Health Insurance,Medicare,,,,false,87180.17,16479.25
Long Island,Suffolk,5123000,000885,Long Island Community Hospital,50 to 69,117,F,White,Not Span/Hispanic,5,Elective,Skilled Nursing Home,2019,MUS006,OSTEOARTHRITIS,MST006,KNEE ARTHROPLASTY,302,KNEE JOINT REPLACEMENT,08,DISEASES AND DISORDERS OF THE MUSCULOSKELETAL SYSTEM AND CONNECTIVE TISSUE,2,Moderate,Moderate,Surgical,Private Health Insurance,Medicaid,,,,false,111587.62,20055.61
Long Island,Suffolk,5123000,000885,Long Island Community Hospital,50 to 69,119,M,White,Not Span/Hispanic,3,Elective,Home or Self Care,2019,MUS006,OSTEOARTHRITIS,MST006,KNEE ARTHROPLASTY,302,KNEE JOINT REPLACEMENT,08,DISEASES AND DISORDERS OF THE MUSCULOSKELETAL SYSTEM AND CONNECTIVE TISSUE,1,Minor,Minor,Surgical,Private Health Insurance,,,,,false,85117.05,15816.61
Long Island,Suffolk,5123000,000885,Long Island Community Hospital,70 or Older,117,F,White,Not Span/Hispanic,5,Elective,Skilled Nursing Home,2019,MUS006,OSTEOARTHRITIS,MST006,KNEE ARTHROPLASTY,302,KNEE JOINT REPLACEMENT,08,DISEASES AND DISORDERS OF THE MUSCULOSKELETAL SYSTEM AND CONNECTIVE TISSUE,2,Moderate,Minor,Surgical,Medicare,Medicare,Private Health Insurance,,,false,95351.82,18173.95
Long Island,Suffolk,5123000,000885,Long Island Community Hospital,50 to 69,117,F,White,Not Span/Hispanic,8,Elective,Skilled Nursing Home,2019,MUS006,OSTEOARTHRITIS,MST006,KNEE ARTHROPLASTY,302,KNEE JOINT REPLACEMENT,08,DISEASES AND DISORDERS OF THE MUSCULOSKELETAL SYSTEM AND CONNECTIVE TISSUE,2,Moderate,Moderate,Surgical,Medicare,Medicare,Medicaid,,,false,110203.45,21835.4
Long Island,Suffolk,5123000,000885,Long Island Community Hospital,70 or Older,117,M,White,Not Span/Hispanic,2,Elective,Home w/ Home Health Services,2019,MUS006,OSTEOARTHRITIS,MST006,KNEE ARTHROPLASTY,302,KNEE JOINT REPLACEMENT,08,DISEASES AND DISORDERS OF THE MUSCULOSKELETAL SYSTEM AND CONNECTIVE TISSUE,1,Minor,Minor,Surgical,Medicare,Medicare,Private Health Insurance,,,false,81564.33,14745.74
