Hospital Service Area,Hospital County,Operating Certificate Number,Permanent Facility Id,Facility Name,Age Group,Zip Code - 3 digits,Gender,Race,Ethnicity,Length of Stay,Type of Admission,Patient Disposition,Discharge Year,CCS Diagnosis Code,CCS Diagnosis Description,CCS Procedure Code,CCS Procedure Description,APR DRG Code,APR DRG Description,APR MDC Code,APR MDC Description,APR Severity of Illness Code,APR Severity of Illness Description,APR Risk of Mortality,APR Medical Surgical Description,Payment Typology 1,Payment Typology 2,Payment Typology 3,Birth Weight,Abortion Edit Indicator,Emergency Department Indicator,Total Charges,Total Costs
Long Island,Nassau,2908000,000511,NYU Langone Hospital-Long Island,70 or Older,118,F,White,Not Span/Hispanic,2,Elective,Inpatient Rehabilitation Facility,2020,MUS006,OSTEOARTHRITIS,MST006,KNEE ARTHROPLASTY,302,KNEE JOINT REPLACEMENT,08,DISEASES AND DISORDERS OF THE MUSCULOSKELETAL SYSTEM AND CONNECTIVE TISSUE,2,Moderate,Minor,Surgical,Medicare,Private Health Insurance,,,,N,290385.98,43858.12
Long Island,Nassau,2908000,000511,NYU Langone Hospital-Long Island,50 to 69,115,F,White,Not Span/Hispanic,1,Elective,Home w/ Home Health Services,2020,MUS006,OSTEOARTHRITIS,MST006,KNEE ARTHROPLASTY,302,KNEE JOINT REPLACEMENT,08,DISEASES AND DISORDERS OF THE MUSCULOSKELETAL SYSTEM AND CONNECTIVE TISSUE,1,Minor,Minor,Surgical,Blue Cross/Blue Shield,,,,,N,179637.78,27001.03
Long Island,Nassau,2908000,000511,NYU Langone Hospital-Long Island,50 to 69,117,F,White,Not Span/Hispanic,2,Elective,Home w/ Home Health Services,2020,MUS006,OSTEOARTHRITIS,MST006,KNEE ARTHROPLASTY,302,KNEE JOINT REPLACEMENT,08,DISEASES AND DISORDERS OF THE MUSCULOSKELETAL SYSTEM AND CONNECTIVE TISSUE,2,Moderate,Minor,Surgical,Blue Cross/Blue Shield,,,,,N,207434.36,33055.16
Long Island,Nassau,2908000,000511,NYU Langone Hospital-Long Island,50 to 69,115,F,White,Not Span/Hispanic,3,Elective,Home w/ Home Health Services,2020,MUS006,OSTEOARTHRITIS,MST006,KNEE ARTHROPLASTY,302,KNEE JOINT REPLACEMENT,08,DISEASES AND DISORDERS OF THE MUSCULOSKELETAL SYSTEM AND CONNECTIVE TISSUE,1,Minor,Minor,Surgical,Private Health Insurance,Private Health Insurance,,,,N,195196.29,33678.77
Long Island,Nassau,2908000,000511,NYU Langone Hospital-Long Island,50 to 69,115,M,White,Not Span/Hispanic,1,Elective,Home w/ Home Health Services,2020,MUS006,OSTEOARTHRITIS,MST006,KNEE ARTHROPLASTY,302,KNEE JOINT REPLACEMENT,08,DISEASES AND DISORDERS OF THE MUSCULOSKELETAL SYSTEM AND CONNECTIVE TISSUE,2,Moderate,Minor,Surgical,Private Health Insurance,,,,,N,143538.11,21977.14
Long Island,Nassau,2908000,000511,NYU Langone Hospital-Long Island,50 to 69,114,F,Other Race,Not Span/Hispanic,2,Elective,Home w/ Home Health Services,2020,MUS006,OSTEOARTHRITIS,MST006,KNEE ARTHROPLASTY,302,KNEE JOINT REPLACEMENT,08,DISEASES AND DISORDERS OF THE MUSCULOSKELETAL SYSTEM AND CONNECTIVE TISSUE,2,Moderate,Moderate,Surgical,Private Health Insurance,,,,,N,245776.6,37379.51
Long Island,Nassau,2908000,000511,NYU Langone Hospital-Long Island,30 to 49,117,F,Black/African American,Not Span/Hispanic,2,Elective,Home w/ Home Health Services,2020,MUS006,OSTEOARTHRITIS,MST006,KNEE ARTHROPLASTY,302,KNEE JOINT REPLACEMENT,08,DISEASES AND DISORDERS OF THE MUSCULOSKELETAL SYSTEM AND CONNECTIVE TISSUE,1,Minor,Moderate,Surgical,Blue Cross/Blue Shield,,,,,N,191620.7,30927.11
Long Island,Nassau,2908000,000511,NYU Langone Hospital-Long Island,50 to 69,115,F,White,Not Span/Hispanic,1,Elective,Home w/ Home Health Services,2020,MUS006,OSTEOARTHRITIS,MST006,KNEE ARTHROPLASTY,302,KNEE JOINT REPLACEMENT,08,DISEASES AND DISORDERS OF THE MUSCULOSKELETAL SYSTEM AND CONNECTIVE TISSUE,1,Minor,Minor,Surgical,Blue Cross/Blue Shield,,,,,N,226176.97,33475.54
Long Island,Nassau,2908000,000511,NYU Langone Hospital-Long Island,70 or Older,117,F,White,Not Span/Hispanic,1,Elective,Home w/ Home Health Services,2020,MUS006,OSTEOARTHRITIS,MST006,KNEE ARTHROPLASTY,302,KNEE JOINT REPLACEMENT,08,DISEASES AND DISORDERS OF THE MUSCULOSKELETAL SYSTEM AND CONNECTIVE TISSUE,1,Minor,Minor,Surgical,Private Health Insurance,Medicare,,,,N,225557.91,33409.04
Long Island,Nassau,2908000,000511,NYU Langone Hospital-Long Island,50 to 69,115,F,White,Not Span/Hispanic,2,Elective,Home w/ Home Health Services,2020,MUS006,OSTEOARTHRITIS,MST006,KNEE ARTHROPLASTY,302,KNEE JOINT REPLACEMENT,08,DISEASES AND DISORDERS OF THE MUSCULOSKELETAL SYSTEM AND CONNECTIVE TISSUE,2,Moderate,Minor,Surgical,Blue Cross/Blue Shield,,,,,N,235369,36836.89
Long Island,Nassau,2908000,000511,NYU Langone Hospital-Long Island,70 or Older,115,F,White,Not Span/Hispanic,2,Elective,Home w/ Home Health Services,2020,MUS006,OSTEOARTHRITIS,MST006,KNEE ARTHROPLASTY,302,KNEE JOINT REPLACEMENT,08,DISEASES AND DISORDERS OF THE MUSCULOSKELETAL SYSTEM AND CONNECTIVE TISSUE,1,Minor,Minor,Surgical,Medicare,Medicare,,,,N,313830.22,47934.42
Long Island,Nassau,2908000,000511,NYU Langone Hospital-Long Island,50 to 69,115,F,White,Not Span/Hispanic,1,Elective,Home or Self Care,2020,MUS006,OSTEOARTHRITIS,MST006,KNEE ARTHROPLASTY,302,KNEE JOINT REPLACEMENT,08,DISEASES AND DISORDERS OF THE MUSCULOSKELETAL SYSTEM AND CONNECTIVE TISSUE,1,Minor,Minor,Surgical,Private Health Insurance,,,,,N,145195,22180.34
Long Island,Nassau,2908000,000511,NYU Langone Hospital-Long Island,50 to 69,115,F,White,Spanish/Hispanic,2,Elective,Home w/ Home Health Services,2020,MUS006,OSTEOARTHRITIS,MST006,KNEE ARTHROPLASTY,302,KNEE JOINT REPLACEMENT,08,DISEASES AND DISORDERS OF THE MUSCULOSKELETAL SYSTEM AND CONNECTIVE TISSUE,2,Moderate,Minor,Surgical,Private Health Insurance,,,,,N,225459.17,35634.08
Long Island,Nassau,2908000,000511,NYU Langone Hospital-Long Island,50 to 69,117,F,White,Not Span/Hispanic,2,Elective,Home w/ Home Health Services,2020,MUS006,OSTEOARTHRITIS,MST006,KNEE ARTHROPLASTY,302,KNEE JOINT REPLACEMENT,08,DISEASES AND DISORDERS OF THE MUSCULOSKELETAL SYSTEM AND CONNECTIVE TISSUE,1,Minor,Minor,Surgical,Medicare,Medicaid,,,,N,219458.11,34797.43
Long Island,Nassau,2908000,000511,NYU Langone Hospital-Long Island,70 or Older,113,F,White,Not Span/Hispanic,2,Elective,Home w/ Home Health Services,2020,MUS006,OSTEOARTHRITIS,MST006,KNEE ARTHROPLASTY,302,KNEE JOINT REPLACEMENT,08,DISEASES AND DISORDERS OF THE MUSCULOSKELETAL SYSTEM AND CONNECTIVE TISSUE,2,Moderate,Minor,Surgical,Medicare,Private Health Insurance,Blue Cross/Blue Shield,,,N,240188.52,37641.31
Long Island,Nassau,2908000,000511,NYU Langone Hospital-Long Island,70 or Older,115,M,White,Not Span/Hispanic,2,Elective,Home or Self Care,2020,MUS006,OSTEOARTHRITIS,MST006,KNEE ARTHROPLASTY,302,KNEE JOINT REPLACEMENT,08,DISEASES AND DISORDERS OF THE MUSCULOSKELETAL SYSTEM AND CONNECTIVE TISSUE,2,Moderate,Minor,Surgical,Medicare,Medicare,,,,N,185607,29913.45
Long Island,Nassau,2908000,000511,NYU Langone Hospital-Long Island,70 or Older,117,M,White,Not Span/Hispanic,2,Elective,Home w/ Home Health Services,2020,MUS006,OSTEOARTHRITIS,MST006,KNEE ARTHROPLASTY,302,KNEE JOINT REPLACEMENT,08,DISEASES AND DISORDERS OF THE MUSCULOSKELETAL SYSTEM AND CONNECTIVE TISSUE,2,Moderate,Minor,Surgical,Medicare,Blue Cross/Blue Shield,,,,N,189788.17,30572.85
Long Island,Nassau,2908000,000511,NYU Langone Hospital-Long Island,50 to 69,112,M,Black/African American,Not Span/Hispanic,2,Elective,Home w/ Home Health Services,2020,MUS006,OSTEOARTHRITIS,MST006,KNEE ARTHROPLASTY,302,KNEE JOINT REPLACEMENT,08,DISEASES AND DISORDERS OF THE MUSCULOSKELETAL SYSTEM AND CONNECTIVE TISSUE,1,Minor,Moderate,Surgical,Private Health Insurance,,,,,N,206123.36,31948.42
Long Island,Nassau,2908000,000511,NYU Langone Hospital-Long Island,70 or Older,115,F,White,Not Span/Hispanic,5,Elective,Skilled Nursing Home,2020,FAC010,OTHER AFTERCARE ENCOUNTER,MST006,KNEE ARTHROPLASTY,302,KNEE JOINT REPLACEMENT,08,DISEASES AND DISORDERS OF THE MUSCULOSKELETAL SYSTEM AND CONNECTIVE TISSUE,2,Moderate,Moderate,Surgical,Medicare,Blue Cross/Blue Shield,,,,N,591173.79,92962.38
Long Island,Nassau,2908000,000511,NYU Langone Hospital-Long Island,70 or Older,114,F,White,Spanish/Hispanic,2,Elective,Home w/ Home Health Services,2020,MUS006,OSTEOARTHRITIS,MST006,KNEE ARTHROPLASTY,302,KNEE JOINT REPLACEMENT,08,DISEASES AND DISORDERS OF THE MUSCULOSKELETAL SYSTEM AND CONNECTIVE TISSUE,2,Moderate,Minor,Surgical,Blue Cross/Blue Shield,,,,,N,258130.19,39781.41
Long Island,Nassau,2908000,000511,NYU Langone Hospital-Long Island,70 or Older,113,M,White,Not Span/Hispanic,1,Elective,Home w/ Home Health Services,2020,MUS006,OSTEOARTHRITIS,MST006,KNEE ARTHROPLASTY,302,KNEE JOINT REPLACEMENT,08,DISEASES AND DISORDERS OF THE MUSCULOSKELETAL SYSTEM AND CONNECTIVE TISSUE,1,Minor,Minor,Surgical,Medicare,,,,,N,237630.34,34958.14
Long Island,Nassau,2908000,000511,NYU Langone Hospital-Long Island,50 to 69,115,F,White,Not Span/Hispanic,2,Elective,Home w/ Home Health Services,2020,MUS006,OSTEOARTHRITIS,MST006,KNEE ARTHROPLASTY,302,KNEE JOINT REPLACEMENT,08,DISEASES AND DISORDERS OF THE MUSCULOSKELETAL SYSTEM AND CONNECTIVE TISSUE,2,Moderate,Minor,Surgical,Private Health Insurance,,,,,N,190273.46,30687.77
Long Island,Nassau,2908000,000511,NYU Langone Hospital-Long Island,50 to 69,117,F,White,Not Span/Hispanic,2,Elective,Home w/ Home Health Services,2020,MUS006,OSTEOARTHRITIS,MST006,KNEE ARTHROPLASTY,302,KNEE JOINT REPLACEMENT,08,DISEASES AND DISORDERS OF THE MUSCULOSKELETAL SYSTEM AND CONNECTIVE TISSUE,1,Minor,Minor,Surgical,Medicare,Private Health Insurance,,,,N,212990.59,33878.9
Long Island,Nassau,2908000,000511,NYU Langone Hospital-Long Island,70 or Older,115,M,White,Not Span/Hispanic,3,Elective,Home w/ Home Health Services,2020,MUS006,OSTEOARTHRITIS,MST006,KNEE ARTHROPLASTY,302,KNEE JOINT REPLACEMENT,08,DISEASES AND DISORDERS OF THE MUSCULOSKELETAL SYSTEM AND CONNECTIVE TISSUE,3,Major,Moderate,Surgical,Medicare,Medicare,,,,N,194194.12,33135.63
Long Island,Nassau,2908000,000511,NYU Langone Hospital-Long Island,50 to 69,117,M,White,Not Span/Hispanic,1,Elective,Home w/ Home Health Services,2020,MUS006,OSTEOARTHRITIS,MST006,KNEE ARTHROPLASTY,302,KNEE JOINT REPLACEMENT,08,DISEASES AND DISORDERS OF THE MUSCULOSKELETAL SYSTEM AND CONNECTIVE TISSUE,1,Minor,Minor,Surgical,Blue Cross/Blue Shield,,,,,N,181864.96,27309.48
Long Island,Nassau,2908000,000511,NYU Langone Hospital-Long Island,50 to 69,115,M,Black/African American,Not Span/Hispanic,1,Elective,Home w/ Home Health Services,2020,MUS006,OSTEOARTHRITIS,MST006,KNEE ARTHROPLASTY,302,KNEE JOINT REPLACEMENT,08,DISEASES AND DISORDERS OF THE MUSCULOSKELETAL SYSTEM AND CONNECTIVE TISSUE,1,Minor,Minor,Surgical,Private Health Insurance,,,,,N,211522.85,31439.54
Long Island,Nassau,2908000,000511,NYU Langone Hospital-Long Island,70 or Older,,F,Black/African American,Spanish/Hispanic,2,Elective,Home w/ Home Health Services,2020,MUS006,OSTEOARTHRITIS,MST006,KNEE ARTHROPLASTY,302,KNEE JOINT REPLACEMENT,08,DISEASES AND DISORDERS OF THE MUSCULOSKELETAL SYSTEM AND CONNECTIVE TISSUE,2,Moderate,Major,Surgical,Medicare,Medicaid,,,,N,228780.45,36069.91
Long Island,Nassau,2908000,000511,NYU Langone Hospital-Long Island,50 to 69,115,M,White,Not Span/Hispanic,3,Elective,Home w/ Home Health Services,2020,MUS006,OSTEOARTHRITIS,MST006,KNEE ARTHROPLASTY,302,KNEE JOINT REPLACEMENT,08,DISEASES AND DISORDERS OF THE MUSCULOSKELETAL SYSTEM AND CONNECTIVE TISSUE,2,Moderate,Minor,Surgical,Private Health Insurance,,,,,N,273937.72,44410.05
Long Island,Nassau,2908000,000511,NYU Langone Hospital-Long Island,50 to 69,110,M,White,Not Span/Hispanic,1,Elective,Home w/ Home Health Services,2020,MUS006,OSTEOARTHRITIS,MST006,KNEE ARTHROPLASTY,302,KNEE JOINT REPLACEMENT,08,DISEASES AND DISORDERS OF THE MUSCULOSKELETAL SYSTEM AND CONNECTIVE TISSUE,1,Minor,Minor,Surgical,Blue Cross/Blue Shield,,,,,N,196589.82,29360.82
Long Island,Nassau,2908000,000511,NYU Langone Hospital-Long Island,70 or Older,115,F,White,Not Span/Hispanic,2,Elective,Home w/ Home Health Services,2020,MUS006,OSTEOARTHRITIS,MST006,KNEE ARTHROPLASTY,302,KNEE JOINT REPLACEMENT,08,DISEASES AND DISORDERS OF THE MUSCULOSKELETAL SYSTEM AND CONNECTIVE TISSUE,2,Moderate,Minor,Surgical,Medicare,Medicare,,,,N,198281.31,31773.69
Long Island,Nassau,2908000,000511,NYU Langone Hospital-Long Island,70 or Older,115,F,White,Not Span/Hispanic,3,Elective,Home w/ Home Health Services,2020,MUS006,OSTEOARTHRITIS,MST006,KNEE ARTHROPLASTY,302,KNEE JOINT REPLACEMENT,08,DISEASES AND DISORDERS OF THE MUSCULOSKELETAL SYSTEM AND CONNECTIVE TISSUE,3,Major,Major,Surgical,Private Health Insurance,Medicare,,,,N,201538.5,34503.38
Long Island,Nassau,2908000,000511,NYU Langone Hospital-Long Island,70 or Older,115,F,White,Not Span/Hispanic,2,Elective,Skilled Nursing Home,2020,MUS006,OSTEOARTHRITIS,MST006,KNEE ARTHROPLASTY,302,KNEE JOINT REPLACEMENT,08,DISEASES AND DISORDERS OF THE MUSCULOSKELETAL SYSTEM AND CONNECTIVE TISSUE,1,Minor,Minor,Surgical,Medicare,Medicare,,,,N,222418.28,35169.89
Long Island,Nassau,2908000,000511,NYU Langone Hospital-Long Island,50 to 69,115,M,White,Not Span/Hispanic,1,Elective,Home w/ Home Health Services,2020,MUS006,OSTEOARTHRITIS,MST006,KNEE ARTHROPLASTY,302,KNEE JOINT REPLACEMENT,08,DISEASES AND DISORDERS OF THE MUSCULOSKELETAL SYSTEM AND CONNECTIVE TISSUE,1,Minor,Minor,Surgical,Blue Cross/Blue Shield,,,,,N,214085.98,31863.34
Long Island,Nassau,2908000,000511,NYU Langone Hospital-Long Island,50 to 69,117,F,White,Spanish/Hispanic,2,Elective,Home w/ Home Health Services,2020,MUS006,OSTEOARTHRITIS,MST006,KNEE ARTHROPLASTY,302,KNEE JOINT REPLACEMENT,08,DISEASES AND DISORDERS OF THE MUSCULOSKELETAL SYSTEM AND CONNECTIVE TISSUE,2,Moderate,Minor,Surgical,Medicaid,,,,,N,185436.89,30017.17
Long Island,Nassau,2908000,000511,NYU Langone Hospital-Long Island,70 or Older,117,F,Other Race,Spanish/Hispanic,3,Elective,Home w/ Home Health Services,2020,MUS006,OSTEOARTHRITIS,MST006,KNEE ARTHROPLASTY,302,KNEE JOINT REPLACEMENT,08,DISEASES AND DISORDERS OF THE MUSCULOSKELETAL SYSTEM AND CONNECTIVE TISSUE,1,Minor,Minor,Surgical,Private Health Insurance,,,,,N,243214.6,40315.97
Long Island,Nassau,2908000,000511,NYU Langone Hospital-Long Island,70 or Older,117,M,White,Not Span/Hispanic,2,Elective,Home w/ Home Health Services,2020,MUS006,OSTEOARTHRITIS,MST006,KNEE ARTHROPLASTY,302,KNEE JOINT REPLACEMENT,08,DISEASES AND DISORDERS OF THE MUSCULOSKELETAL SYSTEM AND CONNECTIVE TISSUE,2,Moderate,Moderate,Surgical,Blue Cross/Blue Shield,Medicare,,,,N,253047.43,38570.21
Long Island,Nassau,2908000,000511,NYU Langone Hospital-Long Island,70 or Older,113,F,White,Not Span/Hispanic,4,Elective,Home w/ Home Health Services,2020,MUS006,OSTEOARTHRITIS,MST006,KNEE ARTHROPLASTY,302,KNEE JOINT REPLACEMENT,08,DISEASES AND DISORDERS OF THE MUSCULOSKELETAL SYSTEM AND CONNECTIVE TISSUE,2,Moderate,Minor,Surgical,Medicare,,,,,N,250019.39,43423.42
Long Island,Nassau,2908000,000511,NYU Langone Hospital-Long Island,50 to 69,113,F,White,Not Span/Hispanic,4,Elective,Inpatient Rehabilitation Facility,2020,MUS006,OSTEOARTHRITIS,MST006,KNEE ARTHROPLASTY,302,KNEE JOINT REPLACEMENT,08,DISEASES AND DISORDERS OF THE MUSCULOSKELETAL SYSTEM AND CONNECTIVE TISSUE,1,Minor,Minor,Surgical,Medicare,,,,,N,240615.23,42108.88
Long Island,Nassau,2908000,000511,NYU Langone Hospital-Long Island,50 to 69,117,M,White,Not Span/Hispanic,2,Elective,Home w/ Home Health Services,2020,MUS006,OSTEOARTHRITIS,MST006,KNEE ARTHROPLASTY,302,KNEE JOINT REPLACEMENT,08,DISEASES AND DISORDERS OF THE MUSCULOSKELETAL SYSTEM AND CONNECTIVE TISSUE,1,Minor,Minor,Surgical,Miscellaneous/Other,,,,,N,230835.44,36235.74
Long Island,Nassau,2908000,000511,NYU Langone Hospital-Long Island,50 to 69,117,F,White,Not Span/Hispanic,2,Elective,Home w/ Home Health Services,2020,MUS006,OSTEOARTHRITIS,MST006,KNEE ARTHROPLASTY,302,KNEE JOINT REPLACEMENT,08,DISEASES AND DISORDERS OF THE MUSCULOSKELETAL SYSTEM AND CONNECTIVE TISSUE,1,Minor,Minor,Surgical,Blue Cross/Blue Shield,Blue Cross/Blue Shield,,,,N,293819.74,45168.77
Long Island,Nassau,2908000,000511,NYU Langone Hospital-Long Island,50 to 69,110,F,White,Not Span/Hispanic,4,Elective,Skilled Nursing Home,2020,MUS006,OSTEOARTHRITIS,MST006,KNEE ARTHROPLASTY,302,KNEE JOINT REPLACEMENT,08,DISEASES AND DISORDERS OF THE MUSCULOSKELETAL SYSTEM AND CONNECTIVE TISSUE,1,Minor,Minor,Surgical,Private Health Insurance,,,,,N,254935.28,44139.05
Long Island,Nassau,2908000,000511,NYU Langone Hospital-Long Island,70 or Older,115,F,White,Not Span/Hispanic,2,Elective,Home w/ Home Health Services,2020,MUS006,OSTEOARTHRITIS,MST006,KNEE ARTHROPLASTY,302,KNEE JOINT REPLACEMENT,08,DISEASES AND DISORDERS OF THE MUSCULOSKELETAL SYSTEM AND CONNECTIVE TISSUE,2,Moderate,Minor,Surgical,Private Health Insurance,,,,,N,190352.91,30804.24
Long Island,Nassau,2908000,000511,NYU Langone Hospital-Long Island,70 or Older,115,M,White,Not Span/Hispanic,1,Elective,Home w/ Home Health Services,2020,MUS006,OSTEOARTHRITIS,MST006,KNEE ARTHROPLASTY,302,KNEE JOINT REPLACEMENT,08,DISEASES AND DISORDERS OF THE MUSCULOSKELETAL SYSTEM AND CONNECTIVE TISSUE,1,Minor,Minor,Surgical,Medicare,Blue Cross/Blue Shield,,,,N,186669.75,27635.27
Long Island,Nassau,2908000,000511,NYU Langone Hospital-Long Island,50 to 69,115,M,White,Not Span/Hispanic,1,Elective,Home w/ Home Health Services,2020,MUS006,OSTEOARTHRITIS,MST006,KNEE ARTHROPLASTY,302,KNEE JOINT REPLACEMENT,08,DISEASES AND DISORDERS OF THE MUSCULOSKELETAL SYSTEM AND CONNECTIVE TISSUE,1,Minor,Minor,Surgical,Blue Cross/Blue Shield,,,,,N,238611.01,35217.27
Long Island,Nassau,2908000,000511,NYU Langone Hospital-Long Island,70 or Older,114,F,White,Not Span/Hispanic,6,Elective,Home w/ Home Health Services,2020,MUS006,OSTEOARTHRITIS,MST006,KNEE ARTHROPLASTY,302,KNEE JOINT REPLACEMENT,08,DISEASES AND DISORDERS OF THE MUSCULOSKELETAL SYSTEM AND CONNECTIVE TISSUE,2,Moderate,Minor,Surgical,Medicaid,,,,,N,286750.12,52961.57
Long Island,Nassau,2908000,000511,NYU Langone Hospital-Long Island,50 to 69,115,M,White,Not Span/Hispanic,2,Elective,Home w/ Home Health Services,2020,MUS006,OSTEOARTHRITIS,MST006,KNEE ARTHROPLASTY,302,KNEE JOINT REPLACEMENT,08,DISEASES AND DISORDERS OF THE MUSCULOSKELETAL SYSTEM AND CONNECTIVE TISSUE,1,Minor,Minor,Surgical,Blue Cross/Blue Shield,,,,,N,250649.27,40817.21
Long Island,Nassau,2908000,000511,NYU Langone Hospital-Long Island,70 or Older,115,F,White,Not Span/Hispanic,2,Elective,Home w/ Home Health Services,2020,MUS006,OSTEOARTHRITIS,MST006,KNEE ARTHROPLASTY,302,KNEE JOINT REPLACEMENT,08,DISEASES AND DISORDERS OF THE MUSCULOSKELETAL SYSTEM AND CONNECTIVE TISSUE,2,Moderate,Minor,Surgical,Medicare,,,,,N,198253.04,30899.48
Long Island,Nassau,2908000,000511,NYU Langone Hospital-Long Island,70 or Older,117,M,White,Not Span/Hispanic,2,Elective,Inpatient Rehabilitation Facility,2020,MUS006,OSTEOARTHRITIS,MST006,KNEE ARTHROPLASTY,302,KNEE JOINT REPLACEMENT,08,DISEASES AND DISORDERS OF THE MUSCULOSKELETAL SYSTEM AND CONNECTIVE TISSUE,1,Minor,Minor,Surgical,Medicare,Medicare,,,,N,197149.77,30594.33
Long Island,Nassau,2908000,000511,NYU Langone Hospital-Long Island,70 or Older,115,F,White,Not Span/Hispanic,3,Elective,Inpatient Rehabilitation Facility,2020,MUS006,OSTEOARTHRITIS,MST006,KNEE ARTHROPLASTY,302,KNEE JOINT REPLACEMENT,08,DISEASES AND DISORDERS OF THE MUSCULOSKELETAL SYSTEM AND CONNECTIVE TISSUE,2,Moderate,Moderate,Surgical,Medicare,Medicare,,,,N,184808.87,32180.54
Long Island,Nassau,2908000,000511,NYU Langone Hospital-Long Island,70 or Older,115,F,Black/African American,Not Span/Hispanic,2,Elective,Home w/ Home Health Services,2020,MUS006,OSTEOARTHRITIS,MST006,KNEE ARTHROPLASTY,302,KNEE JOINT REPLACEMENT,08,DISEASES AND DISORDERS OF THE MUSCULOSKELETAL SYSTEM AND CONNECTIVE TISSUE,2,Moderate,Minor,Surgical,Private Health Insurance,Medicaid,,,,N,234638.79,36564.92
Long Island,Nassau,2908000,000511,NYU Langone Hospital-Long Island,70 or Older,115,F,White,Not Span/Hispanic,2,Elective,Home w/ Home Health Services,2020,MUS006,OSTEOARTHRITIS,MST006,KNEE ARTHROPLASTY,302,KNEE JOINT REPLACEMENT,08,DISEASES AND DISORDERS OF THE MUSCULOSKELETAL SYSTEM AND CONNECTIVE TISSUE,1,Minor,Minor,Surgical,Medicare,Medicare,,,,N,216953.25,34390.44
Long Island,Nassau,2908000,000511,NYU Langone Hospital-Long Island,70 or Older,114,F,White,Not Span/Hispanic,2,Elective,Home w/ Home Health Services,2020,MUS006,OSTEOARTHRITIS,MST006,KNEE ARTHROPLASTY,302,KNEE JOINT REPLACEMENT,08,DISEASES AND DISORDERS OF THE MUSCULOSKELETAL SYSTEM AND CONNECTIVE TISSUE,1,Minor,Minor,Surgical,Medicare,Blue Cross/Blue Shield,,,,N,264422.54,41045.9
Long Island,Nassau,2908000,000511,NYU Langone Hospital-Long Island,70 or Older,117,M,White,Not Span/Hispanic,4,Elective,Home w/ Home Health Services,2020,MUS006,OSTEOARTHRITIS,MST006,KNEE ARTHROPLASTY,302,KNEE JOINT REPLACEMENT,08,DISEASES AND DISORDERS OF THE MUSCULOSKELETAL SYSTEM AND CONNECTIVE TISSUE,2,Moderate,Minor,Surgical,Medicare,Blue Cross/Blue Shield,,,,N,263134.95,44910.92
Long Island,Nassau,2908000,000511,NYU Langone Hospital-Long Island,50 to 69,117,F,White,Not Span/Hispanic,1,Elective,Home w/ Home Health Services,2020,MUS006,OSTEOARTHRITIS,MST006,KNEE ARTHROPLASTY,302,KNEE JOINT REPLACEMENT,08,DISEASES AND DISORDERS OF THE MUSCULOSKELETAL SYSTEM AND CONNECTIVE TISSUE,1,Minor,Minor,Surgical,Private Health Insurance,,,,,N,216585.29,32213.92
Long Island,Nassau,2908000,000511,NYU Langone Hospital-Long Island,70 or Older,110,F,Multi-racial,Spanish/Hispanic,2,Elective,Home w/ Home Health Services,2020,MUS006,OSTEOARTHRITIS,MST006,KNEE ARTHROPLASTY,302,KNEE JOINT REPLACEMENT,08,DISEASES AND DISORDERS OF THE MUSCULOSKELETAL SYSTEM AND CONNECTIVE TISSUE,2,Moderate,Minor,Surgical,Medicare,Medicare,,,,N,197854.89,31545.35
Long Island,Nassau,2908000,000511,NYU Langone Hospital-Long Island,50 to 69,117,M,White,Not Span/Hispanic,1,Elective,Home w/ Home Health Services,2020,MUS006,OSTEOARTHRITIS,MST006,KNEE ARTHROPLASTY,302,KNEE JOINT REPLACEMENT,08,DISEASES AND DISORDERS OF THE MUSCULOSKELETAL SYSTEM AND CONNECTIVE TISSUE,1,Minor,Minor,Surgical,Blue Cross/Blue Shield,,,,,N,179729.66,27018
Long Island,Nassau,2908000,000511,NYU Langone Hospital-Long Island,50 to 69,115,F,Black/African American,Not Span/Hispanic,2,Elective,Home w/ Home Health Services,2020,MUS006,OSTEOARTHRITIS,MST006,KNEE ARTHROPLASTY,302,KNEE JOINT REPLACEMENT,08,DISEASES AND DISORDERS OF THE MUSCULOSKELETAL SYSTEM AND CONNECTIVE TISSUE,1,Minor,Minor,Surgical,Private Health Insurance,,,,,N,223272.49,35193.27
Long Island,Nassau,2908000,000511,NYU Langone Hospital-Long Island,50 to 69,115,M,White,Not Span/Hispanic,1,Elective,Home w/ Home Health Services,2020,MUS006,OSTEOARTHRITIS,MST006,KNEE ARTHROPLASTY,302,KNEE JOINT REPLACEMENT,08,DISEASES AND DISORDERS OF THE MUSCULOSKELETAL SYSTEM AND CONNECTIVE TISSUE,1,Minor,Minor,Surgical,Blue Cross/Blue Shield,,,,,N,188911.88,28386.48
Long Island,Nassau,2908000,000511,NYU Langone Hospital-Long Island,50 to 69,117,M,White,Not Span/Hispanic,1,Elective,Home w/ Home Health Services,2020,MUS006,OSTEOARTHRITIS,MST006,KNEE ARTHROPLASTY,302,KNEE JOINT REPLACEMENT,08,DISEASES AND DISORDERS OF THE MUSCULOSKELETAL SYSTEM AND CONNECTIVE TISSUE,1,Minor,Minor,Surgical,Blue Cross/Blue Shield,,,,,N,173146.62,26119
Long Island,Nassau,2908000,000511,NYU Langone Hospital-Long Island,50 to 69,115,M,White,Not Span/Hispanic,1,Elective,Home w/ Home Health Services,2020,MUS006,OSTEOARTHRITIS,MST006,KNEE ARTHROPLASTY,302,KNEE JOINT REPLACEMENT,08,DISEASES AND DISORDERS OF THE MUSCULOSKELETAL SYSTEM AND CONNECTIVE TISSUE,1,Minor,Minor,Surgical,Private Health Insurance,,,,,N,185124.14,27809.18
Long Island,Nassau,2908000,000511,NYU Langone Hospital-Long Island,70 or Older,115,F,White,Spanish/Hispanic,1,Elective,Home w/ Home Health Services,2020,MUS006,OSTEOARTHRITIS,MST006,KNEE ARTHROPLASTY,302,KNEE JOINT REPLACEMENT,08,DISEASES AND DISORDERS OF THE MUSCULOSKELETAL SYSTEM AND CONNECTIVE TISSUE,1,Minor,Minor,Surgical,Medicare,,,,,N,142464.07,21839.85