Hospital Service Area,Hospital County,Operating Certificate Number,Permanent Facility Id,Facility Name,Age Group,Zip Code - 3 digits,Gender,Race,Ethnicity,Length of Stay,Type of Admission,Patient Disposition,Discharge Year,CCS Diagnosis Code,CCS Diagnosis Description,CCS Procedure Code,CCS Procedure Description,APR DRG Code,APR DRG Description,APR MDC Code,APR MDC Description,APR Severity of Illness Code,APR Severity of Illness Description,APR Risk of Mortality,APR Medical Surgical Description,Payment Typology 1,Payment Typology 2,Payment Typology 3,Birth Weight,Abortion Edit Indicator,Emergency Department Indicator,Total Charges,Total Costs
Long Island,Nassau,2908000,000511,NYU Winthrop Hospital,50 to 69,115,F,White,Not Span/Hispanic,4,Elective,Home w/ Home Health Services,2017,209,Other acquired deformities,158,SPINAL FUSION,303,Dorsal & lumbar fusion proc for curvature of back,08,Diseases and Disorders of the Musculoskeletal System and Conn Tissue,2,Moderate,Minor,Surgical,Medicare,Medicare,Private Health Insurance,,N,N,408699.81,109828.10
Long Island,Nassau,2908000,000511,NYU Winthrop Hospital,50 to 69,117,M,White,Not Span/Hispanic,7,Elective,Skilled Nursing Home,2017,209,Other acquired deformities,158,SPINAL FUSION,303,Dorsal & lumbar fusion proc for curvature of back,08,Diseases and Disorders of the Musculoskeletal System and Conn Tissue,3,Major,Major,Surgical,Private Health Insurance,,,,N,N,556874.98,146423.29
Long Island,Nassau,2908000,000511,NYU Winthrop Hospital,0 to 17,117,F,White,Not Span/Hispanic,2,Elective,Home w/ Home Health Services,2017,212,Other bone disease and musculoskeletal deformities,158,SPINAL FUSION,303,Dorsal & lumbar fusion proc for curvature of back,08,Diseases and Disorders of the Musculoskeletal System and Conn Tissue,1,Minor,Minor,Surgical,Blue Cross/Blue Shield,,,,N,N,444252.32,117362.55
Long Island,Nassau,2908000,000511,NYU Winthrop Hospital,50 to 69,117,F,White,Not Span/Hispanic,24,Elective,Skilled Nursing Home,2017,209,Other acquired deformities,158,SPINAL FUSION,303,Dorsal & lumbar fusion proc for curvature of back,08,Diseases and Disorders of the Musculoskeletal System and Conn Tissue,3,Major,Major,Surgical,Medicare,Medicare,Self-Pay,,N,N,591455.56,148389.97
Long Island,Nassau,2908000,000511,NYU Winthrop Hospital,18 to 29,115,M,White,Not Span/Hispanic,6,Elective,Home w/ Home Health Services,2017,212,Other bone disease and musculoskeletal deformities,158,SPINAL FUSION,303,Dorsal & lumbar fusion proc for curvature of back,08,Diseases and Disorders of the Musculoskeletal System and Conn Tissue,2,Moderate,Minor,Surgical,Blue Cross/Blue Shield,,,,N,N,723867.85,192714.90
Long Island,Nassau,2908000,000511,NYU Winthrop Hospital,70 or Older,112,F,White,Spanish/Hispanic,15,Elective,Skilled Nursing Home,2017,209,Other acquired deformities,158,SPINAL FUSION,303,Dorsal & lumbar fusion proc for curvature of back,08,Diseases and Disorders of the Musculoskeletal System and Conn Tissue,2,Moderate,Moderate,Surgical,Medicare,Medicare,Medicaid,,N,N,760202.61,198272.83
Long Island,Nassau,2908000,000511,NYU Winthrop Hospital,18 to 29,115,M,Black/African American,Not Span/Hispanic,13,Elective,Home or Self Care,2017,212,Other bone disease and musculoskeletal deformities,158,SPINAL FUSION,303,Dorsal & lumbar fusion proc for curvature of back,08,Diseases and Disorders of the Musculoskeletal System and Conn Tissue,1,Minor,Minor,Surgical,Private Health Insurance,,,,N,N,783718.62,213108.36
Long Island,Nassau,2908000,000511,NYU Winthrop Hospital,0 to 17,115,M,White,Not Span/Hispanic,3,Elective,Home w/ Home Health Services,2017,209,Other acquired deformities,158,SPINAL FUSION,303,Dorsal & lumbar fusion proc for curvature of back,08,Diseases and Disorders of the Musculoskeletal System and Conn Tissue,2,Moderate,Minor,Surgical,Blue Cross/Blue Shield,,,,N,N,847235.16,227655.97
Long Island,Nassau,2908000,000511,NYU Winthrop Hospital,0 to 17,114,F,Black/African American,Not Span/Hispanic,6,Elective,Home w/ Home Health Services,2017,212,Other bone disease and musculoskeletal deformities,158,SPINAL FUSION,303,Dorsal & lumbar fusion proc for curvature of back,08,Diseases and Disorders of the Musculoskeletal System and Conn Tissue,1,Minor,Minor,Surgical,Blue Cross/Blue Shield,,,,N,N,585231.83,155679.49
Long Island,Nassau,2908000,000511,NYU Winthrop Hospital,30 to 49,117,F,White,Not Span/Hispanic,4,Elective,Home w/ Home Health Services,2017,209,Other acquired deformities,158,SPINAL FUSION,303,Dorsal & lumbar fusion proc for curvature of back,08,Diseases and Disorders of the Musculoskeletal System and Conn Tissue,2,Moderate,Minor,Surgical,Private Health Insurance,,,,N,N,1335726.32,354691.08
