Hospital Service Area,Hospital County,Operating Certificate Number,Permanent Facility Id,Facility Name,Age Group,Zip Code - 3 digits,Gender,Race,Ethnicity,Length of Stay,Type of Admission,Patient Disposition,Discharge Year,CCS Diagnosis Code,CCS Diagnosis Description,CCS Procedure Code,CCS Procedure Description,APR DRG Code,APR DRG Description,APR MDC Code,APR MDC Description,APR Severity of Illness Code,APR Severity of Illness Description,APR Risk of Mortality,APR Medical Surgical Description,Payment Typology 1,Payment Typology 2,Payment Typology 3,Birth Weight,Abortion Edit Indicator,Emergency Department Indicator,Total Charges,Total Costs
New York City,Kings,7002053,001304,NYU Langone Hospital-Brooklyn,50 to 69,112,F,White,Not Span/Hispanic,1,Elective,Home or Self Care,2017,205,Spondylosis; intervertebral disc disorders; other back problems,158,SPINAL FUSION,304,Dorsal & lumbar fusion proc except for curvature of back,08,Diseases and Disorders of the Musculoskeletal System and Conn Tissue,1,Minor,Minor,Surgical,Private Health Insurance,,,,N,N,203270.76,178991.16
New York City,Kings,7002053,001304,NYU Langone Hospital-Brooklyn,50 to 69,100,M,Other Race,Spanish/Hispanic,1,Elective,Home or Self Care,2017,225,Joint disorders and dislocations; trauma-related,158,SPINAL FUSION,304,Dorsal & lumbar fusion proc except for curvature of back,08,Diseases and Disorders of the Musculoskeletal System and Conn Tissue,1,Minor,Minor,Surgical,Miscellaneous/Other,,,,N,N,137339.42,115153.83
New York City,Kings,7002053,001304,NYU Langone Hospital-Brooklyn,70 or Older,112,M,White,Unknown,21,Elective,Inpatient Rehabilitation Facility,2017,231,Other fractures,158,SPINAL FUSION,304,Dorsal & lumbar fusion proc except for curvature of back,08,Diseases and Disorders of the Musculoskeletal System and Conn Tissue,4,Extreme,Extreme,Surgical,Medicare,,,,N,N,402217.90,220440.20
New York City,Kings,7002053,001304,NYU Langone Hospital-Brooklyn,50 to 69,114,M,White,Not Span/Hispanic,1,Elective,Home or Self Care,2017,205,Spondylosis; intervertebral disc disorders; other back problems,158,SPINAL FUSION,304,Dorsal & lumbar fusion proc except for curvature of back,08,Diseases and Disorders of the Musculoskeletal System and Conn Tissue,2,Moderate,Minor,Surgical,Miscellaneous/Other,,,,N,N,127315.05,84748.76
New York City,Kings,7002053,001304,NYU Langone Hospital-Brooklyn,50 to 69,112,M,Black/African American,Not Span/Hispanic,1,Elective,Home or Self Care,2017,225,Joint disorders and dislocations; trauma-related,158,SPINAL FUSION,304,Dorsal & lumbar fusion proc except for curvature of back,08,Diseases and Disorders of the Musculoskeletal System and Conn Tissue,1,Minor,Minor,Surgical,Miscellaneous/Other,,,,N,N,164287.63,122814.77
New York City,Kings,7002053,001304,NYU Langone Hospital-Brooklyn,50 to 69,104,F,Other Race,Spanish/Hispanic,1,Elective,Home w/ Home Health Services,2017,205,Spondylosis; intervertebral disc disorders; other back problems,158,SPINAL FUSION,304,Dorsal & lumbar fusion proc except for curvature of back,08,Diseases and Disorders of the Musculoskeletal System and Conn Tissue,2,Moderate,Minor,Surgical,Miscellaneous/Other,,,,N,N,136869.89,101304.50
New York City,Kings,7002053,001304,NYU Langone Hospital-Brooklyn,50 to 69,100,F,Other Race,Not Span/Hispanic,1,Elective,Home w/ Home Health Services,2017,225,Joint disorders and dislocations; trauma-related,158,SPINAL FUSION,304,Dorsal & lumbar fusion proc except for curvature of back,08,Diseases and Disorders of the Musculoskeletal System and Conn Tissue,1,Minor,Minor,Surgical,Miscellaneous/Other,,,,N,N,120570.39,88547.09
New York City,Kings,7002053,001304,NYU Langone Hospital-Brooklyn,50 to 69,112,F,Other Race,Spanish/Hispanic,24,Emergency,Inpatient Rehabilitation Facility,2017,042,Secondary malignancies,009,OTHER OR THER NERV SYS,304,Dorsal & lumbar fusion proc except for curvature of back,08,Diseases and Disorders of the Musculoskeletal System and Conn Tissue,4,Extreme,Major,Surgical,Medicaid,,,,N,Y,1009999.23,680308.63
New York City,Kings,7002053,001304,NYU Langone Hospital-Brooklyn,30 to 49,113,M,Other Race,Not Span/Hispanic,2,Elective,Home w/ Home Health Services,2017,205,Spondylosis; intervertebral disc disorders; other back problems,158,SPINAL FUSION,304,Dorsal & lumbar fusion proc except for curvature of back,08,Diseases and Disorders of the Musculoskeletal System and Conn Tissue,1,Minor,Minor,Surgical,Miscellaneous/Other,,,,N,N,125149.21,86924.80
New York City,Kings,7002053,001304,NYU Langone Hospital-Brooklyn,30 to 49,112,F,White,Not Span/Hispanic,5,Emergency,Inpatient Rehabilitation Facility,2017,205,Spondylosis; intervertebral disc disorders; other back problems,158,SPINAL FUSION,304,Dorsal & lumbar fusion proc except for curvature of back,08,Diseases and Disorders of the Musculoskeletal System and Conn Tissue,1,Minor,Minor,Surgical,Private Health Insurance,,,,N,Y,216165.47,146482.52
New York City,Kings,7002053,001304,NYU Langone Hospital-Brooklyn,50 to 69,112,F,White,Spanish/Hispanic,1,Elective,Home w/ Home Health Services,2017,205,Spondylosis; intervertebral disc disorders; other back problems,158,SPINAL FUSION,304,Dorsal & lumbar fusion proc except for curvature of back,08,Diseases and Disorders of the Musculoskeletal System and Conn Tissue,1,Minor,Minor,Surgical,Miscellaneous/Other,,,,N,N,116406.48,88675.81
New York City,Kings,7002053,001304,NYU Langone Hospital-Brooklyn,30 to 49,,F,Other Race,Spanish/Hispanic,1,Elective,Home or Self Care,2017,205,Spondylosis; intervertebral disc disorders; other back problems,158,SPINAL FUSION,304,Dorsal & lumbar fusion proc except for curvature of back,08,Diseases and Disorders of the Musculoskeletal System and Conn Tissue,1,Minor,Minor,Surgical,Miscellaneous/Other,,,,N,N,160863.12,130675.10
New York City,Kings,7002053,001304,NYU Langone Hospital-Brooklyn,50 to 69,100,F,Other Race,Not Span/Hispanic,3,Elective,Inpatient Rehabilitation Facility,2017,209,Other acquired deformities,158,SPINAL FUSION,304,Dorsal & lumbar fusion proc except for curvature of back,08,Diseases and Disorders of the Musculoskeletal System and Conn Tissue,1,Minor,Minor,Surgical,Private Health Insurance,,,,N,N,173094.92,131366.87
New York City,Kings,7002053,001304,NYU Langone Hospital-Brooklyn,30 to 49,112,F,Other Race,Not Span/Hispanic,1,Elective,Home w/ Home Health Services,2017,205,Spondylosis; intervertebral disc disorders; other back problems,158,SPINAL FUSION,304,Dorsal & lumbar fusion proc except for curvature of back,08,Diseases and Disorders of the Musculoskeletal System and Conn Tissue,1,Minor,Minor,Surgical,Miscellaneous/Other,,,,N,N,106241.73,77501.09
New York City,Kings,7002053,001304,NYU Langone Hospital-Brooklyn,70 or Older,112,M,Black/African American,Unknown,5,Emergency,Skilled Nursing Home,2017,231,Other fractures,009,OTHER OR THER NERV SYS,304,Dorsal & lumbar fusion proc except for curvature of back,08,Diseases and Disorders of the Musculoskeletal System and Conn Tissue,3,Major,Major,Surgical,Medicare,,,,N,Y,233158.29,122980.61
New York City,Kings,7002053,001304,NYU Langone Hospital-Brooklyn,50 to 69,112,M,White,Not Span/Hispanic,43,Emergency,Home or Self Care,2017,201,Infective arthritis and osteomyelitis (except that caused by tuberculosis or sexually transmitted disease),158,SPINAL FUSION,304,Dorsal & lumbar fusion proc except for curvature of back,08,Diseases and Disorders of the Musculoskeletal System and Conn Tissue,3,Major,Moderate,Surgical,Medicaid,,,,N,Y,487846.82,187728.59
New York City,Kings,7002053,001304,NYU Langone Hospital-Brooklyn,50 to 69,112,F,Black/African American,Not Span/Hispanic,5,Elective,Home w/ Home Health Services,2017,209,Other acquired deformities,158,SPINAL FUSION,304,Dorsal & lumbar fusion proc except for curvature of back,08,Diseases and Disorders of the Musculoskeletal System and Conn Tissue,1,Minor,Minor,Surgical,Private Health Insurance,,,,N,N,178043.38,130078.31
New York City,Kings,7002053,001304,NYU Langone Hospital-Brooklyn,50 to 69,113,M,Other Race,Not Span/Hispanic,1,Elective,Home or Self Care,2017,205,Spondylosis; intervertebral disc disorders; other back problems,158,SPINAL FUSION,304,Dorsal & lumbar fusion proc except for curvature of back,08,Diseases and Disorders of the Musculoskeletal System and Conn Tissue,1,Minor,Minor,Surgical,Private Health Insurance,,,,N,N,134346.99,100938.92
New York City,Kings,7002053,001304,NYU Langone Hospital-Brooklyn,50 to 69,112,F,White,Not Span/Hispanic,1,Elective,Home or Self Care,2017,205,Spondylosis; intervertebral disc disorders; other back problems,158,SPINAL FUSION,304,Dorsal & lumbar fusion proc except for curvature of back,08,Diseases and Disorders of the Musculoskeletal System and Conn Tissue,1,Minor,Minor,Surgical,Miscellaneous/Other,,,,N,N,68680.06,33134.25
New York City,Kings,7002053,001304,NYU Langone Hospital-Brooklyn,50 to 69,113,F,Black/African American,Not Span/Hispanic,2,Elective,Home or Self Care,2017,209,Other acquired deformities,158,SPINAL FUSION,304,Dorsal & lumbar fusion proc except for curvature of back,08,Diseases and Disorders of the Musculoskeletal System and Conn Tissue,1,Minor,Minor,Surgical,Medicaid,,,,N,N,219267.76,183015.65
New York City,Kings,7002053,001304,NYU Langone Hospital-Brooklyn,30 to 49,112,M,White,Spanish/Hispanic,1,Elective,Home or Self Care,2017,225,Joint disorders and dislocations; trauma-related,158,SPINAL FUSION,304,Dorsal & lumbar fusion proc except for curvature of back,08,Diseases and Disorders of the Musculoskeletal System and Conn Tissue,1,Minor,Minor,Surgical,Miscellaneous/Other,,,,N,N,101279.83,72915.72
New York City,Kings,7002053,001304,NYU Langone Hospital-Brooklyn,30 to 49,112,M,White,Not Span/Hispanic,4,Emergency,Home or Self Care,2017,231,Other fractures,158,SPINAL FUSION,304,Dorsal & lumbar fusion proc except for curvature of back,08,Diseases and Disorders of the Musculoskeletal System and Conn Tissue,3,Major,Moderate,Surgical,Medicaid,,,,N,Y,270711.91,201205.63
New York City,Kings,7002053,001304,NYU Langone Hospital-Brooklyn,30 to 49,112,M,Black/African American,Not Span/Hispanic,1,Elective,Home or Self Care,2017,205,Spondylosis; intervertebral disc disorders; other back problems,158,SPINAL FUSION,304,Dorsal & lumbar fusion proc except for curvature of back,08,Diseases and Disorders of the Musculoskeletal System and Conn Tissue,2,Moderate,Minor,Surgical,Medicaid,,,,N,N,106752.41,73938.62
New York City,Kings,7002053,001304,NYU Langone Hospital-Brooklyn,50 to 69,112,M,Other Race,Spanish/Hispanic,43,Emergency,Home or Self Care,2017,201,Infective arthritis and osteomyelitis (except that caused by tuberculosis or sexually transmitted disease),158,SPINAL FUSION,304,Dorsal & lumbar fusion proc except for curvature of back,08,Diseases and Disorders of the Musculoskeletal System and Conn Tissue,4,Extreme,Major,Surgical,Medicaid,,,,N,Y,528401.18,181952.72
New York City,Kings,7002053,001304,NYU Langone Hospital-Brooklyn,70 or Older,112,F,Other Race,Spanish/Hispanic,2,Elective,Home or Self Care,2017,209,Other acquired deformities,158,SPINAL FUSION,304,Dorsal & lumbar fusion proc except for curvature of back,08,Diseases and Disorders of the Musculoskeletal System and Conn Tissue,1,Minor,Minor,Surgical,Blue Cross/Blue Shield,,,,N,N,203687.58,169670.85
New York City,Kings,7002053,001304,NYU Langone Hospital-Brooklyn,50 to 69,112,F,Black/African American,Unknown,2,Elective,Home or Self Care,2017,205,Spondylosis; intervertebral disc disorders; other back problems,158,SPINAL FUSION,304,Dorsal & lumbar fusion proc except for curvature of back,08,Diseases and Disorders of the Musculoskeletal System and Conn Tissue,2,Moderate,Minor,Surgical,Private Health Insurance,,,,N,N,231906.18,200659.57
New York City,Kings,7002053,001304,NYU Langone Hospital-Brooklyn,50 to 69,112,F,Black/African American,Not Span/Hispanic,1,Elective,Home or Self Care,2017,205,Spondylosis; intervertebral disc disorders; other back problems,158,SPINAL FUSION,304,Dorsal & lumbar fusion proc except for curvature of back,08,Diseases and Disorders of the Musculoskeletal System and Conn Tissue,2,Moderate,Minor,Surgical,Medicaid,,,,N,N,63215.46,31329.81
New York City,Kings,7002053,001304,NYU Langone Hospital-Brooklyn,30 to 49,113,F,Other Race,Spanish/Hispanic,4,Elective,Home or Self Care,2017,209,Other acquired deformities,158,SPINAL FUSION,304,Dorsal & lumbar fusion proc except for curvature of back,08,Diseases and Disorders of the Musculoskeletal System and Conn Tissue,1,Minor,Minor,Surgical,Miscellaneous/Other,,,,N,N,279443.90,233855.36
New York City,Kings,7002053,001304,NYU Langone Hospital-Brooklyn,50 to 69,112,M,White,Not Span/Hispanic,9,Emergency,Inpatient Rehabilitation Facility,2017,201,Infective arthritis and osteomyelitis (except that caused by tuberculosis or sexually transmitted disease),158,SPINAL FUSION,304,Dorsal & lumbar fusion proc except for curvature of back,08,Diseases and Disorders of the Musculoskeletal System and Conn Tissue,3,Major,Major,Surgical,Blue Cross/Blue Shield,,,,N,Y,306141.04,206165.25
New York City,Kings,7002053,001304,NYU Langone Hospital-Brooklyn,50 to 69,112,M,Other Race,Spanish/Hispanic,4,Elective,Home or Self Care,2017,205,Spondylosis; intervertebral disc disorders; other back problems,158,SPINAL FUSION,304,Dorsal & lumbar fusion proc except for curvature of back,08,Diseases and Disorders of the Musculoskeletal System and Conn Tissue,2,Moderate,Minor,Surgical,Miscellaneous/Other,,,,N,N,236259.31,185090.09
New York City,Kings,7002053,001304,NYU Langone Hospital-Brooklyn,50 to 69,112,F,White,Spanish/Hispanic,7,Elective,Inpatient Rehabilitation Facility,2017,001,Tuberculosis,158,SPINAL FUSION,304,Dorsal & lumbar fusion proc except for curvature of back,08,Diseases and Disorders of the Musculoskeletal System and Conn Tissue,2,Moderate,Minor,Surgical,Medicaid,,,,N,N,348788.25,291446.57
New York City,Kings,7002053,001304,NYU Langone Hospital-Brooklyn,30 to 49,112,F,White,Not Span/Hispanic,3,Elective,Home or Self Care,2017,205,Spondylosis; intervertebral disc disorders; other back problems,158,SPINAL FUSION,304,Dorsal & lumbar fusion proc except for curvature of back,08,Diseases and Disorders of the Musculoskeletal System and Conn Tissue,2,Moderate,Minor,Surgical,Miscellaneous/Other,,,,N,N,134038.31,93170.13
New York City,Kings,7002053,001304,NYU Langone Hospital-Brooklyn,30 to 49,100,M,Other Race,Spanish/Hispanic,10,Emergency,Inpatient Rehabilitation Facility,2017,231,Other fractures,158,SPINAL FUSION,304,Dorsal & lumbar fusion proc except for curvature of back,08,Diseases and Disorders of the Musculoskeletal System and Conn Tissue,3,Major,Major,Surgical,Private Health Insurance,,,,N,Y,350816.89,212355.90
New York City,Kings,7002053,001304,NYU Langone Hospital-Brooklyn,18 to 29,114,M,Other Race,Not Span/Hispanic,1,Elective,Home or Self Care,2017,209,Other acquired deformities,158,SPINAL FUSION,304,Dorsal & lumbar fusion proc except for curvature of back,08,Diseases and Disorders of the Musculoskeletal System and Conn Tissue,1,Minor,Minor,Surgical,Medicaid,,,,N,N,82042.85,56298.73
New York City,Kings,7002053,001304,NYU Langone Hospital-Brooklyn,30 to 49,112,M,Other Race,Unknown,1,Elective,Home w/ Home Health Services,2017,205,Spondylosis; intervertebral disc disorders; other back problems,158,SPINAL FUSION,304,Dorsal & lumbar fusion proc except for curvature of back,08,Diseases and Disorders of the Musculoskeletal System and Conn Tissue,2,Moderate,Minor,Surgical,Miscellaneous/Other,,,,N,N,143328.36,119891.31
New York City,Kings,7002053,001304,NYU Langone Hospital-Brooklyn,50 to 69,OOS,M,Other Race,Spanish/Hispanic,8,Elective,Inpatient Rehabilitation Facility,2017,205,Spondylosis; intervertebral disc disorders; other back problems,158,SPINAL FUSION,304,Dorsal & lumbar fusion proc except for curvature of back,08,Diseases and Disorders of the Musculoskeletal System and Conn Tissue,3,Major,Major,Surgical,Medicare,,,,N,N,174649.26,99434.24
New York City,Kings,7002053,001304,NYU Langone Hospital-Brooklyn,30 to 49,112,M,White,Not Span/Hispanic,2,Elective,Home or Self Care,2017,205,Spondylosis; intervertebral disc disorders; other back problems,158,SPINAL FUSION,304,Dorsal & lumbar fusion proc except for curvature of back,08,Diseases and Disorders of the Musculoskeletal System and Conn Tissue,3,Major,Minor,Surgical,Blue Cross/Blue Shield,,,,N,N,111225.98,69731.68
New York City,Kings,7002053,001304,NYU Langone Hospital-Brooklyn,50 to 69,100,F,Other Race,Spanish/Hispanic,1,Elective,Home or Self Care,2017,205,Spondylosis; intervertebral disc disorders; other back problems,158,SPINAL FUSION,304,Dorsal & lumbar fusion proc except for curvature of back,08,Diseases and Disorders of the Musculoskeletal System and Conn Tissue,1,Minor,Minor,Surgical,Medicare,,,,N,N,87624.69,56419.64
New York City,Kings,7002053,001304,NYU Langone Hospital-Brooklyn,30 to 49,112,F,White,Not Span/Hispanic,2,Elective,Home w/ Home Health Services,2017,209,Other acquired deformities,158,SPINAL FUSION,304,Dorsal & lumbar fusion proc except for curvature of back,08,Diseases and Disorders of the Musculoskeletal System and Conn Tissue,1,Minor,Minor,Surgical,Medicaid,,,,N,N,183946.89,146047.04
New York City,Kings,7002053,001304,NYU Langone Hospital-Brooklyn,70 or Older,112,M,Other Race,Not Span/Hispanic,7,Emergency,Inpatient Rehabilitation Facility,2017,231,Other fractures,158,SPINAL FUSION,304,Dorsal & lumbar fusion proc except for curvature of back,08,Diseases and Disorders of the Musculoskeletal System and Conn Tissue,3,Major,Major,Surgical,Private Health Insurance,,,,N,Y,256764.05,182361.39
New York City,Kings,7002053,001304,NYU Langone Hospital-Brooklyn,30 to 49,104,F,White,Spanish/Hispanic,1,Elective,Home or Self Care,2017,209,Other acquired deformities,158,SPINAL FUSION,304,Dorsal & lumbar fusion proc except for curvature of back,08,Diseases and Disorders of the Musculoskeletal System and Conn Tissue,1,Minor,Minor,Surgical,Private Health Insurance,,,,N,N,123870.53,82796.65
New York City,Kings,7002053,001304,NYU Langone Hospital-Brooklyn,30 to 49,113,M,Other Race,Not Span/Hispanic,1,Elective,Home or Self Care,2017,205,Spondylosis; intervertebral disc disorders; other back problems,158,SPINAL FUSION,304,Dorsal & lumbar fusion proc except for curvature of back,08,Diseases and Disorders of the Musculoskeletal System and Conn Tissue,1,Minor,Minor,Surgical,Miscellaneous/Other,,,,N,N,131471.83,88553.97
New York City,Kings,7002053,001304,NYU Langone Hospital-Brooklyn,50 to 69,,F,White,Spanish/Hispanic,1,Elective,Home or Self Care,2017,205,Spondylosis; intervertebral disc disorders; other back problems,158,SPINAL FUSION,304,Dorsal & lumbar fusion proc except for curvature of back,08,Diseases and Disorders of the Musculoskeletal System and Conn Tissue,1,Minor,Minor,Surgical,Miscellaneous/Other,,,,N,N,115299.75,77952.46
New York City,Kings,7002053,001304,NYU Langone Hospital-Brooklyn,30 to 49,114,M,Other Race,Spanish/Hispanic,1,Elective,Home or Self Care,2017,205,Spondylosis; intervertebral disc disorders; other back problems,158,SPINAL FUSION,304,Dorsal & lumbar fusion proc except for curvature of back,08,Diseases and Disorders of the Musculoskeletal System and Conn Tissue,1,Minor,Minor,Surgical,Private Health Insurance,,,,N,N,97021.95,66873.62
New York City,Kings,7002053,001304,NYU Langone Hospital-Brooklyn,50 to 69,103,F,White,Not Span/Hispanic,2,Elective,Home or Self Care,2017,209,Other acquired deformities,158,SPINAL FUSION,304,Dorsal & lumbar fusion proc except for curvature of back,08,Diseases and Disorders of the Musculoskeletal System and Conn Tissue,1,Minor,Minor,Surgical,Blue Cross/Blue Shield,,,,N,N,192560.00,147963.83
New York City,Kings,7002053,001304,NYU Langone Hospital-Brooklyn,50 to 69,116,F,Black/African American,Not Span/Hispanic,1,Elective,Home or Self Care,2017,205,Spondylosis; intervertebral disc disorders; other back problems,158,SPINAL FUSION,304,Dorsal & lumbar fusion proc except for curvature of back,08,Diseases and Disorders of the Musculoskeletal System and Conn Tissue,1,Minor,Minor,Surgical,Private Health Insurance,,,,N,N,99063.56,64794.80
New York City,Kings,7002053,001304,NYU Langone Hospital-Brooklyn,50 to 69,112,F,White,Not Span/Hispanic,2,Elective,Home or Self Care,2017,209,Other acquired deformities,158,SPINAL FUSION,304,Dorsal & lumbar fusion proc except for curvature of back,08,Diseases and Disorders of the Musculoskeletal System and Conn Tissue,2,Moderate,Minor,Surgical,Medicaid,,,,N,N,219555.74,185910.95
New York City,Kings,7002053,001304,NYU Langone Hospital-Brooklyn,50 to 69,116,F,Black/African American,Not Span/Hispanic,1,Elective,Home or Self Care,2017,205,Spondylosis; intervertebral disc disorders; other back problems,158,SPINAL FUSION,304,Dorsal & lumbar fusion proc except for curvature of back,08,Diseases and Disorders of the Musculoskeletal System and Conn Tissue,1,Minor,Minor,Surgical,Private Health Insurance,,,,N,N,99063.56,64794.80
New York City,Kings,7002053,001304,NYU Langone Hospital-Brooklyn,50 to 69,116,F,Black/African American,Not Span/Hispanic,1,Elective,Home or Self Care,2017,205,Spondylosis; intervertebral disc disorders; other back problems,158,SPINAL FUSION,304,Dorsal & lumbar fusion proc except for curvature of back,08,Diseases and Disorders of the Musculoskeletal System and Conn Tissue,1,Minor,Minor,Surgical,Private Health Insurance,,,,N,N,99063.56,64794.80
New York City,Kings,7002053,001304,NYU Langone Hospital-Brooklyn,50 to 69,117,M,Black/African American,Not Span/Hispanic,1,Elective,Home or Self Care,2017,205,Spondylosis; intervertebral disc disorders; other back problems,158,SPINAL FUSION,304,Dorsal & lumbar fusion proc except for curvature of back,08,Diseases and Disorders of the Musculoskeletal System and Conn Tissue,2,Moderate,Minor,Surgical,Medicare,,,,N,N,121160.73,81223.65
New York City,Kings,7002053,001304,NYU Langone Hospital-Brooklyn,50 to 69,103,F,White,Not Span/Hispanic,2,Elective,Home w/ Home Health Services,2017,209,Other acquired deformities,158,SPINAL FUSION,304,Dorsal & lumbar fusion proc except for curvature of back,08,Diseases and Disorders of the Musculoskeletal System and Conn Tissue,1,Minor,Minor,Surgical,Medicare,,,,N,N,141904.21,98746.74
New York City,Kings,7002053,001304,NYU Langone Hospital-Brooklyn,70 or Older,103,M,White,Not Span/Hispanic,4,Elective,Home w/ Home Health Services,2017,209,Other acquired deformities,158,SPINAL FUSION,304,Dorsal & lumbar fusion proc except for curvature of back,08,Diseases and Disorders of the Musculoskeletal System and Conn Tissue,3,Major,Moderate,Surgical,Medicare,,,,N,N,258945.51,213056.44
New York City,Kings,7002053,001304,NYU Langone Hospital-Brooklyn,30 to 49,100,M,Other Race,Spanish/Hispanic,1,Elective,Home or Self Care,2017,225,Joint disorders and dislocations; trauma-related,158,SPINAL FUSION,304,Dorsal & lumbar fusion proc except for curvature of back,08,Diseases and Disorders of the Musculoskeletal System and Conn Tissue,1,Minor,Minor,Surgical,Medicaid,,,,N,N,123903.21,81594.84
New York City,Kings,7002053,001304,NYU Langone Hospital-Brooklyn,70 or Older,,F,White,Not Span/Hispanic,2,Elective,Home or Self Care,2017,209,Other acquired deformities,158,SPINAL FUSION,304,Dorsal & lumbar fusion proc except for curvature of back,08,Diseases and Disorders of the Musculoskeletal System and Conn Tissue,2,Moderate,Minor,Surgical,Medicare,,,,N,N,180736.62,133849.83
New York City,Kings,7002053,001304,NYU Langone Hospital-Brooklyn,70 or Older,112,F,Multi-racial,Spanish/Hispanic,2,Elective,Inpatient Rehabilitation Facility,2017,205,Spondylosis; intervertebral disc disorders; other back problems,158,SPINAL FUSION,304,Dorsal & lumbar fusion proc except for curvature of back,08,Diseases and Disorders of the Musculoskeletal System and Conn Tissue,1,Minor,Minor,Surgical,Medicare,,,,N,N,115510.64,62784.34