Hospital Service Area,Hospital County,Operating Certificate Number,Permanent Facility Id,Facility Name,Age Group,Zip Code - 3 digits,Gender,Race,Ethnicity,Length of Stay,Type of Admission,Patient Disposition,Discharge Year,CCS Diagnosis Code,CCS Diagnosis Description,CCS Procedure Code,CCS Procedure Description,APR DRG Code,APR DRG Description,APR MDC Code,APR MDC Description,APR Severity of Illness Code,APR Severity of Illness Description,APR Risk of Mortality,APR Medical Surgical Description,Payment Typology 1,Payment Typology 2,Payment Typology 3,Birth Weight,Abortion Edit Indicator,Emergency Department Indicator,Total Charges,Total Costs
Western NY,Erie,1401014,000207,Buffalo General Medical Center,30 to 49,140,F,White,Not Span/Hispanic,7,Emergency,Skilled Nursing Home,2018,INJ002,"FRACTURE OF THE SPINE AND BACK, INITIAL ENCOUNTER",MST013,SPINE FUSION,304,DORSAL & LUMBAR FUSION PROC EXCEPT FOR CURVATURE OF BACK,08,DISEASES AND DISORDERS OF THE MUSCULOSKELETAL SYSTEM AND CONNECTIVE TISSUE,3,Major,Minor,Surgical,Medicaid,Self-Pay,,,,true,156677.66,54590.78
Hudson Valley,Westchester,5920000,001117,Northern Westchester Hospital,50 to 69,105,M,White,Not Span/Hispanic,3,Elective,Inpatient Rehabilitation Facility,2018,MUS011,SPONDYLOPATHIES/SPONDYLOARTHROPATHY (INCLUDING INFECTIVE),MST013,SPINE FUSION,304,DORSAL & LUMBAR FUSION PROC EXCEPT FOR CURVATURE OF BACK,08,DISEASES AND DISORDERS OF THE MUSCULOSKELETAL SYSTEM AND CONNECTIVE TISSUE,2,Moderate,Moderate,Surgical,Medicare,Blue Cross/Blue Shield,,,,false,109086.88,37043.61
New York City,Richmond,7004003,001740,Staten Island University Hosp-North,30 to 49,103,F,Other Race,Not Span/Hispanic,8,Elective,Home or Self Care,2018,MUS011,SPONDYLOPATHIES/SPONDYLOARTHROPATHY (INCLUDING INFECTIVE),MST013,SPINE FUSION,304,DORSAL & LUMBAR FUSION PROC EXCEPT FOR CURVATURE OF BACK,08,DISEASES AND DISORDERS OF THE MUSCULOSKELETAL SYSTEM AND CONNECTIVE TISSUE,2,Moderate,Moderate,Surgical,Federal/State/Local/VA,,,,,false,118322.09,34361.35
New York City,Manhattan,7002054,001458,New York-Presbyterian Hospital - New York Weill Cornell Center,50 to 69,104,F,Black/African American,Not Span/Hispanic,5,Elective,Home w/ Home Health Services,2018,INJ035,"COMPLICATION OF INTERNAL ORTHOPEDIC DEVICE OR IMPLANT, INITIAL ENCOUNTER",MST013,SPINE FUSION,304,DORSAL & LUMBAR FUSION PROC EXCEPT FOR CURVATURE OF BACK,08,DISEASES AND DISORDERS OF THE MUSCULOSKELETAL SYSTEM AND CONNECTIVE TISSUE,2,Moderate,Minor,Surgical,Private Health Insurance,Self-Pay,,,,false,325404.8,147871.66
Long Island,Suffolk,5153000,000913,Huntington Hospital,30 to 49,117,M,White,Not Span/Hispanic,2,Elective,Home or Self Care,2018,INJ035,"COMPLICATION OF INTERNAL ORTHOPEDIC DEVICE OR IMPLANT, INITIAL ENCOUNTER",MST013,SPINE FUSION,304,DORSAL & LUMBAR FUSION PROC EXCEPT FOR CURVATURE OF BACK,08,DISEASES AND DISORDERS OF THE MUSCULOSKELETAL SYSTEM AND CONNECTIVE TISSUE,2,Moderate,Minor,Surgical,Medicare,Blue Cross/Blue Shield,,,,false,90871.62,26876.07
Long Island,Suffolk,5153000,000913,Huntington Hospital,50 to 69,117,M,White,Not Span/Hispanic,3,Elective,Home or Self Care,2018,MUS011,SPONDYLOPATHIES/SPONDYLOARTHROPATHY (INCLUDING INFECTIVE),MST013,SPINE FUSION,304,DORSAL & LUMBAR FUSION PROC EXCEPT FOR CURVATURE OF BACK,08,DISEASES AND DISORDERS OF THE MUSCULOSKELETAL SYSTEM AND CONNECTIVE TISSUE,1,Minor,Minor,Surgical,Medicaid,Medicaid,,,,false,96487.99,30103.62
Western NY,Erie,1401013,000218,Sisters of Charity Hospital,70 or Older,141,F,White,Not Span/Hispanic,1,Elective,Home w/ Home Health Services,2018,MUS011,SPONDYLOPATHIES/SPONDYLOARTHROPATHY (INCLUDING INFECTIVE),MST013,SPINE FUSION,304,DORSAL & LUMBAR FUSION PROC EXCEPT FOR CURVATURE OF BACK,08,DISEASES AND DISORDERS OF THE MUSCULOSKELETAL SYSTEM AND CONNECTIVE TISSUE,1,Minor,Minor,Surgical,Medicare,Medicare,,,,false,25223.23,13926.09
Hudson Valley,Westchester,5902001,001045,White Plains Hospital Center,50 to 69,,F,Other Race,Not Span/Hispanic,4,Elective,Home or Self Care,2018,MUS011,SPONDYLOPATHIES/SPONDYLOARTHROPATHY (INCLUDING INFECTIVE),MST013,SPINE FUSION,304,DORSAL & LUMBAR FUSION PROC EXCEPT FOR CURVATURE OF BACK,08,DISEASES AND DISORDERS OF THE MUSCULOSKELETAL SYSTEM AND CONNECTIVE TISSUE,2,Moderate,Minor,Surgical,Private Health Insurance,,,,,false,156515,47142.1
New York City,Manhattan,7002053,001446,NYU Langone Orthopedic Hospital,70 or Older,106,F,Other Race,Not Span/Hispanic,2,Elective,Inpatient Rehabilitation Facility,2018,MUS011,SPONDYLOPATHIES/SPONDYLOARTHROPATHY (INCLUDING INFECTIVE),MST013,SPINE FUSION,304,DORSAL & LUMBAR FUSION PROC EXCEPT FOR CURVATURE OF BACK,08,DISEASES AND DISORDERS OF THE MUSCULOSKELETAL SYSTEM AND CONNECTIVE TISSUE,2,Moderate,Minor,Surgical,Medicare,,,,,false,302598.64,48590.76
New York City,Manhattan,7002053,001446,NYU Langone Orthopedic Hospital,50 to 69,100,M,White,Not Span/Hispanic,2,Elective,Home w/ Home Health Services,2018,MUS011,SPONDYLOPATHIES/SPONDYLOARTHROPATHY (INCLUDING INFECTIVE),MST013,SPINE FUSION,304,DORSAL & LUMBAR FUSION PROC EXCEPT FOR CURVATURE OF BACK,08,DISEASES AND DISORDERS OF THE MUSCULOSKELETAL SYSTEM AND CONNECTIVE TISSUE,1,Minor,Minor,Surgical,Medicare,,,,,false,159124.15,28440.53
New York City,Manhattan,7002054,001437,New York-Presbyterian/Lower Manhattan Hospital,50 to 69,OOS,M,Other Race,Not Span/Hispanic,1,Elective,Home or Self Care,2018,MUS011,SPONDYLOPATHIES/SPONDYLOARTHROPATHY (INCLUDING INFECTIVE),MST013,SPINE FUSION,304,DORSAL & LUMBAR FUSION PROC EXCEPT FOR CURVATURE OF BACK,08,DISEASES AND DISORDERS OF THE MUSCULOSKELETAL SYSTEM AND CONNECTIVE TISSUE,1,Minor,Minor,Surgical,Miscellaneous/Other,Self-Pay,,,,false,125427.7,58308.62
New York City,Manhattan,7002054,001458,New York-Presbyterian Hospital - New York Weill Cornell Center,30 to 49,OOS,F,Multi-racial,Not Span/Hispanic,3,Elective,Home or Self Care,2018,MUS011,SPONDYLOPATHIES/SPONDYLOARTHROPATHY (INCLUDING INFECTIVE),MST013,SPINE FUSION,304,DORSAL & LUMBAR FUSION PROC EXCEPT FOR CURVATURE OF BACK,08,DISEASES AND DISORDERS OF THE MUSCULOSKELETAL SYSTEM AND CONNECTIVE TISSUE,1,Minor,Minor,Surgical,Private Health Insurance,Self-Pay,,,,false,164677.37,76409.47
New York City,Manhattan,7002012,001447,Hospital for Special Surgery,50 to 69,OOS,M,White,Not Span/Hispanic,3,Elective,Home or Self Care,2018,MUS011,SPONDYLOPATHIES/SPONDYLOARTHROPATHY (INCLUDING INFECTIVE),MST013,SPINE FUSION,304,DORSAL & LUMBAR FUSION PROC EXCEPT FOR CURVATURE OF BACK,08,DISEASES AND DISORDERS OF THE MUSCULOSKELETAL SYSTEM AND CONNECTIVE TISSUE,2,Moderate,Minor,Surgical,Private Health Insurance,,,,,false,230462,81505.26
New York City,Manhattan,7002054,001458,New York-Presbyterian Hospital - New York Weill Cornell Center,50 to 69,118,F,White,Not Span/Hispanic,1,Elective,Home or Self Care,2018,MUS011,SPONDYLOPATHIES/SPONDYLOARTHROPATHY (INCLUDING INFECTIVE),MST013,SPINE FUSION,304,DORSAL & LUMBAR FUSION PROC EXCEPT FOR CURVATURE OF BACK,08,DISEASES AND DISORDERS OF THE MUSCULOSKELETAL SYSTEM AND CONNECTIVE TISSUE,1,Minor,Minor,Surgical,Blue Cross/Blue Shield,Self-Pay,,,,false,105299.96,44454.52
New York City,Kings,7001021,001306,New York - Presbyterian Brooklyn Methodist Hospital,50 to 69,112,M,Other Race,Not Span/Hispanic,5,Elective,Home or Self Care,2018,MUS011,SPONDYLOPATHIES/SPONDYLOARTHROPATHY (INCLUDING INFECTIVE),MST013,SPINE FUSION,304,DORSAL & LUMBAR FUSION PROC EXCEPT FOR CURVATURE OF BACK,08,DISEASES AND DISORDERS OF THE MUSCULOSKELETAL SYSTEM AND CONNECTIVE TISSUE,1,Minor,Minor,Surgical,Blue Cross/Blue Shield,Medicare,Self-Pay,,,false,85381.5,39381.08
Long Island,Nassau,2950002,000528,Nassau University Medical Center,30 to 49,115,F,Other Race,Spanish/Hispanic,6,Elective,Home or Self Care,2018,MUS011,SPONDYLOPATHIES/SPONDYLOARTHROPATHY (INCLUDING INFECTIVE),MST013,SPINE FUSION,304,DORSAL & LUMBAR FUSION PROC EXCEPT FOR CURVATURE OF BACK,08,DISEASES AND DISORDERS OF THE MUSCULOSKELETAL SYSTEM AND CONNECTIVE TISSUE,2,Moderate,Minor,Surgical,Medicaid,Medicaid,Self-Pay,,,false,90971.47,64931.09
New York City,Manhattan,7002054,001437,New York-Presbyterian/Lower Manhattan Hospital,30 to 49,OOS,M,Other Race,Spanish/Hispanic,2,Elective,Home or Self Care,2018,MUS011,SPONDYLOPATHIES/SPONDYLOARTHROPATHY (INCLUDING INFECTIVE),MST013,SPINE FUSION,304,DORSAL & LUMBAR FUSION PROC EXCEPT FOR CURVATURE OF BACK,08,DISEASES AND DISORDERS OF THE MUSCULOSKELETAL SYSTEM AND CONNECTIVE TISSUE,1,Minor,Minor,Surgical,Miscellaneous/Other,Self-Pay,,,,false,172464.45,79312.96
Finger Lakes,Monroe,2701003,000411,Rochester General Hospital,30 to 49,145,M,White,Not Span/Hispanic,2,Elective,Home or Self Care,2018,MUS011,SPONDYLOPATHIES/SPONDYLOARTHROPATHY (INCLUDING INFECTIVE),MST013,SPINE FUSION,304,DORSAL & LUMBAR FUSION PROC EXCEPT FOR CURVATURE OF BACK,08,DISEASES AND DISORDERS OF THE MUSCULOSKELETAL SYSTEM AND CONNECTIVE TISSUE,1,Minor,Minor,Surgical,Miscellaneous/Other,,,,,false,68410.84,20200.12
Southern Tier,Broome,0303001,000058,United Health Services Hospitals Inc. - Wilson Medical Center,70 or Older,137,F,White,Not Span/Hispanic,11,Emergency,Skilled Nursing Home,2018,INJ002,"FRACTURE OF THE SPINE AND BACK, INITIAL ENCOUNTER",MST013,SPINE FUSION,304,DORSAL & LUMBAR FUSION PROC EXCEPT FOR CURVATURE OF BACK,08,DISEASES AND DISORDERS OF THE MUSCULOSKELETAL SYSTEM AND CONNECTIVE TISSUE,3,Major,Major,Surgical,Miscellaneous/Other,,,,,true,121992.5,55877.9
Long Island,Nassau,2951001,000541,North Shore University Hospital,50 to 69,115,F,White,Not Span/Hispanic,2,Elective,Home or Self Care,2018,MUS011,SPONDYLOPATHIES/SPONDYLOARTHROPATHY (INCLUDING INFECTIVE),MST013,SPINE FUSION,304,DORSAL & LUMBAR FUSION PROC EXCEPT FOR CURVATURE OF BACK,08,DISEASES AND DISORDERS OF THE MUSCULOSKELETAL SYSTEM AND CONNECTIVE TISSUE,1,Minor,Minor,Surgical,Medicare,Private Health Insurance,,,,false,63815.02,17746.29
New York City,Manhattan,7002012,001447,Hospital for Special Surgery,70 or Older,114,F,White,Not Span/Hispanic,8,Elective,Home w/ Home Health Services,2018,MUS011,SPONDYLOPATHIES/SPONDYLOARTHROPATHY (INCLUDING INFECTIVE),MST013,SPINE FUSION,304,DORSAL & LUMBAR FUSION PROC EXCEPT FOR CURVATURE OF BACK,08,DISEASES AND DISORDERS OF THE MUSCULOSKELETAL SYSTEM AND CONNECTIVE TISSUE,3,Major,Major,Surgical,Medicare,,,,,false,153712,65078.08
New York City,Bronx,7000006,001169,Montefiore Medical Center - Henry & Lucy Moses Div,30 to 49,,F,Other Race,Spanish/Hispanic,13,Emergency,Skilled Nursing Home,2018,MUS011,SPONDYLOPATHIES/SPONDYLOARTHROPATHY (INCLUDING INFECTIVE),MST013,SPINE FUSION,304,DORSAL & LUMBAR FUSION PROC EXCEPT FOR CURVATURE OF BACK,08,DISEASES AND DISORDERS OF THE MUSCULOSKELETAL SYSTEM AND CONNECTIVE TISSUE,3,Major,Major,Surgical,Medicaid,,,,,true,547031.63,148824.34
Western NY,Erie,1401005,000210,Erie County Medical Center,50 to 69,140,M,White,Not Span/Hispanic,4,Elective,Home or Self Care,2018,INJ035,"COMPLICATION OF INTERNAL ORTHOPEDIC DEVICE OR IMPLANT, INITIAL ENCOUNTER",MST013,SPINE FUSION,304,DORSAL & LUMBAR FUSION PROC EXCEPT FOR CURVATURE OF BACK,08,DISEASES AND DISORDERS OF THE MUSCULOSKELETAL SYSTEM AND CONNECTIVE TISSUE,2,Moderate,Minor,Surgical,Federal/State/Local/VA,,,,,false,42288.47,23859.04
Long Island,Suffolk,5154001,000925,Good Samaritan Hospital Medical Center,70 or Older,117,M,White,Not Span/Hispanic,8,Elective,Home w/ Home Health Services,2018,MUS011,SPONDYLOPATHIES/SPONDYLOARTHROPATHY (INCLUDING INFECTIVE),MST013,SPINE FUSION,304,DORSAL & LUMBAR FUSION PROC EXCEPT FOR CURVATURE OF BACK,08,DISEASES AND DISORDERS OF THE MUSCULOSKELETAL SYSTEM AND CONNECTIVE TISSUE,3,Major,Major,Surgical,Medicare,Blue Cross/Blue Shield,,,,false,196707.22,39840.26
Long Island,Suffolk,5154001,000925,Good Samaritan Hospital Medical Center,50 to 69,117,F,Black/African American,Not Span/Hispanic,5,Elective,Home w/ Home Health Services,2018,MUS037,POSTPROCEDURAL OR POSTOPERATIVE MUSCULOSKELETAL SYSTEM COMPLICATION,MST013,SPINE FUSION,304,DORSAL & LUMBAR FUSION PROC EXCEPT FOR CURVATURE OF BACK,08,DISEASES AND DISORDERS OF THE MUSCULOSKELETAL SYSTEM AND CONNECTIVE TISSUE,2,Moderate,Minor,Surgical,Blue Cross/Blue Shield,,,,,false,167163.18,30122.4
Long Island,Suffolk,5154001,000925,Good Samaritan Hospital Medical Center,50 to 69,117,M,White,Not Span/Hispanic,5,Elective,Skilled Nursing Home,2018,MUS011,SPONDYLOPATHIES/SPONDYLOARTHROPATHY (INCLUDING INFECTIVE),MST013,SPINE FUSION,304,DORSAL & LUMBAR FUSION PROC EXCEPT FOR CURVATURE OF BACK,08,DISEASES AND DISORDERS OF THE MUSCULOSKELETAL SYSTEM AND CONNECTIVE TISSUE,1,Minor,Minor,Surgical,Medicare,Private Health Insurance,,,,false,319778.53,63620.77
Long Island,Suffolk,5154001,000925,Good Samaritan Hospital Medical Center,70 or Older,117,M,White,Not Span/Hispanic,14,Elective,Home w/ Home Health Services,2018,MUS011,SPONDYLOPATHIES/SPONDYLOARTHROPATHY (INCLUDING INFECTIVE),MST013,SPINE FUSION,304,DORSAL & LUMBAR FUSION PROC EXCEPT FOR CURVATURE OF BACK,08,DISEASES AND DISORDERS OF THE MUSCULOSKELETAL SYSTEM AND CONNECTIVE TISSUE,3,Major,Major,Surgical,Medicare,Private Health Insurance,,,,false,334347.79,78127.99
New York City,Manhattan,7002054,001464,New York-Presbyterian Hospital - Columbia Presbyterian Center,70 or Older,101,F,White,Not Span/Hispanic,3,Elective,Home w/ Home Health Services,2018,MUS011,SPONDYLOPATHIES/SPONDYLOARTHROPATHY (INCLUDING INFECTIVE),MST013,SPINE FUSION,304,DORSAL & LUMBAR FUSION PROC EXCEPT FOR CURVATURE OF BACK,08,DISEASES AND DISORDERS OF THE MUSCULOSKELETAL SYSTEM AND CONNECTIVE TISSUE,1,Minor,Minor,Surgical,Private Health Insurance,Self-Pay,,,,false,57701.06,19219.76
Long Island,Suffolk,5154001,000925,Good Samaritan Hospital Medical Center,50 to 69,117,F,White,Not Span/Hispanic,3,Elective,Home or Self Care,2018,MUS011,SPONDYLOPATHIES/SPONDYLOARTHROPATHY (INCLUDING INFECTIVE),MST013,SPINE FUSION,304,DORSAL & LUMBAR FUSION PROC EXCEPT FOR CURVATURE OF BACK,08,DISEASES AND DISORDERS OF THE MUSCULOSKELETAL SYSTEM AND CONNECTIVE TISSUE,2,Moderate,Minor,Surgical,Miscellaneous/Other,Medicare,Blue Cross/Blue Shield,,,false,131570.42,23656.05
New York City,Manhattan,7002012,001447,Hospital for Special Surgery,30 to 49,119,F,White,Not Span/Hispanic,3,Elective,Home or Self Care,2018,MUS011,SPONDYLOPATHIES/SPONDYLOARTHROPATHY (INCLUDING INFECTIVE),MST013,SPINE FUSION,304,DORSAL & LUMBAR FUSION PROC EXCEPT FOR CURVATURE OF BACK,08,DISEASES AND DISORDERS OF THE MUSCULOSKELETAL SYSTEM AND CONNECTIVE TISSUE,2,Moderate,Minor,Surgical,Blue Cross/Blue Shield,,,,,false,144961,53882.65
Long Island,Nassau,2951001,000541,North Shore University Hospital,70 or Older,116,F,White,Not Span/Hispanic,21,Urgent,Medicare Cert Long Term Care Hospital,2018,NEO070,SECONDARY MALIGNANCIES,MST013,SPINE FUSION,304,DORSAL & LUMBAR FUSION PROC EXCEPT FOR CURVATURE OF BACK,08,DISEASES AND DISORDERS OF THE MUSCULOSKELETAL SYSTEM AND CONNECTIVE TISSUE,3,Major,Moderate,Surgical,Medicare,Medicare,,,,false,446784.39,109616.35
Central NY,Onondaga,3301007,000635,University Hospital SUNY Health Science Center,50 to 69,136,F,White,Not Span/Hispanic,4,Elective,Home or Self Care,2018,MUS011,SPONDYLOPATHIES/SPONDYLOARTHROPATHY (INCLUDING INFECTIVE),MST013,SPINE FUSION,304,DORSAL & LUMBAR FUSION PROC EXCEPT FOR CURVATURE OF BACK,08,DISEASES AND DISORDERS OF THE MUSCULOSKELETAL SYSTEM AND CONNECTIVE TISSUE,2,Moderate,Minor,Surgical,Private Health Insurance,,,,,false,108767.04,36617.13
Central NY,Onondaga,3301003,000630,St. Joseph's Hospital Health Center,30 to 49,OOS,M,White,Not Span/Hispanic,3,Elective,Home or Self Care,2018,MUS011,SPONDYLOPATHIES/SPONDYLOARTHROPATHY (INCLUDING INFECTIVE),MST013,SPINE FUSION,304,DORSAL & LUMBAR FUSION PROC EXCEPT FOR CURVATURE OF BACK,08,DISEASES AND DISORDERS OF THE MUSCULOSKELETAL SYSTEM AND CONNECTIVE TISSUE,1,Minor,Minor,Surgical,Blue Cross/Blue Shield,,,,,false,47936.82,18414.14
Long Island,Suffolk,5157003,000943,St Catherine of Siena Hospital,30 to 49,117,F,Other Race,Not Span/Hispanic,5,Elective,Home or Self Care,2018,MUS011,SPONDYLOPATHIES/SPONDYLOARTHROPATHY (INCLUDING INFECTIVE),MST013,SPINE FUSION,304,DORSAL & LUMBAR FUSION PROC EXCEPT FOR CURVATURE OF BACK,08,DISEASES AND DISORDERS OF THE MUSCULOSKELETAL SYSTEM AND CONNECTIVE TISSUE,2,Moderate,Minor,Surgical,Miscellaneous/Other,,,,,false,127236.09,25052.1
New York City,Manhattan,7002017,001450,Lenox Hill Hospital,18 to 29,112,M,Other Race,Not Span/Hispanic,4,Elective,Home or Self Care,2018,INJ007,"DISLOCATIONS, INITIAL ENCOUNTER",MST013,SPINE FUSION,304,DORSAL & LUMBAR FUSION PROC EXCEPT FOR CURVATURE OF BACK,08,DISEASES AND DISORDERS OF THE MUSCULOSKELETAL SYSTEM AND CONNECTIVE TISSUE,1,Minor,Minor,Surgical,Medicaid,Medicaid,,,,false,80901.8,23306.51
Finger Lakes,Ontario,3402000,000671,Geneva General Hospital,50 to 69,131,F,White,Not Span/Hispanic,2,Elective,Home or Self Care,2018,MUS011,SPONDYLOPATHIES/SPONDYLOARTHROPATHY (INCLUDING INFECTIVE),MST013,SPINE FUSION,304,DORSAL & LUMBAR FUSION PROC EXCEPT FOR CURVATURE OF BACK,08,DISEASES AND DISORDERS OF THE MUSCULOSKELETAL SYSTEM AND CONNECTIVE TISSUE,1,Minor,Minor,Surgical,Medicare,,,,,false,62952.38,57590.81
Finger Lakes,Ontario,3402000,000671,Geneva General Hospital,30 to 49,,M,White,Spanish/Hispanic,5,Elective,Home w/ Home Health Services,2018,MUS011,SPONDYLOPATHIES/SPONDYLOARTHROPATHY (INCLUDING INFECTIVE),MST013,SPINE FUSION,304,DORSAL & LUMBAR FUSION PROC EXCEPT FOR CURVATURE OF BACK,08,DISEASES AND DISORDERS OF THE MUSCULOSKELETAL SYSTEM AND CONNECTIVE TISSUE,1,Minor,Minor,Surgical,Medicaid,,,,,false,100057.66,88205.76
Hudson Valley,Westchester,5957001,001139,Westchester Medical Center,50 to 69,105,F,Other Race,Spanish/Hispanic,5,Elective,Court/Law Enforcement,2018,MUS011,SPONDYLOPATHIES/SPONDYLOARTHROPATHY (INCLUDING INFECTIVE),MST013,SPINE FUSION,304,DORSAL & LUMBAR FUSION PROC EXCEPT FOR CURVATURE OF BACK,08,DISEASES AND DISORDERS OF THE MUSCULOSKELETAL SYSTEM AND CONNECTIVE TISSUE,1,Minor,Minor,Surgical,Medicaid,Department of Corrections,,,,false,200549.01,38667.68
Long Island,Nassau,2952005,000552,Plainview Hospital,30 to 49,117,M,Other Race,Not Span/Hispanic,4,Elective,Skilled Nursing Home,2018,MUS011,SPONDYLOPATHIES/SPONDYLOARTHROPATHY (INCLUDING INFECTIVE),MST013,SPINE FUSION,304,DORSAL & LUMBAR FUSION PROC EXCEPT FOR CURVATURE OF BACK,08,DISEASES AND DISORDERS OF THE MUSCULOSKELETAL SYSTEM AND CONNECTIVE TISSUE,1,Minor,Minor,Surgical,Miscellaneous/Other,,,,,false,120161.03,44995.92
Finger Lakes,Ontario,3402000,000671,Geneva General Hospital,50 to 69,145,M,White,Not Span/Hispanic,3,Elective,Home w/ Home Health Services,2018,MUS011,SPONDYLOPATHIES/SPONDYLOARTHROPATHY (INCLUDING INFECTIVE),MST013,SPINE FUSION,304,DORSAL & LUMBAR FUSION PROC EXCEPT FOR CURVATURE OF BACK,08,DISEASES AND DISORDERS OF THE MUSCULOSKELETAL SYSTEM AND CONNECTIVE TISSUE,2,Moderate,Moderate,Surgical,Medicaid,,,,,false,49278.58,39985.01
New York City,Manhattan,7002017,001450,Lenox Hill Hospital,70 or Older,124,M,White,Not Span/Hispanic,5,Elective,Home or Self Care,2018,MUS011,SPONDYLOPATHIES/SPONDYLOARTHROPATHY (INCLUDING INFECTIVE),MST013,SPINE FUSION,304,DORSAL & LUMBAR FUSION PROC EXCEPT FOR CURVATURE OF BACK,08,DISEASES AND DISORDERS OF THE MUSCULOSKELETAL SYSTEM AND CONNECTIVE TISSUE,1,Minor,Minor,Surgical,Medicare,Blue Cross/Blue Shield,,,,false,124986.21,37262.4
New York City,Manhattan,7002054,001437,New York-Presbyterian/Lower Manhattan Hospital,50 to 69,,M,White,Not Span/Hispanic,5,Elective,Home w/ Home Health Services,2018,MUS011,SPONDYLOPATHIES/SPONDYLOARTHROPATHY (INCLUDING INFECTIVE),MST013,SPINE FUSION,304,DORSAL & LUMBAR FUSION PROC EXCEPT FOR CURVATURE OF BACK,08,DISEASES AND DISORDERS OF THE MUSCULOSKELETAL SYSTEM AND CONNECTIVE TISSUE,1,Minor,Minor,Surgical,"Managed Care, Unspecified",Medicaid,Self-Pay,,,false,122029.76,43225.72
New York City,Manhattan,7002054,001437,New York-Presbyterian/Lower Manhattan Hospital,30 to 49,105,M,White,Not Span/Hispanic,2,Urgent,Home or Self Care,2018,MUS011,SPONDYLOPATHIES/SPONDYLOARTHROPATHY (INCLUDING INFECTIVE),MST013,SPINE FUSION,304,DORSAL & LUMBAR FUSION PROC EXCEPT FOR CURVATURE OF BACK,08,DISEASES AND DISORDERS OF THE MUSCULOSKELETAL SYSTEM AND CONNECTIVE TISSUE,1,Minor,Minor,Surgical,Miscellaneous/Other,Self-Pay,,,,false,151802.29,62719.36
New York City,Manhattan,7002054,001437,New York-Presbyterian/Lower Manhattan Hospital,50 to 69,OOS,F,Other Race,Not Span/Hispanic,5,Elective,Skilled Nursing Home,2018,MUS011,SPONDYLOPATHIES/SPONDYLOARTHROPATHY (INCLUDING INFECTIVE),MST013,SPINE FUSION,304,DORSAL & LUMBAR FUSION PROC EXCEPT FOR CURVATURE OF BACK,08,DISEASES AND DISORDERS OF THE MUSCULOSKELETAL SYSTEM AND CONNECTIVE TISSUE,2,Moderate,Minor,Surgical,Medicare,Self-Pay,,,,false,214705.81,90732.5
New York City,Manhattan,7002017,001450,Lenox Hill Hospital,30 to 49,OOS,M,Other Race,Not Span/Hispanic,2,Elective,Home or Self Care,2018,MUS011,SPONDYLOPATHIES/SPONDYLOARTHROPATHY (INCLUDING INFECTIVE),MST013,SPINE FUSION,304,DORSAL & LUMBAR FUSION PROC EXCEPT FOR CURVATURE OF BACK,08,DISEASES AND DISORDERS OF THE MUSCULOSKELETAL SYSTEM AND CONNECTIVE TISSUE,1,Minor,Minor,Surgical,Blue Cross/Blue Shield,,,,,false,122215.71,43593.82
Long Island,Nassau,2953000,000563,St. Francis Hospital & Heart Center,70 or Older,112,M,White,Not Span/Hispanic,7,Elective,Skilled Nursing Home,2018,MUS011,SPONDYLOPATHIES/SPONDYLOARTHROPATHY (INCLUDING INFECTIVE),MST013,SPINE FUSION,304,DORSAL & LUMBAR FUSION PROC EXCEPT FOR CURVATURE OF BACK,08,DISEASES AND DISORDERS OF THE MUSCULOSKELETAL SYSTEM AND CONNECTIVE TISSUE,1,Minor,Moderate,Surgical,Medicare,Private Health Insurance,,,,false,255010.02,42076.74
New York City,Manhattan,7002054,001437,New York-Presbyterian/Lower Manhattan Hospital,30 to 49,112,F,Other Race,Not Span/Hispanic,3,Elective,Home w/ Home Health Services,2018,MUS011,SPONDYLOPATHIES/SPONDYLOARTHROPATHY (INCLUDING INFECTIVE),MST013,SPINE FUSION,304,DORSAL & LUMBAR FUSION PROC EXCEPT FOR CURVATURE OF BACK,08,DISEASES AND DISORDERS OF THE MUSCULOSKELETAL SYSTEM AND CONNECTIVE TISSUE,1,Minor,Minor,Surgical,Medicare,Medicare,Self-Pay,,,false,117210.94,47224.43
New York City,Manhattan,7002053,001463,NYU Langone Hospitals,70 or Older,107,F,White,Not Span/Hispanic,6,Elective,Home w/ Home Health Services,2018,MUS011,SPONDYLOPATHIES/SPONDYLOARTHROPATHY (INCLUDING INFECTIVE),MST013,SPINE FUSION,304,DORSAL & LUMBAR FUSION PROC EXCEPT FOR CURVATURE OF BACK,08,DISEASES AND DISORDERS OF THE MUSCULOSKELETAL SYSTEM AND CONNECTIVE TISSUE,2,Moderate,Minor,Surgical,Medicaid,,,,,false,367284.55,70851.34
New York City,Manhattan,7002017,001450,Lenox Hill Hospital,50 to 69,105,M,Other Race,Spanish/Hispanic,4,Elective,Home or Self Care,2018,MUS011,SPONDYLOPATHIES/SPONDYLOARTHROPATHY (INCLUDING INFECTIVE),MST013,SPINE FUSION,304,DORSAL & LUMBAR FUSION PROC EXCEPT FOR CURVATURE OF BACK,08,DISEASES AND DISORDERS OF THE MUSCULOSKELETAL SYSTEM AND CONNECTIVE TISSUE,1,Minor,Minor,Surgical,Miscellaneous/Other,,,,,false,158861.14,53635.92
Western NY,Erie,1401008,000213,Mercy Hospital of Buffalo,50 to 69,140,F,White,Not Span/Hispanic,1,Elective,Home or Self Care,2018,MUS011,SPONDYLOPATHIES/SPONDYLOARTHROPATHY (INCLUDING INFECTIVE),MST013,SPINE FUSION,304,DORSAL & LUMBAR FUSION PROC EXCEPT FOR CURVATURE OF BACK,08,DISEASES AND DISORDERS OF THE MUSCULOSKELETAL SYSTEM AND CONNECTIVE TISSUE,1,Minor,Minor,Surgical,Miscellaneous/Other,Miscellaneous/Other,,,,false,42742.75,25181.82
Western NY,Erie,1401014,000207,Buffalo General Medical Center,50 to 69,148,F,White,Not Span/Hispanic,9,Elective,Home w/ Home Health Services,2018,MUS011,SPONDYLOPATHIES/SPONDYLOARTHROPATHY (INCLUDING INFECTIVE),MST013,SPINE FUSION,304,DORSAL & LUMBAR FUSION PROC EXCEPT FOR CURVATURE OF BACK,08,DISEASES AND DISORDERS OF THE MUSCULOSKELETAL SYSTEM AND CONNECTIVE TISSUE,3,Major,Major,Surgical,Medicaid,Self-Pay,,,,false,95344.92,36544.04