Hospital Service Area,Hospital County,Operating Certificate Number,Permanent Facility Id,Facility Name,Age Group,Zip Code - 3 digits,Gender,Race,Ethnicity,Length of Stay,Type of Admission,Patient Disposition,Discharge Year,CCS Diagnosis Code,CCS Diagnosis Description,CCS Procedure Code,CCS Procedure Description,APR DRG Code,APR DRG Description,APR MDC Code,APR MDC Description,APR Severity of Illness Code,APR Severity of Illness Description,APR Risk of Mortality,APR Medical Surgical Description,Payment Typology 1,Payment Typology 2,Payment Typology 3,Birth Weight,Abortion Edit Indicator,Emergency Department Indicator,Total Charges,Total Costs
Long Island,Suffolk,5123000,000885,Brookhaven Memorial Hospital Medical Center Inc,50 to 69,117,M,White,Not Span/Hispanic,16,Emergency,Skilled Nursing Home,2017,201,Infective arthritis and osteomyelitis (except that caused by tuberculosis or sexually transmitted disease),157,AMPUTATE LOWER EXTRMITY,305,Amputation of lower limb except toes,08,Diseases and Disorders of the Musculoskeletal System and Conn Tissue,2,Moderate,Minor,Surgical,Private Health Insurance,,,,N,Y,109505.52,23585.65
Long Island,Suffolk,5123000,000885,Brookhaven Memorial Hospital Medical Center Inc,70 or Older,117,M,White,Not Span/Hispanic,10,Emergency,Skilled Nursing Home,2017,050,Diabetes mellitus with complications,157,AMPUTATE LOWER EXTRMITY,305,Amputation of lower limb except toes,08,Diseases and Disorders of the Musculoskeletal System and Conn Tissue,2,Moderate,Moderate,Surgical,Medicare,Medicare,Blue Cross/Blue Shield,,N,Y,82349.54,15859.34
Long Island,Suffolk,5123000,000885,Brookhaven Memorial Hospital Medical Center Inc,70 or Older,117,M,White,Not Span/Hispanic,6,Emergency,Skilled Nursing Home,2017,237,Complication of device; implant or graft,157,AMPUTATE LOWER EXTRMITY,305,Amputation of lower limb except toes,08,Diseases and Disorders of the Musculoskeletal System and Conn Tissue,3,Major,Major,Surgical,Medicare,Medicare,Private Health Insurance,,N,Y,49180.36,10510.34
Long Island,Suffolk,5123000,000885,Brookhaven Memorial Hospital Medical Center Inc,30 to 49,119,M,White,Not Span/Hispanic,11,Emergency,Home w/ Home Health Services,2017,050,Diabetes mellitus with complications,157,AMPUTATE LOWER EXTRMITY,305,Amputation of lower limb except toes,08,Diseases and Disorders of the Musculoskeletal System and Conn Tissue,4,Extreme,Minor,Surgical,Private Health Insurance,,,,N,Y,85975.10,18259.82
Long Island,Suffolk,5123000,000885,Brookhaven Memorial Hospital Medical Center Inc,30 to 49,117,M,Other Race,Not Span/Hispanic,8,Emergency,Home w/ Home Health Services,2017,050,Diabetes mellitus with complications,157,AMPUTATE LOWER EXTRMITY,305,Amputation of lower limb except toes,08,Diseases and Disorders of the Musculoskeletal System and Conn Tissue,3,Major,Minor,Surgical,Private Health Insurance,,,,N,Y,70055.05,14527.79
Long Island,Suffolk,5123000,000885,Brookhaven Memorial Hospital Medical Center Inc,70 or Older,117,M,Other Race,Not Span/Hispanic,10,Emergency,Home w/ Home Health Services,2017,050,Diabetes mellitus with complications,157,AMPUTATE LOWER EXTRMITY,305,Amputation of lower limb except toes,08,Diseases and Disorders of the Musculoskeletal System and Conn Tissue,3,Major,Major,Surgical,Medicare,Medicare,,,N,Y,84905.93,17309.98
Long Island,Suffolk,5123000,000885,Brookhaven Memorial Hospital Medical Center Inc,50 to 69,117,F,White,Not Span/Hispanic,6,Emergency,Home or Self Care,2017,050,Diabetes mellitus with complications,157,AMPUTATE LOWER EXTRMITY,305,Amputation of lower limb except toes,08,Diseases and Disorders of the Musculoskeletal System and Conn Tissue,2,Moderate,Minor,Surgical,Medicare,Medicare,,,N,Y,59474.72,11625.71
Long Island,Suffolk,5123000,000885,Brookhaven Memorial Hospital Medical Center Inc,50 to 69,117,M,White,Not Span/Hispanic,12,Emergency,Home w/ Home Health Services,2017,050,Diabetes mellitus with complications,157,AMPUTATE LOWER EXTRMITY,305,Amputation of lower limb except toes,08,Diseases and Disorders of the Musculoskeletal System and Conn Tissue,3,Major,Major,Surgical,Medicare,Blue Cross/Blue Shield,,,N,Y,97178.17,20410.74
Long Island,Suffolk,5123000,000885,Brookhaven Memorial Hospital Medical Center Inc,70 or Older,117,F,White,Not Span/Hispanic,7,Emergency,Skilled Nursing Home,2017,050,Diabetes mellitus with complications,157,AMPUTATE LOWER EXTRMITY,305,Amputation of lower limb except toes,08,Diseases and Disorders of the Musculoskeletal System and Conn Tissue,3,Major,Major,Surgical,Medicare,Medicare,Medicaid,,N,Y,64841.50,14116.43
Long Island,Suffolk,5123000,000885,Brookhaven Memorial Hospital Medical Center Inc,50 to 69,117,F,White,Not Span/Hispanic,6,Emergency,Home w/ Home Health Services,2017,050,Diabetes mellitus with complications,157,AMPUTATE LOWER EXTRMITY,305,Amputation of lower limb except toes,08,Diseases and Disorders of the Musculoskeletal System and Conn Tissue,3,Major,Minor,Surgical,Medicare,Medicare,Blue Cross/Blue Shield,,N,Y,57742.44,11254.85
Long Island,Suffolk,5123000,000885,Brookhaven Memorial Hospital Medical Center Inc,70 or Older,119,F,White,Not Span/Hispanic,28,Emergency,Skilled Nursing Home,2017,114,Peripheral and visceral atherosclerosis,157,AMPUTATE LOWER EXTRMITY,305,Amputation of lower limb except toes,08,Diseases and Disorders of the Musculoskeletal System and Conn Tissue,3,Major,Major,Surgical,Medicare,Medicaid,,,N,Y,175319.78,37502.08
Long Island,Suffolk,5123000,000885,Brookhaven Memorial Hospital Medical Center Inc,70 or Older,117,M,Black/African American,Not Span/Hispanic,7,Emergency,Home w/ Home Health Services,2017,238,Complications of surgical procedures or medical care,157,AMPUTATE LOWER EXTRMITY,305,Amputation of lower limb except toes,08,Diseases and Disorders of the Musculoskeletal System and Conn Tissue,3,Major,Major,Surgical,Medicare,Medicare,,,N,Y,53930.03,11282.14
Long Island,Suffolk,5123000,000885,Brookhaven Memorial Hospital Medical Center Inc,70 or Older,117,F,White,Not Span/Hispanic,7,Emergency,Skilled Nursing Home,2017,050,Diabetes mellitus with complications,157,AMPUTATE LOWER EXTRMITY,305,Amputation of lower limb except toes,08,Diseases and Disorders of the Musculoskeletal System and Conn Tissue,3,Major,Moderate,Surgical,Medicare,Medicare,Medicaid,,N,Y,70582.62,15501.12
Long Island,Suffolk,5123000,000885,Brookhaven Memorial Hospital Medical Center Inc,70 or Older,113,M,White,Not Span/Hispanic,27,Emergency,Skilled Nursing Home,2017,050,Diabetes mellitus with complications,157,AMPUTATE LOWER EXTRMITY,305,Amputation of lower limb except toes,08,Diseases and Disorders of the Musculoskeletal System and Conn Tissue,3,Major,Major,Surgical,Medicare,,,,N,Y,193963.31,42762.47
Long Island,Suffolk,5123000,000885,Brookhaven Memorial Hospital Medical Center Inc,70 or Older,117,M,White,Not Span/Hispanic,8,Emergency,Home w/ Home Health Services,2017,201,Infective arthritis and osteomyelitis (except that caused by tuberculosis or sexually transmitted disease),157,AMPUTATE LOWER EXTRMITY,305,Amputation of lower limb except toes,08,Diseases and Disorders of the Musculoskeletal System and Conn Tissue,2,Moderate,Moderate,Surgical,Medicare,Medicare,,,N,Y,65539.09,14103.46
Long Island,Suffolk,5123000,000885,Brookhaven Memorial Hospital Medical Center Inc,50 to 69,117,M,White,Not Span/Hispanic,5,Emergency,Home w/ Home Health Services,2017,050,Diabetes mellitus with complications,157,AMPUTATE LOWER EXTRMITY,305,Amputation of lower limb except toes,08,Diseases and Disorders of the Musculoskeletal System and Conn Tissue,2,Moderate,Moderate,Surgical,Medicare,Medicare,Medicaid,,N,Y,45519.00,9561.07
Long Island,Suffolk,5123000,000885,Brookhaven Memorial Hospital Medical Center Inc,30 to 49,117,M,White,Not Span/Hispanic,6,Emergency,Home or Self Care,2017,201,Infective arthritis and osteomyelitis (except that caused by tuberculosis or sexually transmitted disease),157,AMPUTATE LOWER EXTRMITY,305,Amputation of lower limb except toes,08,Diseases and Disorders of the Musculoskeletal System and Conn Tissue,2,Moderate,Minor,Surgical,Private Health Insurance,,,,N,Y,64641.57,11559.04
Long Island,Suffolk,5123000,000885,Brookhaven Memorial Hospital Medical Center Inc,50 to 69,119,M,White,Not Span/Hispanic,7,Emergency,Skilled Nursing Home,2017,050,Diabetes mellitus with complications,157,AMPUTATE LOWER EXTRMITY,305,Amputation of lower limb except toes,08,Diseases and Disorders of the Musculoskeletal System and Conn Tissue,4,Extreme,Major,Surgical,Private Health Insurance,,,,N,Y,63382.60,12881.60
Long Island,Suffolk,5123000,000885,Brookhaven Memorial Hospital Medical Center Inc,70 or Older,117,M,Black/African American,Not Span/Hispanic,11,Emergency,Skilled Nursing Home,2017,050,Diabetes mellitus with complications,157,AMPUTATE LOWER EXTRMITY,305,Amputation of lower limb except toes,08,Diseases and Disorders of the Musculoskeletal System and Conn Tissue,3,Major,Moderate,Surgical,Medicare,Medicare,,,N,Y,82374.76,17032.06
Long Island,Suffolk,5123000,000885,Brookhaven Memorial Hospital Medical Center Inc,50 to 69,117,F,White,Not Span/Hispanic,6,Emergency,Skilled Nursing Home,2017,050,Diabetes mellitus with complications,157,AMPUTATE LOWER EXTRMITY,305,Amputation of lower limb except toes,08,Diseases and Disorders of the Musculoskeletal System and Conn Tissue,4,Extreme,Moderate,Surgical,Medicare,Medicare,Private Health Insurance,,N,Y,63091.30,12399.45
Long Island,Suffolk,5123000,000885,Brookhaven Memorial Hospital Medical Center Inc,70 or Older,117,M,White,Not Span/Hispanic,10,Emergency,Skilled Nursing Home,2017,050,Diabetes mellitus with complications,157,AMPUTATE LOWER EXTRMITY,305,Amputation of lower limb except toes,08,Diseases and Disorders of the Musculoskeletal System and Conn Tissue,3,Major,Moderate,Surgical,Medicare,Medicare,,,N,Y,75073.53,16330.17
Long Island,Suffolk,5123000,000885,Brookhaven Memorial Hospital Medical Center Inc,70 or Older,117,F,White,Not Span/Hispanic,2,Elective,Expired,2017,248,Gangrene,157,AMPUTATE LOWER EXTRMITY,305,Amputation of lower limb except toes,08,Diseases and Disorders of the Musculoskeletal System and Conn Tissue,3,Major,Major,Surgical,Medicare,Medicare,Medicaid,,N,N,23755.40,5317.80
Long Island,Suffolk,5123000,000885,Brookhaven Memorial Hospital Medical Center Inc,50 to 69,119,F,White,Not Span/Hispanic,4,Elective,Inpatient Rehabilitation Facility,2017,050,Diabetes mellitus with complications,157,AMPUTATE LOWER EXTRMITY,305,Amputation of lower limb except toes,08,Diseases and Disorders of the Musculoskeletal System and Conn Tissue,2,Moderate,Moderate,Surgical,Medicare,Medicare,Blue Cross/Blue Shield,,N,N,34503.07,7996.99
Long Island,Suffolk,5123000,000885,Brookhaven Memorial Hospital Medical Center Inc,70 or Older,117,M,White,Not Span/Hispanic,10,Emergency,Home or Self Care,2017,050,Diabetes mellitus with complications,157,AMPUTATE LOWER EXTRMITY,305,Amputation of lower limb except toes,08,Diseases and Disorders of the Musculoskeletal System and Conn Tissue,2,Moderate,Moderate,Surgical,Medicare,Medicare,Private Health Insurance,,N,Y,89475.89,17141.10
Long Island,Suffolk,5123000,000885,Brookhaven Memorial Hospital Medical Center Inc,50 to 69,119,M,White,Not Span/Hispanic,12,Emergency,Skilled Nursing Home,2017,050,Diabetes mellitus with complications,157,AMPUTATE LOWER EXTRMITY,305,Amputation of lower limb except toes,08,Diseases and Disorders of the Musculoskeletal System and Conn Tissue,2,Moderate,Minor,Surgical,Medicare,Medicare,,,N,Y,87836.51,19394.64
Long Island,Suffolk,5123000,000885,Brookhaven Memorial Hospital Medical Center Inc,70 or Older,117,M,White,Not Span/Hispanic,10,Emergency,Home w/ Home Health Services,2017,050,Diabetes mellitus with complications,157,AMPUTATE LOWER EXTRMITY,305,Amputation of lower limb except toes,08,Diseases and Disorders of the Musculoskeletal System and Conn Tissue,3,Major,Moderate,Surgical,Medicare,,,,N,Y,77245.27,17991.73
Long Island,Suffolk,5123000,000885,Brookhaven Memorial Hospital Medical Center Inc,70 or Older,117,M,Other Race,Not Span/Hispanic,7,Emergency,Skilled Nursing Home,2017,201,Infective arthritis and osteomyelitis (except that caused by tuberculosis or sexually transmitted disease),157,AMPUTATE LOWER EXTRMITY,305,Amputation of lower limb except toes,08,Diseases and Disorders of the Musculoskeletal System and Conn Tissue,2,Moderate,Moderate,Surgical,Medicare,Medicare,,,N,Y,57009.92,11678.27
Long Island,Suffolk,5123000,000885,Brookhaven Memorial Hospital Medical Center Inc,70 or Older,117,M,White,Not Span/Hispanic,15,Emergency,Skilled Nursing Home,2017,248,Gangrene,157,AMPUTATE LOWER EXTRMITY,305,Amputation of lower limb except toes,08,Diseases and Disorders of the Musculoskeletal System and Conn Tissue,3,Major,Major,Surgical,Medicare,Medicare,Private Health Insurance,,N,Y,101567.21,23203.89
Long Island,Suffolk,5123000,000885,Brookhaven Memorial Hospital Medical Center Inc,70 or Older,117,F,White,Not Span/Hispanic,9,Emergency,Skilled Nursing Home,2017,248,Gangrene,157,AMPUTATE LOWER EXTRMITY,305,Amputation of lower limb except toes,08,Diseases and Disorders of the Musculoskeletal System and Conn Tissue,3,Major,Moderate,Surgical,Medicare,Medicare,Private Health Insurance,,N,Y,73035.95,16092.45
Long Island,Suffolk,5123000,000885,Brookhaven Memorial Hospital Medical Center Inc,50 to 69,119,M,White,Not Span/Hispanic,9,Emergency,Skilled Nursing Home,2017,050,Diabetes mellitus with complications,157,AMPUTATE LOWER EXTRMITY,305,Amputation of lower limb except toes,08,Diseases and Disorders of the Musculoskeletal System and Conn Tissue,3,Major,Moderate,Surgical,Medicare,Medicare,Blue Cross/Blue Shield,,N,Y,67601.38,14431.19
Long Island,Suffolk,5123000,000885,Brookhaven Memorial Hospital Medical Center Inc,50 to 69,117,M,White,Not Span/Hispanic,10,Emergency,Home w/ Home Health Services,2017,238,Complications of surgical procedures or medical care,157,AMPUTATE LOWER EXTRMITY,305,Amputation of lower limb except toes,08,Diseases and Disorders of the Musculoskeletal System and Conn Tissue,3,Major,Major,Surgical,Medicare,Medicare,Blue Cross/Blue Shield,,N,Y,105946.23,21940.64
Long Island,Suffolk,5123000,000885,Brookhaven Memorial Hospital Medical Center Inc,50 to 69,119,F,White,Not Span/Hispanic,4,Urgent,Skilled Nursing Home,2017,050,Diabetes mellitus with complications,157,AMPUTATE LOWER EXTRMITY,305,Amputation of lower limb except toes,08,Diseases and Disorders of the Musculoskeletal System and Conn Tissue,2,Moderate,Moderate,Surgical,Medicare,Medicare,Medicaid,,N,N,36978.95,8557.99
Long Island,Suffolk,5123000,000885,Brookhaven Memorial Hospital Medical Center Inc,70 or Older,117,M,White,Not Span/Hispanic,7,Emergency,Home or Self Care,2017,201,Infective arthritis and osteomyelitis (except that caused by tuberculosis or sexually transmitted disease),157,AMPUTATE LOWER EXTRMITY,305,Amputation of lower limb except toes,08,Diseases and Disorders of the Musculoskeletal System and Conn Tissue,3,Major,Moderate,Surgical,Medicare,Medicare,Private Health Insurance,,N,Y,74002.91,14811.59
Long Island,Suffolk,5123000,000885,Brookhaven Memorial Hospital Medical Center Inc,50 to 69,117,M,Black/African American,Not Span/Hispanic,7,Emergency,Home w/ Home Health Services,2017,248,Gangrene,157,AMPUTATE LOWER EXTRMITY,305,Amputation of lower limb except toes,08,Diseases and Disorders of the Musculoskeletal System and Conn Tissue,2,Moderate,Minor,Surgical,Private Health Insurance,Medicaid,,,N,Y,54264.17,12182.91
Long Island,Suffolk,5123000,000885,Brookhaven Memorial Hospital Medical Center Inc,50 to 69,119,M,White,Not Span/Hispanic,11,Emergency,Home w/ Home Health Services,2017,050,Diabetes mellitus with complications,157,AMPUTATE LOWER EXTRMITY,305,Amputation of lower limb except toes,08,Diseases and Disorders of the Musculoskeletal System and Conn Tissue,3,Major,Major,Surgical,Medicare,Medicaid,Medicare,,N,Y,96358.60,21148.24
Long Island,Suffolk,5123000,000885,Brookhaven Memorial Hospital Medical Center Inc,70 or Older,119,M,White,Not Span/Hispanic,25,Emergency,Skilled Nursing Home,2017,201,Infective arthritis and osteomyelitis (except that caused by tuberculosis or sexually transmitted disease),157,AMPUTATE LOWER EXTRMITY,305,Amputation of lower limb except toes,08,Diseases and Disorders of the Musculoskeletal System and Conn Tissue,4,Extreme,Major,Surgical,Medicare,Medicare,,,N,Y,207734.00,45188.66
