Hospital Service Area,Hospital County,Operating Certificate Number,Permanent Facility Id,Facility Name,Age Group,Zip Code - 3 digits,Gender,Race,Ethnicity,Length of Stay,Type of Admission,Patient Disposition,Discharge Year,CCS Diagnosis Code,CCS Diagnosis Description,CCS Procedure Code,CCS Procedure Description,APR DRG Code,APR DRG Description,APR MDC Code,APR MDC Description,APR Severity of Illness Code,APR Severity of Illness Description,APR Risk of Mortality,APR Medical Surgical Description,Payment Typology 1,Payment Typology 2,Payment Typology 3,Birth Weight,Abortion Edit Indicator,Emergency Department Indicator,Total Charges,Total Costs
New York City,Manhattan,7002053,001446,NYU Langone Orthopedic Hospital,70 or Older,112,M,White,Not Span/Hispanic,8,Emergency,Inpatient Rehabilitation Facility,2017,226,Fracture of neck of femur (hip),146,"TRTMNT,FRAC HIP/FEMUR",308,Hip and femur fracture repair,08,Diseases and Disorders of the Musculoskeletal System and Conn Tissue,3,Major,Major,Surgical,Medicare,,,,N,Y,151635.40,36689.71
New York City,Manhattan,7002053,001446,NYU Langone Orthopedic Hospital,50 to 69,OOS,F,White,Not Span/Hispanic,8,Emergency,Skilled Nursing Home,2017,226,Fracture of neck of femur (hip),146,"TRTMNT,FRAC HIP/FEMUR",308,Hip and femur fracture repair,08,Diseases and Disorders of the Musculoskeletal System and Conn Tissue,1,Minor,Minor,Surgical,Blue Cross/Blue Shield,,,,N,Y,170004.06,51270.30
New York City,Manhattan,7002053,001446,NYU Langone Orthopedic Hospital,70 or Older,112,F,White,Not Span/Hispanic,5,Emergency,Home w/ Home Health Services,2017,226,Fracture of neck of femur (hip),146,"TRTMNT,FRAC HIP/FEMUR",308,Hip and femur fracture repair,08,Diseases and Disorders of the Musculoskeletal System and Conn Tissue,2,Moderate,Moderate,Surgical,Medicare,,,,N,Y,81473.14,25197.82
New York City,Manhattan,7002053,001446,NYU Langone Orthopedic Hospital,70 or Older,112,M,White,Not Span/Hispanic,6,Emergency,Inpatient Rehabilitation Facility,2017,226,Fracture of neck of femur (hip),146,"TRTMNT,FRAC HIP/FEMUR",308,Hip and femur fracture repair,08,Diseases and Disorders of the Musculoskeletal System and Conn Tissue,3,Major,Moderate,Surgical,Medicare,,,,N,Y,205128.75,63269.41
New York City,Manhattan,7002053,001446,NYU Langone Orthopedic Hospital,50 to 69,OOS,F,White,Not Span/Hispanic,3,Emergency,Inpatient Rehabilitation Facility,2017,226,Fracture of neck of femur (hip),146,"TRTMNT,FRAC HIP/FEMUR",308,Hip and femur fracture repair,08,Diseases and Disorders of the Musculoskeletal System and Conn Tissue,2,Moderate,Minor,Surgical,Medicare,,,,N,Y,85226.32,20859.62
New York City,Manhattan,7002053,001446,NYU Langone Orthopedic Hospital,70 or Older,100,F,White,Not Span/Hispanic,21,Emergency,Skilled Nursing Home,2017,230,Fracture of lower limb,146,"TRTMNT,FRAC HIP/FEMUR",308,Hip and femur fracture repair,08,Diseases and Disorders of the Musculoskeletal System and Conn Tissue,4,Extreme,Major,Surgical,Medicare,,,,N,Y,601771.78,218992.52
New York City,Manhattan,7002053,001446,NYU Langone Orthopedic Hospital,70 or Older,100,F,White,Not Span/Hispanic,8,Emergency,Skilled Nursing Home,2017,226,Fracture of neck of femur (hip),146,"TRTMNT,FRAC HIP/FEMUR",308,Hip and femur fracture repair,08,Diseases and Disorders of the Musculoskeletal System and Conn Tissue,2,Moderate,Major,Surgical,Medicare,,,,N,Y,140346.56,43635.25
New York City,Manhattan,7002053,001446,NYU Langone Orthopedic Hospital,50 to 69,112,F,Other Race,Spanish/Hispanic,7,Emergency,Skilled Nursing Home,2017,230,Fracture of lower limb,146,"TRTMNT,FRAC HIP/FEMUR",308,Hip and femur fracture repair,08,Diseases and Disorders of the Musculoskeletal System and Conn Tissue,1,Minor,Minor,Surgical,Medicaid,,,,N,Y,111333.84,36285.79
New York City,Manhattan,7002053,001446,NYU Langone Orthopedic Hospital,70 or Older,112,F,White,Not Span/Hispanic,4,Emergency,Skilled Nursing Home,2017,226,Fracture of neck of femur (hip),146,"TRTMNT,FRAC HIP/FEMUR",308,Hip and femur fracture repair,08,Diseases and Disorders of the Musculoskeletal System and Conn Tissue,2,Moderate,Minor,Surgical,Medicare,,,,N,Y,100432.75,28406.33
New York City,Manhattan,7002053,001446,NYU Langone Orthopedic Hospital,50 to 69,112,F,White,Not Span/Hispanic,5,Emergency,Home w/ Home Health Services,2017,226,Fracture of neck of femur (hip),146,"TRTMNT,FRAC HIP/FEMUR",308,Hip and femur fracture repair,08,Diseases and Disorders of the Musculoskeletal System and Conn Tissue,1,Minor,Minor,Surgical,Blue Cross/Blue Shield,,,,N,Y,102355.90,28230.29
New York City,Manhattan,7002053,001446,NYU Langone Orthopedic Hospital,70 or Older,100,F,White,Not Span/Hispanic,8,Emergency,Skilled Nursing Home,2017,226,Fracture of neck of femur (hip),146,"TRTMNT,FRAC HIP/FEMUR",308,Hip and femur fracture repair,08,Diseases and Disorders of the Musculoskeletal System and Conn Tissue,1,Minor,Minor,Surgical,Medicare,,,,N,Y,169936.14,57044.38
New York City,Manhattan,7002053,001446,NYU Langone Orthopedic Hospital,70 or Older,100,F,Other Race,Not Span/Hispanic,7,Emergency,Skilled Nursing Home,2017,226,Fracture of neck of femur (hip),146,"TRTMNT,FRAC HIP/FEMUR",308,Hip and femur fracture repair,08,Diseases and Disorders of the Musculoskeletal System and Conn Tissue,3,Major,Major,Surgical,Medicare,,,,N,Y,193613.93,51355.95
New York City,Manhattan,7002053,001446,NYU Langone Orthopedic Hospital,70 or Older,100,F,White,Not Span/Hispanic,4,Emergency,Skilled Nursing Home,2017,226,Fracture of neck of femur (hip),146,"TRTMNT,FRAC HIP/FEMUR",308,Hip and femur fracture repair,08,Diseases and Disorders of the Musculoskeletal System and Conn Tissue,2,Moderate,Moderate,Surgical,Medicare,,,,N,Y,150276.76,39979.18
New York City,Manhattan,7002053,001446,NYU Langone Orthopedic Hospital,50 to 69,112,M,White,Not Span/Hispanic,3,Emergency,Home w/ Home Health Services,2017,226,Fracture of neck of femur (hip),146,"TRTMNT,FRAC HIP/FEMUR",308,Hip and femur fracture repair,08,Diseases and Disorders of the Musculoskeletal System and Conn Tissue,1,Minor,Minor,Surgical,Private Health Insurance,,,,N,Y,92641.63,21865.58
New York City,Manhattan,7002053,001446,NYU Langone Orthopedic Hospital,70 or Older,OOS,F,White,Not Span/Hispanic,6,Elective,Inpatient Rehabilitation Facility,2017,226,Fracture of neck of femur (hip),146,"TRTMNT,FRAC HIP/FEMUR",308,Hip and femur fracture repair,08,Diseases and Disorders of the Musculoskeletal System and Conn Tissue,2,Moderate,Major,Surgical,Medicare,,,,N,N,124716.99,44145.74
New York City,Manhattan,7002053,001446,NYU Langone Orthopedic Hospital,70 or Older,112,F,White,Not Span/Hispanic,7,Elective,Skilled Nursing Home,2017,226,Fracture of neck of femur (hip),146,"TRTMNT,FRAC HIP/FEMUR",308,Hip and femur fracture repair,08,Diseases and Disorders of the Musculoskeletal System and Conn Tissue,2,Moderate,Moderate,Surgical,Private Health Insurance,,,,N,N,125595.15,37461.17
New York City,Manhattan,7002053,001446,NYU Langone Orthopedic Hospital,70 or Older,100,M,Other Race,Not Span/Hispanic,7,Emergency,Home w/ Home Health Services,2017,226,Fracture of neck of femur (hip),146,"TRTMNT,FRAC HIP/FEMUR",308,Hip and femur fracture repair,08,Diseases and Disorders of the Musculoskeletal System and Conn Tissue,2,Moderate,Moderate,Surgical,Medicare,,,,N,Y,110047.78,33957.35
New York City,Manhattan,7002053,001446,NYU Langone Orthopedic Hospital,50 to 69,OOS,M,White,Not Span/Hispanic,6,Emergency,Home w/ Home Health Services,2017,226,Fracture of neck of femur (hip),146,"TRTMNT,FRAC HIP/FEMUR",308,Hip and femur fracture repair,08,Diseases and Disorders of the Musculoskeletal System and Conn Tissue,1,Minor,Minor,Surgical,Private Health Insurance,,,,N,Y,128309.41,34968.71
New York City,Manhattan,7002053,001446,NYU Langone Orthopedic Hospital,70 or Older,112,F,White,Not Span/Hispanic,9,Emergency,Home w/ Home Health Services,2017,226,Fracture of neck of femur (hip),146,"TRTMNT,FRAC HIP/FEMUR",308,Hip and femur fracture repair,08,Diseases and Disorders of the Musculoskeletal System and Conn Tissue,1,Minor,Minor,Surgical,Medicare,,,,N,Y,159547.50,47206.57
New York City,Manhattan,7002053,001446,NYU Langone Orthopedic Hospital,70 or Older,OOS,M,White,Not Span/Hispanic,6,Emergency,Home w/ Home Health Services,2017,226,Fracture of neck of femur (hip),146,"TRTMNT,FRAC HIP/FEMUR",308,Hip and femur fracture repair,08,Diseases and Disorders of the Musculoskeletal System and Conn Tissue,1,Minor,Minor,Surgical,Medicaid,,,,N,Y,104422.19,30609.10
New York City,Manhattan,7002053,001446,NYU Langone Orthopedic Hospital,50 to 69,113,M,Other Race,Not Span/Hispanic,3,Elective,Home w/ Home Health Services,2017,226,Fracture of neck of femur (hip),146,"TRTMNT,FRAC HIP/FEMUR",308,Hip and femur fracture repair,08,Diseases and Disorders of the Musculoskeletal System and Conn Tissue,2,Moderate,Minor,Surgical,Blue Cross/Blue Shield,,,,N,Y,66895.22,19342.08
New York City,Manhattan,7002053,001446,NYU Langone Orthopedic Hospital,50 to 69,100,F,White,Not Span/Hispanic,7,Emergency,Home w/ Home Health Services,2017,226,Fracture of neck of femur (hip),146,"TRTMNT,FRAC HIP/FEMUR",308,Hip and femur fracture repair,08,Diseases and Disorders of the Musculoskeletal System and Conn Tissue,3,Major,Moderate,Surgical,Medicare,,,,N,Y,146593.19,43071.23
New York City,Manhattan,7002053,001446,NYU Langone Orthopedic Hospital,70 or Older,100,F,White,Not Span/Hispanic,8,Emergency,Skilled Nursing Home,2017,226,Fracture of neck of femur (hip),146,"TRTMNT,FRAC HIP/FEMUR",308,Hip and femur fracture repair,08,Diseases and Disorders of the Musculoskeletal System and Conn Tissue,2,Moderate,Moderate,Surgical,Medicare,,,,N,Y,207562.94,63309.92
New York City,Manhattan,7002053,001446,NYU Langone Orthopedic Hospital,0 to 17,112,M,White,Not Span/Hispanic,1,Elective,Home or Self Care,2017,230,Fracture of lower limb,146,"TRTMNT,FRAC HIP/FEMUR",308,Hip and femur fracture repair,08,Diseases and Disorders of the Musculoskeletal System and Conn Tissue,1,Minor,Minor,Surgical,Private Health Insurance,,,,N,N,32391.96,8207.10
New York City,Manhattan,7002053,001446,NYU Langone Orthopedic Hospital,70 or Older,,F,White,Not Span/Hispanic,4,Emergency,Skilled Nursing Home,2017,226,Fracture of neck of femur (hip),146,"TRTMNT,FRAC HIP/FEMUR",308,Hip and femur fracture repair,08,Diseases and Disorders of the Musculoskeletal System and Conn Tissue,1,Minor,Minor,Surgical,Medicare,,,,N,Y,133724.36,35133.11
New York City,Manhattan,7002053,001446,NYU Langone Orthopedic Hospital,70 or Older,100,F,White,Not Span/Hispanic,6,Emergency,Home w/ Home Health Services,2017,226,Fracture of neck of femur (hip),146,"TRTMNT,FRAC HIP/FEMUR",308,Hip and femur fracture repair,08,Diseases and Disorders of the Musculoskeletal System and Conn Tissue,1,Minor,Minor,Surgical,Medicare,,,,N,Y,118913.88,33816.24
New York City,Manhattan,7002053,001446,NYU Langone Orthopedic Hospital,0 to 17,112,M,White,Not Span/Hispanic,1,Urgent,Home or Self Care,2017,230,Fracture of lower limb,146,"TRTMNT,FRAC HIP/FEMUR",308,Hip and femur fracture repair,08,Diseases and Disorders of the Musculoskeletal System and Conn Tissue,1,Minor,Minor,Surgical,Private Health Insurance,,,,N,N,31455.10,7998.85
New York City,Manhattan,7002053,001446,NYU Langone Orthopedic Hospital,70 or Older,100,F,White,Not Span/Hispanic,7,Emergency,Inpatient Rehabilitation Facility,2017,226,Fracture of neck of femur (hip),193,DX ULTRASOUND HEART,308,Hip and femur fracture repair,08,Diseases and Disorders of the Musculoskeletal System and Conn Tissue,1,Minor,Moderate,Surgical,Medicare,,,,N,Y,121648.29,39377.48
New York City,Manhattan,7002053,001446,NYU Langone Orthopedic Hospital,18 to 29,112,M,White,Not Span/Hispanic,2,Elective,Home w/ Home Health Services,2017,207,Pathological fracture,146,"TRTMNT,FRAC HIP/FEMUR",308,Hip and femur fracture repair,08,Diseases and Disorders of the Musculoskeletal System and Conn Tissue,3,Major,Moderate,Surgical,Private Health Insurance,,,,N,N,60055.57,12393.38
New York City,Manhattan,7002053,001446,NYU Langone Orthopedic Hospital,50 to 69,112,F,Other Race,Unknown,3,Emergency,Home w/ Home Health Services,2017,226,Fracture of neck of femur (hip),146,"TRTMNT,FRAC HIP/FEMUR",308,Hip and femur fracture repair,08,Diseases and Disorders of the Musculoskeletal System and Conn Tissue,1,Minor,Minor,Surgical,Private Health Insurance,,,,N,Y,87070.74,23279.82
New York City,Manhattan,7002053,001446,NYU Langone Orthopedic Hospital,70 or Older,112,M,White,Not Span/Hispanic,5,Emergency,Home w/ Home Health Services,2017,226,Fracture of neck of femur (hip),146,"TRTMNT,FRAC HIP/FEMUR",308,Hip and femur fracture repair,08,Diseases and Disorders of the Musculoskeletal System and Conn Tissue,2,Moderate,Minor,Surgical,Medicare,,,,N,Y,89331.46,23703.05
New York City,Manhattan,7002053,001446,NYU Langone Orthopedic Hospital,70 or Older,100,F,White,Not Span/Hispanic,6,Emergency,Skilled Nursing Home,2017,226,Fracture of neck of femur (hip),146,"TRTMNT,FRAC HIP/FEMUR",308,Hip and femur fracture repair,08,Diseases and Disorders of the Musculoskeletal System and Conn Tissue,1,Minor,Minor,Surgical,Medicare,,,,N,Y,130011.32,38283.51
New York City,Manhattan,7002053,001446,NYU Langone Orthopedic Hospital,70 or Older,100,M,Other Race,Not Span/Hispanic,6,Elective,Inpatient Rehabilitation Facility,2017,226,Fracture of neck of femur (hip),146,"TRTMNT,FRAC HIP/FEMUR",308,Hip and femur fracture repair,08,Diseases and Disorders of the Musculoskeletal System and Conn Tissue,2,Moderate,Moderate,Surgical,Medicare,,,,N,N,105163.99,32385.78
New York City,Manhattan,7002053,001446,NYU Langone Orthopedic Hospital,70 or Older,103,F,White,Not Span/Hispanic,6,Emergency,Inpatient Rehabilitation Facility,2017,226,Fracture of neck of femur (hip),146,"TRTMNT,FRAC HIP/FEMUR",308,Hip and femur fracture repair,08,Diseases and Disorders of the Musculoskeletal System and Conn Tissue,2,Moderate,Moderate,Surgical,Medicare,,,,N,Y,108799.66,32353.81
New York City,Manhattan,7002053,001446,NYU Langone Orthopedic Hospital,70 or Older,111,F,White,Not Span/Hispanic,6,Emergency,Skilled Nursing Home,2017,230,Fracture of lower limb,146,"TRTMNT,FRAC HIP/FEMUR",308,Hip and femur fracture repair,08,Diseases and Disorders of the Musculoskeletal System and Conn Tissue,2,Moderate,Moderate,Surgical,Medicare,,,,N,Y,202594.34,52145.19
New York City,Manhattan,7002053,001446,NYU Langone Orthopedic Hospital,70 or Older,105,F,White,Not Span/Hispanic,4,Elective,Skilled Nursing Home,2017,226,Fracture of neck of femur (hip),146,"TRTMNT,FRAC HIP/FEMUR",308,Hip and femur fracture repair,08,Diseases and Disorders of the Musculoskeletal System and Conn Tissue,2,Moderate,Moderate,Surgical,Medicare,,,,N,N,93639.78,26479.11
New York City,Manhattan,7002053,001446,NYU Langone Orthopedic Hospital,70 or Older,112,F,White,Not Span/Hispanic,6,Emergency,Skilled Nursing Home,2017,226,Fracture of neck of femur (hip),146,"TRTMNT,FRAC HIP/FEMUR",308,Hip and femur fracture repair,08,Diseases and Disorders of the Musculoskeletal System and Conn Tissue,3,Major,Minor,Surgical,Medicare,,,,N,Y,161374.88,44968.55
New York City,Manhattan,7002053,001446,NYU Langone Orthopedic Hospital,70 or Older,100,M,Other Race,Not Span/Hispanic,4,Emergency,Home w/ Home Health Services,2017,226,Fracture of neck of femur (hip),146,"TRTMNT,FRAC HIP/FEMUR",308,Hip and femur fracture repair,08,Diseases and Disorders of the Musculoskeletal System and Conn Tissue,2,Moderate,Moderate,Surgical,Medicare,,,,N,Y,114832.68,29522.31
New York City,Manhattan,7002053,001446,NYU Langone Orthopedic Hospital,70 or Older,100,F,White,Not Span/Hispanic,4,Emergency,Skilled Nursing Home,2017,226,Fracture of neck of femur (hip),146,"TRTMNT,FRAC HIP/FEMUR",308,Hip and femur fracture repair,08,Diseases and Disorders of the Musculoskeletal System and Conn Tissue,1,Minor,Minor,Surgical,Medicare,,,,N,Y,115673.39,30711.44
New York City,Manhattan,7002053,001446,NYU Langone Orthopedic Hospital,50 to 69,OOS,F,White,Not Span/Hispanic,7,Emergency,Home w/ Home Health Services,2017,226,Fracture of neck of femur (hip),146,"TRTMNT,FRAC HIP/FEMUR",308,Hip and femur fracture repair,08,Diseases and Disorders of the Musculoskeletal System and Conn Tissue,1,Minor,Minor,Surgical,Private Health Insurance,,,,N,Y,139491.29,42714.51
New York City,Manhattan,7002053,001446,NYU Langone Orthopedic Hospital,50 to 69,112,M,White,Not Span/Hispanic,8,Emergency,Home w/ Home Health Services,2017,226,Fracture of neck of femur (hip),146,"TRTMNT,FRAC HIP/FEMUR",308,Hip and femur fracture repair,08,Diseases and Disorders of the Musculoskeletal System and Conn Tissue,2,Moderate,Minor,Surgical,Private Health Insurance,,,,N,Y,140665.22,44587.98
New York City,Manhattan,7002053,001446,NYU Langone Orthopedic Hospital,50 to 69,109,F,White,Not Span/Hispanic,6,Emergency,Skilled Nursing Home,2017,226,Fracture of neck of femur (hip),146,"TRTMNT,FRAC HIP/FEMUR",308,Hip and femur fracture repair,08,Diseases and Disorders of the Musculoskeletal System and Conn Tissue,2,Moderate,Minor,Surgical,Medicare,,,,N,Y,143618.56,38766.64
New York City,Manhattan,7002053,001446,NYU Langone Orthopedic Hospital,70 or Older,,F,White,Unknown,8,Elective,Skilled Nursing Home,2017,207,Pathological fracture,146,"TRTMNT,FRAC HIP/FEMUR",308,Hip and femur fracture repair,08,Diseases and Disorders of the Musculoskeletal System and Conn Tissue,4,Extreme,Major,Surgical,Medicare,,,,N,N,235512.89,72165.84
New York City,Manhattan,7002053,001446,NYU Langone Orthopedic Hospital,70 or Older,100,M,White,Not Span/Hispanic,11,Emergency,Home w/ Home Health Services,2017,226,Fracture of neck of femur (hip),146,"TRTMNT,FRAC HIP/FEMUR",308,Hip and femur fracture repair,08,Diseases and Disorders of the Musculoskeletal System and Conn Tissue,2,Moderate,Major,Surgical,Medicare,,,,N,Y,165100.35,57582.90
New York City,Manhattan,7002053,001446,NYU Langone Orthopedic Hospital,70 or Older,,F,White,Not Span/Hispanic,6,Emergency,Skilled Nursing Home,2017,226,Fracture of neck of femur (hip),146,"TRTMNT,FRAC HIP/FEMUR",308,Hip and femur fracture repair,08,Diseases and Disorders of the Musculoskeletal System and Conn Tissue,2,Moderate,Moderate,Surgical,Medicare,,,,N,Y,129414.24,35130.49
New York City,Manhattan,7002053,001446,NYU Langone Orthopedic Hospital,70 or Older,100,F,Other Race,Not Span/Hispanic,4,Emergency,Inpatient Rehabilitation Facility,2017,226,Fracture of neck of femur (hip),146,"TRTMNT,FRAC HIP/FEMUR",308,Hip and femur fracture repair,08,Diseases and Disorders of the Musculoskeletal System and Conn Tissue,2,Moderate,Minor,Surgical,Medicare,,,,N,Y,124988.81,30072.28
New York City,Manhattan,7002053,001446,NYU Langone Orthopedic Hospital,0 to 17,112,M,Other Race,Not Span/Hispanic,2,Elective,Home w/ Home Health Services,2017,226,Fracture of neck of femur (hip),146,"TRTMNT,FRAC HIP/FEMUR",308,Hip and femur fracture repair,08,Diseases and Disorders of the Musculoskeletal System and Conn Tissue,2,Moderate,Minor,Surgical,Private Health Insurance,,,,N,N,86247.07,20034.43
New York City,Manhattan,7002053,001446,NYU Langone Orthopedic Hospital,70 or Older,117,F,White,Not Span/Hispanic,6,Elective,Home w/ Home Health Services,2017,226,Fracture of neck of femur (hip),146,"TRTMNT,FRAC HIP/FEMUR",308,Hip and femur fracture repair,08,Diseases and Disorders of the Musculoskeletal System and Conn Tissue,2,Moderate,Moderate,Surgical,Medicare,,,,N,N,117917.23,35596.35
New York City,Manhattan,7002053,001446,NYU Langone Orthopedic Hospital,70 or Older,100,M,White,Not Span/Hispanic,7,Emergency,Skilled Nursing Home,2017,226,Fracture of neck of femur (hip),146,"TRTMNT,FRAC HIP/FEMUR",308,Hip and femur fracture repair,08,Diseases and Disorders of the Musculoskeletal System and Conn Tissue,3,Major,Major,Surgical,Medicare,,,,N,Y,141083.18,51426.95
New York City,Manhattan,7002053,001446,NYU Langone Orthopedic Hospital,70 or Older,112,F,White,Unknown,4,Urgent,Home w/ Home Health Services,2017,226,Fracture of neck of femur (hip),146,"TRTMNT,FRAC HIP/FEMUR",308,Hip and femur fracture repair,08,Diseases and Disorders of the Musculoskeletal System and Conn Tissue,1,Minor,Minor,Surgical,Medicare,,,,N,N,69953.25,21913.21
New York City,Manhattan,7002053,001446,NYU Langone Orthopedic Hospital,70 or Older,112,M,White,Not Span/Hispanic,6,Urgent,Skilled Nursing Home,2017,207,Pathological fracture,146,"TRTMNT,FRAC HIP/FEMUR",308,Hip and femur fracture repair,08,Diseases and Disorders of the Musculoskeletal System and Conn Tissue,2,Moderate,Major,Surgical,Private Health Insurance,,,,N,N,147968.89,41454.67
New York City,Manhattan,7002053,001446,NYU Langone Orthopedic Hospital,70 or Older,100,M,White,Not Span/Hispanic,4,Emergency,Skilled Nursing Home,2017,226,Fracture of neck of femur (hip),146,"TRTMNT,FRAC HIP/FEMUR",308,Hip and femur fracture repair,08,Diseases and Disorders of the Musculoskeletal System and Conn Tissue,2,Moderate,Moderate,Surgical,Medicare,,,,N,Y,107257.72,29853.27
New York City,Manhattan,7002053,001446,NYU Langone Orthopedic Hospital,30 to 49,100,M,White,Not Span/Hispanic,3,Emergency,Home w/ Home Health Services,2017,226,Fracture of neck of femur (hip),146,"TRTMNT,FRAC HIP/FEMUR",308,Hip and femur fracture repair,08,Diseases and Disorders of the Musculoskeletal System and Conn Tissue,2,Moderate,Minor,Surgical,Blue Cross/Blue Shield,,,,N,Y,66912.00,19522.43
New York City,Manhattan,7002053,001446,NYU Langone Orthopedic Hospital,70 or Older,100,F,White,Not Span/Hispanic,3,Emergency,Inpatient Rehabilitation Facility,2017,226,Fracture of neck of femur (hip),146,"TRTMNT,FRAC HIP/FEMUR",308,Hip and femur fracture repair,08,Diseases and Disorders of the Musculoskeletal System and Conn Tissue,1,Minor,Moderate,Surgical,Medicare,,,,N,Y,76577.83,21256.44
New York City,Manhattan,7002053,001446,NYU Langone Orthopedic Hospital,70 or Older,100,F,White,Not Span/Hispanic,4,Emergency,Home w/ Home Health Services,2017,226,Fracture of neck of femur (hip),146,"TRTMNT,FRAC HIP/FEMUR",308,Hip and femur fracture repair,08,Diseases and Disorders of the Musculoskeletal System and Conn Tissue,1,Minor,Minor,Surgical,Medicare,,,,N,Y,96206.14,26970.66
New York City,Manhattan,7002053,001446,NYU Langone Orthopedic Hospital,70 or Older,112,F,White,Not Span/Hispanic,17,Urgent,Home w/ Home Health Services,2017,226,Fracture of neck of femur (hip),146,"TRTMNT,FRAC HIP/FEMUR",308,Hip and femur fracture repair,08,Diseases and Disorders of the Musculoskeletal System and Conn Tissue,4,Extreme,Extreme,Surgical,Medicare,,,,N,N,286790.03,104100.29
New York City,Manhattan,7002053,001446,NYU Langone Orthopedic Hospital,50 to 69,100,F,White,Not Span/Hispanic,4,Emergency,Home w/ Home Health Services,2017,230,Fracture of lower limb,146,"TRTMNT,FRAC HIP/FEMUR",308,Hip and femur fracture repair,08,Diseases and Disorders of the Musculoskeletal System and Conn Tissue,2,Moderate,Minor,Surgical,Private Health Insurance,,,,N,Y,176190.17,42521.02
New York City,Manhattan,7002053,001446,NYU Langone Orthopedic Hospital,70 or Older,112,F,White,Not Span/Hispanic,6,Urgent,Skilled Nursing Home,2017,226,Fracture of neck of femur (hip),146,"TRTMNT,FRAC HIP/FEMUR",308,Hip and femur fracture repair,08,Diseases and Disorders of the Musculoskeletal System and Conn Tissue,2,Moderate,Minor,Surgical,Medicare,,,,N,N,90703.63,30478.47
New York City,Manhattan,7002053,001446,NYU Langone Orthopedic Hospital,70 or Older,,F,Other Race,Unknown,4,Emergency,Skilled Nursing Home,2017,226,Fracture of neck of femur (hip),146,"TRTMNT,FRAC HIP/FEMUR",308,Hip and femur fracture repair,08,Diseases and Disorders of the Musculoskeletal System and Conn Tissue,1,Minor,Minor,Surgical,Medicare,,,,N,Y,93236.71,27354.18
New York City,Manhattan,7002053,001446,NYU Langone Orthopedic Hospital,50 to 69,100,F,White,Not Span/Hispanic,8,Emergency,Skilled Nursing Home,2017,226,Fracture of neck of femur (hip),146,"TRTMNT,FRAC HIP/FEMUR",308,Hip and femur fracture repair,08,Diseases and Disorders of the Musculoskeletal System and Conn Tissue,1,Minor,Minor,Surgical,Medicare,,,,N,Y,112557.91,36573.08