Hospital Service Area,Hospital County,Operating Certificate Number,Permanent Facility Id,Facility Name,Age Group,Zip Code - 3 digits,Gender,Race,Ethnicity,Length of Stay,Type of Admission,Patient Disposition,Discharge Year,CCS Diagnosis Code,CCS Diagnosis Description,CCS Procedure Code,CCS Procedure Description,APR DRG Code,APR DRG Description,APR MDC Code,APR MDC Description,APR Severity of Illness Code,APR Severity of Illness Description,APR Risk of Mortality,APR Medical Surgical Description,Payment Typology 1,Payment Typology 2,Payment Typology 3,Birth Weight,Abortion Edit Indicator,Emergency Department Indicator,Total Charges,Total Costs
Long Island,Suffolk,5123000,000885,Brookhaven Memorial Hospital Medical Center Inc,70 or Older,117,F,White,Not Span/Hispanic,32,Emergency,Skilled Nursing Home,2017,226,Fracture of neck of femur (hip),146,"TRTMNT,FRAC HIP/FEMUR",308,Hip and femur fracture repair,08,Diseases and Disorders of the Musculoskeletal System and Conn Tissue,4,Extreme,Extreme,Surgical,Medicare,Medicare,Private Health Insurance,,N,Y,278623.18,55981.13
Long Island,Suffolk,5123000,000885,Brookhaven Memorial Hospital Medical Center Inc,70 or Older,117,F,White,Not Span/Hispanic,5,Emergency,Skilled Nursing Home,2017,226,Fracture of neck of femur (hip),146,"TRTMNT,FRAC HIP/FEMUR",308,Hip and femur fracture repair,08,Diseases and Disorders of the Musculoskeletal System and Conn Tissue,2,Moderate,Major,Surgical,Medicare,Medicare,,,N,Y,63988.59,13447.15
Long Island,Suffolk,5123000,000885,Brookhaven Memorial Hospital Medical Center Inc,70 or Older,117,F,White,Not Span/Hispanic,5,Emergency,Home w/ Home Health Services,2017,230,Fracture of lower limb,146,"TRTMNT,FRAC HIP/FEMUR",308,Hip and femur fracture repair,08,Diseases and Disorders of the Musculoskeletal System and Conn Tissue,2,Moderate,Minor,Surgical,Medicare,Medicare,Private Health Insurance,,N,Y,80573.88,16611.91
Long Island,Suffolk,5123000,000885,Brookhaven Memorial Hospital Medical Center Inc,70 or Older,119,M,White,Not Span/Hispanic,5,Emergency,Skilled Nursing Home,2017,226,Fracture of neck of femur (hip),146,"TRTMNT,FRAC HIP/FEMUR",308,Hip and femur fracture repair,08,Diseases and Disorders of the Musculoskeletal System and Conn Tissue,3,Major,Major,Surgical,Medicare,Medicare,,,N,Y,75308.93,14820.16
Long Island,Suffolk,5123000,000885,Brookhaven Memorial Hospital Medical Center Inc,70 or Older,119,F,White,Not Span/Hispanic,16,Emergency,Expired,2017,226,Fracture of neck of femur (hip),146,"TRTMNT,FRAC HIP/FEMUR",308,Hip and femur fracture repair,08,Diseases and Disorders of the Musculoskeletal System and Conn Tissue,3,Major,Major,Surgical,Medicare,Medicare,,,N,Y,263252.87,51781.04
Long Island,Suffolk,5123000,000885,Brookhaven Memorial Hospital Medical Center Inc,70 or Older,119,F,White,Not Span/Hispanic,3,Emergency,Skilled Nursing Home,2017,226,Fracture of neck of femur (hip),146,"TRTMNT,FRAC HIP/FEMUR",308,Hip and femur fracture repair,08,Diseases and Disorders of the Musculoskeletal System and Conn Tissue,2,Moderate,Major,Surgical,Medicare,Medicare,,,N,Y,55343.61,10713.19
Long Island,Suffolk,5123000,000885,Brookhaven Memorial Hospital Medical Center Inc,70 or Older,117,F,White,Not Span/Hispanic,7,Emergency,Skilled Nursing Home,2017,226,Fracture of neck of femur (hip),146,"TRTMNT,FRAC HIP/FEMUR",308,Hip and femur fracture repair,08,Diseases and Disorders of the Musculoskeletal System and Conn Tissue,3,Major,Moderate,Surgical,Medicare,Medicare,Medicaid,,N,Y,98745.35,15032.02
Long Island,Suffolk,5123000,000885,Brookhaven Memorial Hospital Medical Center Inc,70 or Older,117,F,White,Not Span/Hispanic,4,Emergency,Skilled Nursing Home,2017,226,Fracture of neck of femur (hip),146,"TRTMNT,FRAC HIP/FEMUR",308,Hip and femur fracture repair,08,Diseases and Disorders of the Musculoskeletal System and Conn Tissue,1,Minor,Minor,Surgical,Medicare,Medicare,Blue Cross/Blue Shield,,N,Y,76895.02,14260.46
Long Island,Suffolk,5123000,000885,Brookhaven Memorial Hospital Medical Center Inc,70 or Older,119,F,White,Not Span/Hispanic,4,Emergency,Skilled Nursing Home,2017,226,Fracture of neck of femur (hip),146,"TRTMNT,FRAC HIP/FEMUR",308,Hip and femur fracture repair,08,Diseases and Disorders of the Musculoskeletal System and Conn Tissue,2,Moderate,Moderate,Surgical,Medicare,Medicare,,,N,Y,50419.82,10719.38
Long Island,Suffolk,5123000,000885,Brookhaven Memorial Hospital Medical Center Inc,70 or Older,119,M,Other Race,Not Span/Hispanic,13,Emergency,Skilled Nursing Home,2017,226,Fracture of neck of femur (hip),146,"TRTMNT,FRAC HIP/FEMUR",308,Hip and femur fracture repair,08,Diseases and Disorders of the Musculoskeletal System and Conn Tissue,4,Extreme,Major,Surgical,Medicare,,,,N,Y,158690.08,30081.43
Long Island,Suffolk,5123000,000885,Brookhaven Memorial Hospital Medical Center Inc,50 to 69,117,F,White,Not Span/Hispanic,3,Emergency,Skilled Nursing Home,2017,226,Fracture of neck of femur (hip),146,"TRTMNT,FRAC HIP/FEMUR",308,Hip and femur fracture repair,08,Diseases and Disorders of the Musculoskeletal System and Conn Tissue,1,Minor,Minor,Surgical,Blue Cross/Blue Shield,,,,N,Y,63152.66,11928.89
Long Island,Suffolk,5123000,000885,Brookhaven Memorial Hospital Medical Center Inc,50 to 69,117,F,White,Not Span/Hispanic,4,Emergency,Home w/ Home Health Services,2017,226,Fracture of neck of femur (hip),146,"TRTMNT,FRAC HIP/FEMUR",308,Hip and femur fracture repair,08,Diseases and Disorders of the Musculoskeletal System and Conn Tissue,2,Moderate,Minor,Surgical,Private Health Insurance,,,,N,Y,64447.10,12535.65
Long Island,Suffolk,5123000,000885,Brookhaven Memorial Hospital Medical Center Inc,70 or Older,117,F,Other Race,Not Span/Hispanic,54,Emergency,Home or Self Care,2017,226,Fracture of neck of femur (hip),146,"TRTMNT,FRAC HIP/FEMUR",308,Hip and femur fracture repair,08,Diseases and Disorders of the Musculoskeletal System and Conn Tissue,3,Major,Major,Surgical,Medicare,Medicare,Medicaid,,N,Y,344508.60,73782.92
Long Island,Suffolk,5123000,000885,Brookhaven Memorial Hospital Medical Center Inc,70 or Older,117,M,White,Not Span/Hispanic,12,Emergency,Expired,2017,226,Fracture of neck of femur (hip),146,"TRTMNT,FRAC HIP/FEMUR",308,Hip and femur fracture repair,08,Diseases and Disorders of the Musculoskeletal System and Conn Tissue,4,Extreme,Extreme,Surgical,Medicare,Medicare,,,N,Y,166282.65,25892.60
Long Island,Suffolk,5123000,000885,Brookhaven Memorial Hospital Medical Center Inc,70 or Older,117,F,White,Not Span/Hispanic,8,Emergency,Skilled Nursing Home,2017,226,Fracture of neck of femur (hip),146,"TRTMNT,FRAC HIP/FEMUR",308,Hip and femur fracture repair,08,Diseases and Disorders of the Musculoskeletal System and Conn Tissue,3,Major,Major,Surgical,Medicare,Medicare,Medicaid,,N,Y,110934.84,18478.53
Long Island,Suffolk,5123000,000885,Brookhaven Memorial Hospital Medical Center Inc,70 or Older,119,F,White,Not Span/Hispanic,5,Emergency,Skilled Nursing Home,2017,226,Fracture of neck of femur (hip),146,"TRTMNT,FRAC HIP/FEMUR",308,Hip and femur fracture repair,08,Diseases and Disorders of the Musculoskeletal System and Conn Tissue,2,Moderate,Minor,Surgical,Medicare,Medicare,Private Health Insurance,,N,Y,78415.07,15722.69
Long Island,Suffolk,5123000,000885,Brookhaven Memorial Hospital Medical Center Inc,70 or Older,119,F,White,Not Span/Hispanic,9,Emergency,Skilled Nursing Home,2017,226,Fracture of neck of femur (hip),146,"TRTMNT,FRAC HIP/FEMUR",308,Hip and femur fracture repair,08,Diseases and Disorders of the Musculoskeletal System and Conn Tissue,2,Moderate,Moderate,Surgical,Medicare,,,,N,Y,81016.08,17436.91
Long Island,Suffolk,5123000,000885,Brookhaven Memorial Hospital Medical Center Inc,70 or Older,117,F,White,Not Span/Hispanic,15,Emergency,Skilled Nursing Home,2017,230,Fracture of lower limb,146,"TRTMNT,FRAC HIP/FEMUR",308,Hip and femur fracture repair,08,Diseases and Disorders of the Musculoskeletal System and Conn Tissue,4,Extreme,Extreme,Surgical,Medicare,Medicare,Private Health Insurance,,N,Y,179335.92,34244.89
Long Island,Suffolk,5123000,000885,Brookhaven Memorial Hospital Medical Center Inc,70 or Older,117,F,Other Race,Not Span/Hispanic,9,Emergency,Skilled Nursing Home,2017,226,Fracture of neck of femur (hip),146,"TRTMNT,FRAC HIP/FEMUR",308,Hip and femur fracture repair,08,Diseases and Disorders of the Musculoskeletal System and Conn Tissue,2,Moderate,Major,Surgical,Medicare,Medicare,Medicaid,,N,Y,118068.66,22297.57
Long Island,Suffolk,5123000,000885,Brookhaven Memorial Hospital Medical Center Inc,70 or Older,117,F,White,Not Span/Hispanic,14,Emergency,Skilled Nursing Home,2017,226,Fracture of neck of femur (hip),146,"TRTMNT,FRAC HIP/FEMUR",308,Hip and femur fracture repair,08,Diseases and Disorders of the Musculoskeletal System and Conn Tissue,3,Major,Major,Surgical,Medicare,Medicare,Blue Cross/Blue Shield,,N,Y,194855.77,38891.11
Long Island,Suffolk,5123000,000885,Brookhaven Memorial Hospital Medical Center Inc,70 or Older,117,F,White,Not Span/Hispanic,6,Emergency,Skilled Nursing Home,2017,226,Fracture of neck of femur (hip),146,"TRTMNT,FRAC HIP/FEMUR",308,Hip and femur fracture repair,08,Diseases and Disorders of the Musculoskeletal System and Conn Tissue,1,Minor,Minor,Surgical,Medicare,Medicare,Medicaid,,N,Y,77795.19,15695.89
Long Island,Suffolk,5123000,000885,Brookhaven Memorial Hospital Medical Center Inc,70 or Older,117,M,White,Not Span/Hispanic,5,Emergency,Skilled Nursing Home,2017,230,Fracture of lower limb,146,"TRTMNT,FRAC HIP/FEMUR",308,Hip and femur fracture repair,08,Diseases and Disorders of the Musculoskeletal System and Conn Tissue,1,Minor,Minor,Surgical,Medicare,Medicare,,,N,Y,74120.79,14336.67
Long Island,Suffolk,5123000,000885,Brookhaven Memorial Hospital Medical Center Inc,70 or Older,117,F,White,Not Span/Hispanic,5,Emergency,Skilled Nursing Home,2017,226,Fracture of neck of femur (hip),146,"TRTMNT,FRAC HIP/FEMUR",308,Hip and femur fracture repair,08,Diseases and Disorders of the Musculoskeletal System and Conn Tissue,3,Major,Moderate,Surgical,Medicare,Private Health Insurance,Medicare,,N,Y,60678.10,12565.87
Long Island,Suffolk,5123000,000885,Brookhaven Memorial Hospital Medical Center Inc,70 or Older,117,F,Other Race,Not Span/Hispanic,5,Emergency,Skilled Nursing Home,2017,226,Fracture of neck of femur (hip),146,"TRTMNT,FRAC HIP/FEMUR",308,Hip and femur fracture repair,08,Diseases and Disorders of the Musculoskeletal System and Conn Tissue,2,Moderate,Minor,Surgical,Medicare,,,,N,Y,77926.75,12637.43
Long Island,Suffolk,5123000,000885,Brookhaven Memorial Hospital Medical Center Inc,70 or Older,119,F,Other Race,Not Span/Hispanic,3,Emergency,Skilled Nursing Home,2017,207,Pathological fracture,146,"TRTMNT,FRAC HIP/FEMUR",308,Hip and femur fracture repair,08,Diseases and Disorders of the Musculoskeletal System and Conn Tissue,1,Minor,Minor,Surgical,Medicare,Medicare,Private Health Insurance,,N,Y,54396.52,11218.48
Long Island,Suffolk,5123000,000885,Brookhaven Memorial Hospital Medical Center Inc,70 or Older,117,F,White,Not Span/Hispanic,6,Emergency,Skilled Nursing Home,2017,226,Fracture of neck of femur (hip),146,"TRTMNT,FRAC HIP/FEMUR",308,Hip and femur fracture repair,08,Diseases and Disorders of the Musculoskeletal System and Conn Tissue,2,Moderate,Moderate,Surgical,Medicare,,,,N,Y,91293.34,17375.40
Long Island,Suffolk,5123000,000885,Brookhaven Memorial Hospital Medical Center Inc,50 to 69,117,F,White,Not Span/Hispanic,4,Emergency,Skilled Nursing Home,2017,226,Fracture of neck of femur (hip),146,"TRTMNT,FRAC HIP/FEMUR",308,Hip and femur fracture repair,08,Diseases and Disorders of the Musculoskeletal System and Conn Tissue,1,Minor,Minor,Surgical,Medicare,,,,N,Y,77413.85,13779.42
Long Island,Suffolk,5123000,000885,Brookhaven Memorial Hospital Medical Center Inc,70 or Older,119,F,Other Race,Not Span/Hispanic,6,Emergency,Skilled Nursing Home,2017,226,Fracture of neck of femur (hip),146,"TRTMNT,FRAC HIP/FEMUR",308,Hip and femur fracture repair,08,Diseases and Disorders of the Musculoskeletal System and Conn Tissue,3,Major,Major,Surgical,Medicare,Private Health Insurance,,,N,Y,129713.08,19506.55
Long Island,Suffolk,5123000,000885,Brookhaven Memorial Hospital Medical Center Inc,70 or Older,117,F,White,Not Span/Hispanic,9,Emergency,Skilled Nursing Home,2017,226,Fracture of neck of femur (hip),146,"TRTMNT,FRAC HIP/FEMUR",308,Hip and femur fracture repair,08,Diseases and Disorders of the Musculoskeletal System and Conn Tissue,3,Major,Major,Surgical,Medicare,Medicare,Blue Cross/Blue Shield,,N,Y,130225.38,23127.05
Long Island,Suffolk,5123000,000885,Brookhaven Memorial Hospital Medical Center Inc,50 to 69,119,M,White,Not Span/Hispanic,5,Emergency,Home w/ Home Health Services,2017,226,Fracture of neck of femur (hip),146,"TRTMNT,FRAC HIP/FEMUR",308,Hip and femur fracture repair,08,Diseases and Disorders of the Musculoskeletal System and Conn Tissue,3,Major,Moderate,Surgical,Self-Pay,,,,N,Y,89039.93,13002.78
Long Island,Suffolk,5123000,000885,Brookhaven Memorial Hospital Medical Center Inc,70 or Older,119,F,White,Not Span/Hispanic,5,Emergency,Skilled Nursing Home,2017,226,Fracture of neck of femur (hip),146,"TRTMNT,FRAC HIP/FEMUR",308,Hip and femur fracture repair,08,Diseases and Disorders of the Musculoskeletal System and Conn Tissue,2,Moderate,Moderate,Surgical,Medicare,,,,N,Y,81605.52,12954.68
Long Island,Suffolk,5123000,000885,Brookhaven Memorial Hospital Medical Center Inc,70 or Older,117,M,White,Not Span/Hispanic,6,Emergency,Skilled Nursing Home,2017,226,Fracture of neck of femur (hip),146,"TRTMNT,FRAC HIP/FEMUR",308,Hip and femur fracture repair,08,Diseases and Disorders of the Musculoskeletal System and Conn Tissue,2,Moderate,Moderate,Surgical,Medicare,,,,N,Y,72911.68,14165.27
Long Island,Suffolk,5123000,000885,Brookhaven Memorial Hospital Medical Center Inc,70 or Older,117,F,Other Race,Not Span/Hispanic,8,Emergency,Skilled Nursing Home,2017,226,Fracture of neck of femur (hip),222,BLOOD TRANSFUSION,308,Hip and femur fracture repair,08,Diseases and Disorders of the Musculoskeletal System and Conn Tissue,2,Moderate,Minor,Surgical,Private Health Insurance,Medicaid,,,N,Y,84972.21,17403.00
Long Island,Suffolk,5123000,000885,Brookhaven Memorial Hospital Medical Center Inc,70 or Older,117,F,White,Not Span/Hispanic,9,Emergency,Skilled Nursing Home,2017,226,Fracture of neck of femur (hip),146,"TRTMNT,FRAC HIP/FEMUR",308,Hip and femur fracture repair,08,Diseases and Disorders of the Musculoskeletal System and Conn Tissue,2,Moderate,Major,Surgical,Medicare,Medicare,Private Health Insurance,,N,Y,131983.97,24010.81
Long Island,Suffolk,5123000,000885,Brookhaven Memorial Hospital Medical Center Inc,70 or Older,117,M,White,Not Span/Hispanic,7,Emergency,Skilled Nursing Home,2017,226,Fracture of neck of femur (hip),146,"TRTMNT,FRAC HIP/FEMUR",308,Hip and femur fracture repair,08,Diseases and Disorders of the Musculoskeletal System and Conn Tissue,3,Major,Major,Surgical,Medicare,Medicare,Private Health Insurance,,N,Y,83164.77,16885.52
Long Island,Suffolk,5123000,000885,Brookhaven Memorial Hospital Medical Center Inc,70 or Older,119,F,Other Race,Not Span/Hispanic,14,Emergency,Skilled Nursing Home,2017,226,Fracture of neck of femur (hip),146,"TRTMNT,FRAC HIP/FEMUR",308,Hip and femur fracture repair,08,Diseases and Disorders of the Musculoskeletal System and Conn Tissue,4,Extreme,Extreme,Surgical,Medicare,,,,N,Y,156890.04,29315.43
Long Island,Suffolk,5123000,000885,Brookhaven Memorial Hospital Medical Center Inc,50 to 69,119,F,White,Not Span/Hispanic,14,Emergency,Skilled Nursing Home,2017,226,Fracture of neck of femur (hip),146,"TRTMNT,FRAC HIP/FEMUR",308,Hip and femur fracture repair,08,Diseases and Disorders of the Musculoskeletal System and Conn Tissue,3,Major,Major,Surgical,Medicare,Medicare,Medicaid,,N,Y,192355.03,33837.51
Long Island,Suffolk,5123000,000885,Brookhaven Memorial Hospital Medical Center Inc,70 or Older,117,F,White,Not Span/Hispanic,3,Emergency,Skilled Nursing Home,2017,226,Fracture of neck of femur (hip),146,"TRTMNT,FRAC HIP/FEMUR",308,Hip and femur fracture repair,08,Diseases and Disorders of the Musculoskeletal System and Conn Tissue,3,Major,Moderate,Surgical,Medicare,Medicare,Private Health Insurance,,N,Y,72344.14,10303.29
Long Island,Suffolk,5123000,000885,Brookhaven Memorial Hospital Medical Center Inc,50 to 69,119,M,White,Not Span/Hispanic,16,Emergency,Home w/ Home Health Services,2017,226,Fracture of neck of femur (hip),146,"TRTMNT,FRAC HIP/FEMUR",308,Hip and femur fracture repair,08,Diseases and Disorders of the Musculoskeletal System and Conn Tissue,3,Major,Moderate,Surgical,Medicare,Medicare,Blue Cross/Blue Shield,,N,Y,200453.71,35730.50
Long Island,Suffolk,5123000,000885,Brookhaven Memorial Hospital Medical Center Inc,50 to 69,117,F,Other Race,Not Span/Hispanic,5,Emergency,Home or Self Care,2017,207,Pathological fracture,146,"TRTMNT,FRAC HIP/FEMUR",308,Hip and femur fracture repair,08,Diseases and Disorders of the Musculoskeletal System and Conn Tissue,2,Moderate,Minor,Surgical,Private Health Insurance,Private Health Insurance,Private Health Insurance,,N,Y,59364.85,11585.13
Long Island,Suffolk,5123000,000885,Brookhaven Memorial Hospital Medical Center Inc,70 or Older,117,F,White,Not Span/Hispanic,6,Urgent,Skilled Nursing Home,2017,226,Fracture of neck of femur (hip),146,"TRTMNT,FRAC HIP/FEMUR",308,Hip and femur fracture repair,08,Diseases and Disorders of the Musculoskeletal System and Conn Tissue,2,Moderate,Moderate,Surgical,Medicare,Medicare,,,N,N,90636.27,14872.85
Long Island,Suffolk,5123000,000885,Brookhaven Memorial Hospital Medical Center Inc,70 or Older,117,F,White,Not Span/Hispanic,5,Emergency,Skilled Nursing Home,2017,226,Fracture of neck of femur (hip),146,"TRTMNT,FRAC HIP/FEMUR",308,Hip and femur fracture repair,08,Diseases and Disorders of the Musculoskeletal System and Conn Tissue,2,Moderate,Major,Surgical,Medicare,Medicare,Blue Cross/Blue Shield,,N,Y,99762.85,14670.98
Long Island,Suffolk,5123000,000885,Brookhaven Memorial Hospital Medical Center Inc,50 to 69,117,M,White,Not Span/Hispanic,3,Emergency,Skilled Nursing Home,2017,226,Fracture of neck of femur (hip),146,"TRTMNT,FRAC HIP/FEMUR",308,Hip and femur fracture repair,08,Diseases and Disorders of the Musculoskeletal System and Conn Tissue,2,Moderate,Minor,Surgical,Private Health Insurance,,,,N,Y,95396.68,14363.72
Long Island,Suffolk,5123000,000885,Brookhaven Memorial Hospital Medical Center Inc,70 or Older,117,F,White,Not Span/Hispanic,3,Emergency,Skilled Nursing Home,2017,226,Fracture of neck of femur (hip),146,"TRTMNT,FRAC HIP/FEMUR",308,Hip and femur fracture repair,08,Diseases and Disorders of the Musculoskeletal System and Conn Tissue,3,Major,Moderate,Surgical,Medicare,Medicare,Private Health Insurance,,N,Y,58715.28,10513.95
Long Island,Suffolk,5123000,000885,Brookhaven Memorial Hospital Medical Center Inc,70 or Older,117,F,White,Not Span/Hispanic,10,Emergency,Skilled Nursing Home,2017,226,Fracture of neck of femur (hip),146,"TRTMNT,FRAC HIP/FEMUR",308,Hip and femur fracture repair,08,Diseases and Disorders of the Musculoskeletal System and Conn Tissue,3,Major,Moderate,Surgical,Medicare,Medicare,Blue Cross/Blue Shield,,N,Y,121779.83,21632.77
Long Island,Suffolk,5123000,000885,Brookhaven Memorial Hospital Medical Center Inc,70 or Older,117,F,White,Not Span/Hispanic,3,Emergency,Short-term Hospital,2017,230,Fracture of lower limb,146,"TRTMNT,FRAC HIP/FEMUR",308,Hip and femur fracture repair,08,Diseases and Disorders of the Musculoskeletal System and Conn Tissue,2,Moderate,Moderate,Surgical,Medicare,,,,N,Y,66202.21,6417.49
Long Island,Suffolk,5123000,000885,Brookhaven Memorial Hospital Medical Center Inc,70 or Older,117,F,White,Not Span/Hispanic,7,Emergency,Skilled Nursing Home,2017,230,Fracture of lower limb,146,"TRTMNT,FRAC HIP/FEMUR",308,Hip and femur fracture repair,08,Diseases and Disorders of the Musculoskeletal System and Conn Tissue,1,Minor,Minor,Surgical,Medicare,,,,N,Y,118729.70,19861.06
Long Island,Suffolk,5123000,000885,Brookhaven Memorial Hospital Medical Center Inc,70 or Older,117,F,White,Not Span/Hispanic,7,Emergency,Skilled Nursing Home,2017,226,Fracture of neck of femur (hip),146,"TRTMNT,FRAC HIP/FEMUR",308,Hip and femur fracture repair,08,Diseases and Disorders of the Musculoskeletal System and Conn Tissue,2,Moderate,Minor,Surgical,Medicare,,,,N,Y,108764.94,19924.48
Long Island,Suffolk,5123000,000885,Brookhaven Memorial Hospital Medical Center Inc,70 or Older,117,F,White,Not Span/Hispanic,6,Emergency,Skilled Nursing Home,2017,226,Fracture of neck of femur (hip),146,"TRTMNT,FRAC HIP/FEMUR",308,Hip and femur fracture repair,08,Diseases and Disorders of the Musculoskeletal System and Conn Tissue,2,Moderate,Moderate,Surgical,Medicare,Medicare,,,N,Y,102845.91,16220.24
Long Island,Suffolk,5123000,000885,Brookhaven Memorial Hospital Medical Center Inc,70 or Older,117,F,White,Not Span/Hispanic,4,Emergency,Skilled Nursing Home,2017,226,Fracture of neck of femur (hip),146,"TRTMNT,FRAC HIP/FEMUR",308,Hip and femur fracture repair,08,Diseases and Disorders of the Musculoskeletal System and Conn Tissue,2,Moderate,Moderate,Surgical,Medicare,Private Health Insurance,Medicare,,N,Y,124318.45,18332.18
Long Island,Suffolk,5123000,000885,Brookhaven Memorial Hospital Medical Center Inc,70 or Older,117,M,White,Not Span/Hispanic,3,Emergency,Skilled Nursing Home,2017,226,Fracture of neck of femur (hip),146,"TRTMNT,FRAC HIP/FEMUR",308,Hip and femur fracture repair,08,Diseases and Disorders of the Musculoskeletal System and Conn Tissue,2,Moderate,Moderate,Surgical,Medicare,,,,N,Y,89901.61,13180.60
Long Island,Suffolk,5123000,000885,Brookhaven Memorial Hospital Medical Center Inc,70 or Older,117,F,White,Not Span/Hispanic,7,Emergency,Skilled Nursing Home,2017,226,Fracture of neck of femur (hip),146,"TRTMNT,FRAC HIP/FEMUR",308,Hip and femur fracture repair,08,Diseases and Disorders of the Musculoskeletal System and Conn Tissue,3,Major,Major,Surgical,Medicare,Medicare,Private Health Insurance,,N,Y,121266.81,20810.82
Long Island,Suffolk,5123000,000885,Brookhaven Memorial Hospital Medical Center Inc,70 or Older,119,F,White,Not Span/Hispanic,8,Emergency,Skilled Nursing Home,2017,226,Fracture of neck of femur (hip),146,"TRTMNT,FRAC HIP/FEMUR",308,Hip and femur fracture repair,08,Diseases and Disorders of the Musculoskeletal System and Conn Tissue,2,Moderate,Moderate,Surgical,Medicare,,,,N,Y,113992.11,17737.21
Long Island,Suffolk,5123000,000885,Brookhaven Memorial Hospital Medical Center Inc,50 to 69,117,F,White,Not Span/Hispanic,6,Emergency,Skilled Nursing Home,2017,226,Fracture of neck of femur (hip),146,"TRTMNT,FRAC HIP/FEMUR",308,Hip and femur fracture repair,08,Diseases and Disorders of the Musculoskeletal System and Conn Tissue,2,Moderate,Minor,Surgical,Private Health Insurance,,,,N,Y,60005.29,12346.43
Long Island,Suffolk,5123000,000885,Brookhaven Memorial Hospital Medical Center Inc,50 to 69,117,F,White,Not Span/Hispanic,5,Emergency,Skilled Nursing Home,2017,226,Fracture of neck of femur (hip),146,"TRTMNT,FRAC HIP/FEMUR",308,Hip and femur fracture repair,08,Diseases and Disorders of the Musculoskeletal System and Conn Tissue,2,Moderate,Minor,Surgical,Medicare,Medicare,,,N,Y,100965.12,16649.16
Long Island,Suffolk,5123000,000885,Brookhaven Memorial Hospital Medical Center Inc,70 or Older,117,M,White,Not Span/Hispanic,5,Emergency,Skilled Nursing Home,2017,226,Fracture of neck of femur (hip),146,"TRTMNT,FRAC HIP/FEMUR",308,Hip and femur fracture repair,08,Diseases and Disorders of the Musculoskeletal System and Conn Tissue,2,Moderate,Major,Surgical,Medicare,,,,N,Y,123589.79,17850.09