Hospital Service Area,Hospital County,Operating Certificate Number,Permanent Facility Id,Facility Name,Age Group,Zip Code - 3 digits,Gender,Race,Ethnicity,Length of Stay,Type of Admission,Patient Disposition,Discharge Year,CCS Diagnosis Code,CCS Diagnosis Description,CCS Procedure Code,CCS Procedure Description,APR DRG Code,APR DRG Description,APR MDC Code,APR MDC Description,APR Severity of Illness Code,APR Severity of Illness Description,APR Risk of Mortality,APR Medical Surgical Description,Payment Typology 1,Payment Typology 2,Payment Typology 3,Birth Weight,Abortion Edit Indicator,Emergency Department Indicator,Total Charges,Total Costs
Finger Lakes,Ontario,3402000,000671,Geneva General Hospital,70 or Older,131,F,White,Not Span/Hispanic,5,Urgent,Skilled Nursing Home,2018,INJ006,"FRACTURE OF THE NECK OF THE FEMUR (HIP), INITIAL ENCOUNTER",MST010,FEMUR FIXATION,308,HIP & FEMUR FRACTURE REPAIR,08,DISEASES AND DISORDERS OF THE MUSCULOSKELETAL SYSTEM AND CONNECTIVE TISSUE,1,Minor,Moderate,Surgical,Medicare,,,,,true,40475.97,23477.95
New York City,Bronx,7000001,001178,BronxCare Hospital Center,70 or Older,104,F,Other Race,Spanish/Hispanic,9,Emergency,Inpatient Rehabilitation Facility,2018,INJ006,"FRACTURE OF THE NECK OF THE FEMUR (HIP), INITIAL ENCOUNTER",MST010,FEMUR FIXATION,308,HIP & FEMUR FRACTURE REPAIR,08,DISEASES AND DISORDERS OF THE MUSCULOSKELETAL SYSTEM AND CONNECTIVE TISSUE,2,Moderate,Moderate,Surgical,Medicare,Medicare,Medicaid,,,true,29854.85,39458.25
Capital/Adirond,Schenectady,4601001,000829,Ellis Hospital,70 or Older,123,F,White,Not Span/Hispanic,2,Emergency,Skilled Nursing Home,2018,INJ006,"FRACTURE OF THE NECK OF THE FEMUR (HIP), INITIAL ENCOUNTER",MST010,FEMUR FIXATION,308,HIP & FEMUR FRACTURE REPAIR,08,DISEASES AND DISORDERS OF THE MUSCULOSKELETAL SYSTEM AND CONNECTIVE TISSUE,1,Minor,Minor,Surgical,Medicare,Medicare,,,,true,26328.77,7064.64
Hudson Valley,Orange,3523000,000699,Garnet Health Medical Center,70 or Older,109,F,White,Not Span/Hispanic,3,Trauma,Skilled Nursing Home,2018,INJ005,"FRACTURE OF THE LOWER LIMB (EXCEPT HIP), INITIAL ENCOUNTER",MST010,FEMUR FIXATION,308,HIP & FEMUR FRACTURE REPAIR,08,DISEASES AND DISORDERS OF THE MUSCULOSKELETAL SYSTEM AND CONNECTIVE TISSUE,2,Moderate,Major,Surgical,Medicare,Medicaid,,,,true,76036.29,22816.92
Hudson Valley,Westchester,5957001,001139,Westchester Medical Center,18 to 29,105,M,Other Race,Unknown,10,Emergency,Inpatient Rehabilitation Facility,2018,INJ005,"FRACTURE OF THE LOWER LIMB (EXCEPT HIP), INITIAL ENCOUNTER",MST010,FEMUR FIXATION,308,HIP & FEMUR FRACTURE REPAIR,08,DISEASES AND DISORDERS OF THE MUSCULOSKELETAL SYSTEM AND CONNECTIVE TISSUE,3,Major,Minor,Surgical,Miscellaneous/Other,Medicaid,,,,true,354538.51,65562.13
New York City,Kings,7001020,001305,Maimonides Medical Center,70 or Older,112,F,White,Not Span/Hispanic,4,Emergency,Expired,2018,INJ006,"FRACTURE OF THE NECK OF THE FEMUR (HIP), INITIAL ENCOUNTER",MST010,FEMUR FIXATION,308,HIP & FEMUR FRACTURE REPAIR,08,DISEASES AND DISORDERS OF THE MUSCULOSKELETAL SYSTEM AND CONNECTIVE TISSUE,4,Extreme,Extreme,Surgical,Medicare,Medicaid,Self-Pay,,,true,65619.07,18735.89
New York City,Manhattan,7002009,001445,Harlem Hospital Center,70 or Older,100,F,Other Race,Not Span/Hispanic,12,Emergency,Skilled Nursing Home,2018,INJ006,"FRACTURE OF THE NECK OF THE FEMUR (HIP), INITIAL ENCOUNTER",MST010,FEMUR FIXATION,308,HIP & FEMUR FRACTURE REPAIR,08,DISEASES AND DISORDERS OF THE MUSCULOSKELETAL SYSTEM AND CONNECTIVE TISSUE,3,Major,Moderate,Surgical,Medicare,Blue Cross/Blue Shield,,,,true,57290.21,42574.13
New York City,Manhattan,7002053,001463,NYU Langone Hospitals,70 or Older,100,M,Other Race,Not Span/Hispanic,4,Urgent,Hospice - Medical Facility,2018,INJ006,"FRACTURE OF THE NECK OF THE FEMUR (HIP), INITIAL ENCOUNTER",MST010,FEMUR FIXATION,308,HIP & FEMUR FRACTURE REPAIR,08,DISEASES AND DISORDERS OF THE MUSCULOSKELETAL SYSTEM AND CONNECTIVE TISSUE,4,Extreme,Extreme,Surgical,Medicare,,,,,false,120175.22,31983.83
New York City,Kings,7001020,001305,Maimonides Medical Center,70 or Older,112,F,White,Not Span/Hispanic,3,Emergency,Skilled Nursing Home,2018,INJ006,"FRACTURE OF THE NECK OF THE FEMUR (HIP), INITIAL ENCOUNTER",MST010,FEMUR FIXATION,308,HIP & FEMUR FRACTURE REPAIR,08,DISEASES AND DISORDERS OF THE MUSCULOSKELETAL SYSTEM AND CONNECTIVE TISSUE,2,Moderate,Moderate,Surgical,Medicare,Blue Cross/Blue Shield,Medicaid,,,true,56940.32,16431.03
New York City,Kings,7001020,001305,Maimonides Medical Center,70 or Older,112,F,White,Not Span/Hispanic,9,Urgent,Skilled Nursing Home,2018,INJ006,"FRACTURE OF THE NECK OF THE FEMUR (HIP), INITIAL ENCOUNTER",MST010,FEMUR FIXATION,308,HIP & FEMUR FRACTURE REPAIR,08,DISEASES AND DISORDERS OF THE MUSCULOSKELETAL SYSTEM AND CONNECTIVE TISSUE,2,Moderate,Major,Surgical,Medicare,Blue Cross/Blue Shield,Self-Pay,,,true,75914.07,21826.31
Hudson Valley,Orange,3535001,000708,Bon Secours Community Hospital,50 to 69,OOS,M,White,Not Span/Hispanic,4,Emergency,Home w/ Home Health Services,2018,INJ006,"FRACTURE OF THE NECK OF THE FEMUR (HIP), INITIAL ENCOUNTER",MST010,FEMUR FIXATION,308,HIP & FEMUR FRACTURE REPAIR,08,DISEASES AND DISORDERS OF THE MUSCULOSKELETAL SYSTEM AND CONNECTIVE TISSUE,2,Moderate,Moderate,Surgical,Medicare,,,,,true,102418.96,16109.01
Finger Lakes,Ontario,3402000,000671,Geneva General Hospital,70 or Older,131,F,White,Not Span/Hispanic,3,Emergency,Expired,2018,INJ006,"FRACTURE OF THE NECK OF THE FEMUR (HIP), INITIAL ENCOUNTER",MST010,FEMUR FIXATION,308,HIP & FEMUR FRACTURE REPAIR,08,DISEASES AND DISORDERS OF THE MUSCULOSKELETAL SYSTEM AND CONNECTIVE TISSUE,2,Moderate,Major,Surgical,Medicare,Medicaid,,,,true,32464.43,18180.65
Capital/Adirond,Columbia,1001000,000146,Columbia Memorial Hospital,50 to 69,124,F,White,Not Span/Hispanic,12,Elective,Home or Self Care,2018,INJ006,"FRACTURE OF THE NECK OF THE FEMUR (HIP), INITIAL ENCOUNTER",MST010,FEMUR FIXATION,308,HIP & FEMUR FRACTURE REPAIR,08,DISEASES AND DISORDERS OF THE MUSCULOSKELETAL SYSTEM AND CONNECTIVE TISSUE,3,Major,Minor,Surgical,Medicare,Medicaid,,,,true,36323,15183.23
Long Island,Suffolk,5154001,000925,Good Samaritan Hospital Medical Center,70 or Older,117,F,White,Not Span/Hispanic,3,Emergency,Skilled Nursing Home,2018,INJ006,"FRACTURE OF THE NECK OF THE FEMUR (HIP), INITIAL ENCOUNTER",MST010,FEMUR FIXATION,308,HIP & FEMUR FRACTURE REPAIR,08,DISEASES AND DISORDERS OF THE MUSCULOSKELETAL SYSTEM AND CONNECTIVE TISSUE,1,Minor,Moderate,Surgical,Medicare,Private Health Insurance,,,,true,70740.75,13092.92
Central NY,Cayuga,0501000,000085,Auburn Community Hospital,70 or Older,130,M,White,Not Span/Hispanic,13,Elective,Skilled Nursing Home,2018,INJ006,"FRACTURE OF THE NECK OF THE FEMUR (HIP), INITIAL ENCOUNTER",MST010,FEMUR FIXATION,308,HIP & FEMUR FRACTURE REPAIR,08,DISEASES AND DISORDERS OF THE MUSCULOSKELETAL SYSTEM AND CONNECTIVE TISSUE,4,Extreme,Extreme,Surgical,Medicare,Private Health Insurance,Medicaid,,,false,61611.39,19555.38
Finger Lakes,Monroe,2701003,000411,Rochester General Hospital,70 or Older,145,F,White,Not Span/Hispanic,5,Emergency,Skilled Nursing Home,2018,INJ006,"FRACTURE OF THE NECK OF THE FEMUR (HIP), INITIAL ENCOUNTER",MST010,FEMUR FIXATION,308,HIP & FEMUR FRACTURE REPAIR,08,DISEASES AND DISORDERS OF THE MUSCULOSKELETAL SYSTEM AND CONNECTIVE TISSUE,2,Moderate,Moderate,Surgical,Medicare,Blue Cross/Blue Shield,,,,true,27805.59,10504.58
New York City,Queens,7003010,001637,New York - Presbyterian/Queens,18 to 29,,M,Other Race,Spanish/Hispanic,4,Emergency,Home or Self Care,2018,INJ005,"FRACTURE OF THE LOWER LIMB (EXCEPT HIP), INITIAL ENCOUNTER",MST010,FEMUR FIXATION,308,HIP & FEMUR FRACTURE REPAIR,08,DISEASES AND DISORDERS OF THE MUSCULOSKELETAL SYSTEM AND CONNECTIVE TISSUE,2,Moderate,Moderate,Surgical,Miscellaneous/Other,Medicaid,Self-Pay,,,true,62628.86,18743.14
New York City,Manhattan,7002054,001464,New York-Presbyterian Hospital - Columbia Presbyterian Center,70 or Older,100,F,Other Race,Not Span/Hispanic,4,Emergency,Skilled Nursing Home,2018,INJ006,"FRACTURE OF THE NECK OF THE FEMUR (HIP), INITIAL ENCOUNTER",MST010,FEMUR FIXATION,308,HIP & FEMUR FRACTURE REPAIR,08,DISEASES AND DISORDERS OF THE MUSCULOSKELETAL SYSTEM AND CONNECTIVE TISSUE,2,Moderate,Minor,Surgical,Medicare,Blue Cross/Blue Shield,Self-Pay,,,true,70953.07,24026.03
Finger Lakes,Ontario,3402000,000671,Geneva General Hospital,70 or Older,145,F,White,Not Span/Hispanic,5,Urgent,Skilled Nursing Home,2018,INJ006,"FRACTURE OF THE NECK OF THE FEMUR (HIP), INITIAL ENCOUNTER",MST010,FEMUR FIXATION,308,HIP & FEMUR FRACTURE REPAIR,08,DISEASES AND DISORDERS OF THE MUSCULOSKELETAL SYSTEM AND CONNECTIVE TISSUE,2,Moderate,Minor,Surgical,Medicare,,,,,false,24126.16,15411.01
Finger Lakes,Ontario,3402000,000671,Geneva General Hospital,70 or Older,145,M,White,Not Span/Hispanic,3,Emergency,Skilled Nursing Home,2018,INJ006,"FRACTURE OF THE NECK OF THE FEMUR (HIP), INITIAL ENCOUNTER",MST010,FEMUR FIXATION,308,HIP & FEMUR FRACTURE REPAIR,08,DISEASES AND DISORDERS OF THE MUSCULOSKELETAL SYSTEM AND CONNECTIVE TISSUE,1,Minor,Minor,Surgical,Medicare,,,,,true,19557.16,8581.42
Central NY,Onondaga,3301007,000628,UPSTATE University Hospital at Community General,50 to 69,136,F,White,Not Span/Hispanic,7,Emergency,Skilled Nursing Home,2018,INJ005,"FRACTURE OF THE LOWER LIMB (EXCEPT HIP), INITIAL ENCOUNTER",MST010,FEMUR FIXATION,308,HIP & FEMUR FRACTURE REPAIR,08,DISEASES AND DISORDERS OF THE MUSCULOSKELETAL SYSTEM AND CONNECTIVE TISSUE,2,Moderate,Minor,Surgical,Medicare,,,,,true,77300.54,23772.86
Long Island,Nassau,2951001,000541,North Shore University Hospital,70 or Older,113,F,White,Not Span/Hispanic,11,Emergency,Skilled Nursing Home,2018,INJ005,"FRACTURE OF THE LOWER LIMB (EXCEPT HIP), INITIAL ENCOUNTER",MST010,FEMUR FIXATION,308,HIP & FEMUR FRACTURE REPAIR,08,DISEASES AND DISORDERS OF THE MUSCULOSKELETAL SYSTEM AND CONNECTIVE TISSUE,3,Major,Extreme,Surgical,Medicare,Blue Cross/Blue Shield,,,,true,172090.48,37304.57
Central NY,Onondaga,3301003,000630,St. Joseph's Hospital Health Center,70 or Older,130,F,White,Not Span/Hispanic,4,Emergency,Home w/ Home Health Services,2018,INJ006,"FRACTURE OF THE NECK OF THE FEMUR (HIP), INITIAL ENCOUNTER",MST010,FEMUR FIXATION,308,HIP & FEMUR FRACTURE REPAIR,08,DISEASES AND DISORDERS OF THE MUSCULOSKELETAL SYSTEM AND CONNECTIVE TISSUE,2,Moderate,Major,Surgical,Medicare,Blue Cross/Blue Shield,,,,true,38149.5,14328.5
Central NY,Onondaga,3301003,000630,St. Joseph's Hospital Health Center,70 or Older,131,M,White,Not Span/Hispanic,4,Emergency,Skilled Nursing Home,2018,INJ006,"FRACTURE OF THE NECK OF THE FEMUR (HIP), INITIAL ENCOUNTER",MST010,FEMUR FIXATION,308,HIP & FEMUR FRACTURE REPAIR,08,DISEASES AND DISORDERS OF THE MUSCULOSKELETAL SYSTEM AND CONNECTIVE TISSUE,2,Moderate,Major,Surgical,Medicare,Blue Cross/Blue Shield,,,,true,33108.86,10606.1
Long Island,Nassau,2951001,000541,North Shore University Hospital,70 or Older,112,M,Other Race,Not Span/Hispanic,4,Emergency,Skilled Nursing Home,2018,INJ006,"FRACTURE OF THE NECK OF THE FEMUR (HIP), INITIAL ENCOUNTER",MST010,FEMUR FIXATION,308,HIP & FEMUR FRACTURE REPAIR,08,DISEASES AND DISORDERS OF THE MUSCULOSKELETAL SYSTEM AND CONNECTIVE TISSUE,2,Moderate,Moderate,Surgical,Medicare,Medicaid,,,,true,90200.06,21661.46
Long Island,Nassau,2951001,000541,North Shore University Hospital,70 or Older,110,F,White,Not Span/Hispanic,8,Emergency,Skilled Nursing Home,2018,INJ006,"FRACTURE OF THE NECK OF THE FEMUR (HIP), INITIAL ENCOUNTER",MST010,FEMUR FIXATION,308,HIP & FEMUR FRACTURE REPAIR,08,DISEASES AND DISORDERS OF THE MUSCULOSKELETAL SYSTEM AND CONNECTIVE TISSUE,2,Moderate,Minor,Surgical,Medicare,Medicare,Medicaid,,,true,164533.79,39502.39
Hudson Valley,Putnam,3950000,000752,Putnam Hospital,70 or Older,105,F,White,Not Span/Hispanic,5,Emergency,Skilled Nursing Home,2018,INJ006,"FRACTURE OF THE NECK OF THE FEMUR (HIP), INITIAL ENCOUNTER",MST010,FEMUR FIXATION,308,HIP & FEMUR FRACTURE REPAIR,08,DISEASES AND DISORDERS OF THE MUSCULOSKELETAL SYSTEM AND CONNECTIVE TISSUE,3,Major,Major,Surgical,Medicare,Federal/State/Local/VA,,,,true,51329.07,18707.63
New York City,Kings,7001008,001293,"New York Community Hospital of Brooklyn, Inc",70 or Older,112,F,White,Not Span/Hispanic,6,Emergency,Inpatient Rehabilitation Facility,2018,INJ006,"FRACTURE OF THE NECK OF THE FEMUR (HIP), INITIAL ENCOUNTER",MST010,FEMUR FIXATION,308,HIP & FEMUR FRACTURE REPAIR,08,DISEASES AND DISORDERS OF THE MUSCULOSKELETAL SYSTEM AND CONNECTIVE TISSUE,2,Moderate,Moderate,Surgical,Medicare,Medicaid,Self-Pay,,,true,28847.88,15974.16
Long Island,Nassau,2951001,000541,North Shore University Hospital,70 or Older,114,M,Other Race,Not Span/Hispanic,3,Emergency,Home w/ Home Health Services,2018,INJ006,"FRACTURE OF THE NECK OF THE FEMUR (HIP), INITIAL ENCOUNTER",MST010,FEMUR FIXATION,308,HIP & FEMUR FRACTURE REPAIR,08,DISEASES AND DISORDERS OF THE MUSCULOSKELETAL SYSTEM AND CONNECTIVE TISSUE,1,Minor,Minor,Surgical,Medicare,Medicare,,,,true,64137.42,14049.67
Long Island,Suffolk,5155000,000938,Peconic Bay Medical Center,70 or Older,119,F,White,Spanish/Hispanic,4,Emergency,Skilled Nursing Home,2018,INJ006,"FRACTURE OF THE NECK OF THE FEMUR (HIP), INITIAL ENCOUNTER",MST010,FEMUR FIXATION,308,HIP & FEMUR FRACTURE REPAIR,08,DISEASES AND DISORDERS OF THE MUSCULOSKELETAL SYSTEM AND CONNECTIVE TISSUE,2,Moderate,Moderate,Surgical,Medicare,Blue Cross/Blue Shield,,,,true,56373.07,11276.54
Western NY,Erie,1401008,000213,Mercy Hospital of Buffalo,50 to 69,140,F,White,Not Span/Hispanic,4,Emergency,Skilled Nursing Home,2018,INJ006,"FRACTURE OF THE NECK OF THE FEMUR (HIP), INITIAL ENCOUNTER",MST010,FEMUR FIXATION,308,HIP & FEMUR FRACTURE REPAIR,08,DISEASES AND DISORDERS OF THE MUSCULOSKELETAL SYSTEM AND CONNECTIVE TISSUE,1,Minor,Minor,Surgical,Medicare,Medicare,,,,true,21573.5,9297.12
New York City,Manhattan,7002021,001454,Metropolitan Hospital Center,70 or Older,100,M,Other Race,Spanish/Hispanic,10,Emergency,Inpatient Rehabilitation Facility,2018,INJ006,"FRACTURE OF THE NECK OF THE FEMUR (HIP), INITIAL ENCOUNTER",MST010,FEMUR FIXATION,308,HIP & FEMUR FRACTURE REPAIR,08,DISEASES AND DISORDERS OF THE MUSCULOSKELETAL SYSTEM AND CONNECTIVE TISSUE,2,Moderate,Moderate,Surgical,Medicare,Medicare,Medicaid,,,true,59685.08,48222.56
New York City,Queens,7003004,001630,Long Island Jewish Medical Center,70 or Older,113,M,White,Not Span/Hispanic,6,Emergency,Inpatient Rehabilitation Facility,2018,INJ006,"FRACTURE OF THE NECK OF THE FEMUR (HIP), INITIAL ENCOUNTER",MST010,FEMUR FIXATION,308,HIP & FEMUR FRACTURE REPAIR,08,DISEASES AND DISORDERS OF THE MUSCULOSKELETAL SYSTEM AND CONNECTIVE TISSUE,2,Moderate,Moderate,Surgical,Medicare,Medicare,Self-Pay,,,false,100225.51,22946.25
Capital/Adirond,Schenectady,4601001,000829,Ellis Hospital,70 or Older,123,M,White,Not Span/Hispanic,7,Emergency,Skilled Nursing Home,2018,INJ006,"FRACTURE OF THE NECK OF THE FEMUR (HIP), INITIAL ENCOUNTER",MST010,FEMUR FIXATION,308,HIP & FEMUR FRACTURE REPAIR,08,DISEASES AND DISORDERS OF THE MUSCULOSKELETAL SYSTEM AND CONNECTIVE TISSUE,2,Moderate,Minor,Surgical,Medicare,Medicare,,,,true,48200.75,14315.28
Hudson Valley,Dutchess,1302001,000181,Vassar Brothers Medical Center,70 or Older,125,F,White,Not Span/Hispanic,5,Emergency,Skilled Nursing Home,2018,INJ006,"FRACTURE OF THE NECK OF THE FEMUR (HIP), INITIAL ENCOUNTER",MST010,FEMUR FIXATION,308,HIP & FEMUR FRACTURE REPAIR,08,DISEASES AND DISORDERS OF THE MUSCULOSKELETAL SYSTEM AND CONNECTIVE TISSUE,3,Major,Major,Surgical,Medicare,Blue Cross/Blue Shield,,,,true,46482.69,17152.93
New York City,Kings,7001020,001305,Maimonides Medical Center,70 or Older,112,F,White,Not Span/Hispanic,6,Emergency,Skilled Nursing Home,2018,INJ006,"FRACTURE OF THE NECK OF THE FEMUR (HIP), INITIAL ENCOUNTER",MST010,FEMUR FIXATION,308,HIP & FEMUR FRACTURE REPAIR,08,DISEASES AND DISORDERS OF THE MUSCULOSKELETAL SYSTEM AND CONNECTIVE TISSUE,1,Minor,Minor,Surgical,Medicare,Blue Cross/Blue Shield,Self-Pay,,,true,65151.05,19909.94
Hudson Valley,Westchester,5902001,001045,White Plains Hospital Center,70 or Older,105,F,Other Race,Not Span/Hispanic,10,Emergency,Skilled Nursing Home,2018,INJ006,"FRACTURE OF THE NECK OF THE FEMUR (HIP), INITIAL ENCOUNTER",MST010,FEMUR FIXATION,308,HIP & FEMUR FRACTURE REPAIR,08,DISEASES AND DISORDERS OF THE MUSCULOSKELETAL SYSTEM AND CONNECTIVE TISSUE,3,Major,Major,Surgical,Medicare,Private Health Insurance,,,,true,94732,23156.27
New York City,Queens,7003010,001637,New York - Presbyterian/Queens,70 or Older,113,F,Other Race,Not Span/Hispanic,3,Emergency,Home or Self Care,2018,INJ006,"FRACTURE OF THE NECK OF THE FEMUR (HIP), INITIAL ENCOUNTER",MST010,FEMUR FIXATION,308,HIP & FEMUR FRACTURE REPAIR,08,DISEASES AND DISORDERS OF THE MUSCULOSKELETAL SYSTEM AND CONNECTIVE TISSUE,2,Moderate,Moderate,Surgical,Medicaid,Self-Pay,,,,true,35061.95,10090.68
Central NY,Onondaga,3301008,000636,Crouse Hospital,70 or Older,132,F,White,Not Span/Hispanic,25,Emergency,Skilled Nursing Home,2018,INJ005,"FRACTURE OF THE LOWER LIMB (EXCEPT HIP), INITIAL ENCOUNTER",MST010,FEMUR FIXATION,308,HIP & FEMUR FRACTURE REPAIR,08,DISEASES AND DISORDERS OF THE MUSCULOSKELETAL SYSTEM AND CONNECTIVE TISSUE,4,Extreme,Major,Surgical,Medicare,Medicare,Blue Cross/Blue Shield,,,true,99769.34,43311
New York City,Kings,7001021,001306,New York - Presbyterian Brooklyn Methodist Hospital,0 to 17,112,M,Other Race,Not Span/Hispanic,2,Emergency,Home or Self Care,2018,INJ005,"FRACTURE OF THE LOWER LIMB (EXCEPT HIP), INITIAL ENCOUNTER",MST010,FEMUR FIXATION,308,HIP & FEMUR FRACTURE REPAIR,08,DISEASES AND DISORDERS OF THE MUSCULOSKELETAL SYSTEM AND CONNECTIVE TISSUE,1,Minor,Minor,Surgical,"Managed Care, Unspecified",Medicaid,Self-Pay,,,true,27374.01,12937.68
Hudson Valley,Westchester,5922000,001122,New York - Presbyterian Hospital,70 or Older,107,F,White,Not Span/Hispanic,4,Emergency,Skilled Nursing Home,2018,INJ006,"FRACTURE OF THE NECK OF THE FEMUR (HIP), INITIAL ENCOUNTER",MST010,FEMUR FIXATION,308,HIP & FEMUR FRACTURE REPAIR,08,DISEASES AND DISORDERS OF THE MUSCULOSKELETAL SYSTEM AND CONNECTIVE TISSUE,2,Moderate,Minor,Surgical,Medicare,Blue Cross/Blue Shield,,,,true,75573.03,29145.31
Western NY,Erie,1401005,000210,Erie County Medical Center,50 to 69,142,M,Black/African American,Not Span/Hispanic,6,Emergency,Inpatient Rehabilitation Facility,2018,INJ005,"FRACTURE OF THE LOWER LIMB (EXCEPT HIP), INITIAL ENCOUNTER",MST010,FEMUR FIXATION,308,HIP & FEMUR FRACTURE REPAIR,08,DISEASES AND DISORDERS OF THE MUSCULOSKELETAL SYSTEM AND CONNECTIVE TISSUE,3,Major,Moderate,Surgical,Federal/State/Local/VA,,,,,true,56394.74,26371
Central NY,Onondaga,3301007,000635,University Hospital SUNY Health Science Center,50 to 69,130,F,White,Not Span/Hispanic,5,Emergency,Skilled Nursing Home,2018,INJ006,"FRACTURE OF THE NECK OF THE FEMUR (HIP), INITIAL ENCOUNTER",MST010,FEMUR FIXATION,308,HIP & FEMUR FRACTURE REPAIR,08,DISEASES AND DISORDERS OF THE MUSCULOSKELETAL SYSTEM AND CONNECTIVE TISSUE,2,Moderate,Moderate,Surgical,Miscellaneous/Other,,,,,true,87449.44,27716.2
Long Island,Nassau,2909000,000513,Mercy Hospital,70 or Older,115,F,White,Not Span/Hispanic,11,Emergency,Facility w/ Custodial/Supportive Care,2018,INJ006,"FRACTURE OF THE NECK OF THE FEMUR (HIP), INITIAL ENCOUNTER",MST010,FEMUR FIXATION,308,HIP & FEMUR FRACTURE REPAIR,08,DISEASES AND DISORDERS OF THE MUSCULOSKELETAL SYSTEM AND CONNECTIVE TISSUE,2,Moderate,Major,Surgical,Medicare,Private Health Insurance,,,,true,99884.63,23650.86
Hudson Valley,Westchester,5957001,001139,Westchester Medical Center,18 to 29,105,M,Other Race,Spanish/Hispanic,5,Emergency,Home w/ Home Health Services,2018,INJ005,"FRACTURE OF THE LOWER LIMB (EXCEPT HIP), INITIAL ENCOUNTER",MST010,FEMUR FIXATION,308,HIP & FEMUR FRACTURE REPAIR,08,DISEASES AND DISORDERS OF THE MUSCULOSKELETAL SYSTEM AND CONNECTIVE TISSUE,1,Minor,Minor,Surgical,Blue Cross/Blue Shield,,,,,true,151476.64,28951.7
Central NY,Onondaga,3301003,000630,St. Joseph's Hospital Health Center,70 or Older,132,F,White,Not Span/Hispanic,4,Emergency,Skilled Nursing Home,2018,INJ006,"FRACTURE OF THE NECK OF THE FEMUR (HIP), INITIAL ENCOUNTER",MST010,FEMUR FIXATION,308,HIP & FEMUR FRACTURE REPAIR,08,DISEASES AND DISORDERS OF THE MUSCULOSKELETAL SYSTEM AND CONNECTIVE TISSUE,2,Moderate,Minor,Surgical,Medicare,Medicaid,,,,true,23981.55,9647.61
Western NY,Erie,1401008,000213,Mercy Hospital of Buffalo,70 or Older,142,M,White,Not Span/Hispanic,4,Emergency,Skilled Nursing Home,2018,INJ006,"FRACTURE OF THE NECK OF THE FEMUR (HIP), INITIAL ENCOUNTER",MST010,FEMUR FIXATION,308,HIP & FEMUR FRACTURE REPAIR,08,DISEASES AND DISORDERS OF THE MUSCULOSKELETAL SYSTEM AND CONNECTIVE TISSUE,2,Moderate,Moderate,Surgical,Medicare,Medicare,,,,true,30437.42,10638.79
Long Island,Suffolk,5154001,000925,Good Samaritan Hospital Medical Center,70 or Older,117,F,White,Not Span/Hispanic,3,Emergency,Facility w/ Custodial/Supportive Care,2018,INJ006,"FRACTURE OF THE NECK OF THE FEMUR (HIP), INITIAL ENCOUNTER",MST010,FEMUR FIXATION,308,HIP & FEMUR FRACTURE REPAIR,08,DISEASES AND DISORDERS OF THE MUSCULOSKELETAL SYSTEM AND CONNECTIVE TISSUE,1,Minor,Moderate,Surgical,Medicare,Private Health Insurance,Medicaid,,,true,93105.25,17544.37
New York City,Kings,7001008,001293,"New York Community Hospital of Brooklyn, Inc",50 to 69,112,F,White,Not Span/Hispanic,11,Emergency,Inpatient Rehabilitation Facility,2018,INJ006,"FRACTURE OF THE NECK OF THE FEMUR (HIP), INITIAL ENCOUNTER",MST010,FEMUR FIXATION,308,HIP & FEMUR FRACTURE REPAIR,08,DISEASES AND DISORDERS OF THE MUSCULOSKELETAL SYSTEM AND CONNECTIVE TISSUE,4,Extreme,Extreme,Surgical,Medicare,Medicare,Self-Pay,,,true,79387.69,33709.01
Long Island,Suffolk,5154001,000925,Good Samaritan Hospital Medical Center,70 or Older,117,M,White,Not Span/Hispanic,8,Emergency,Skilled Nursing Home,2018,INJ006,"FRACTURE OF THE NECK OF THE FEMUR (HIP), INITIAL ENCOUNTER",MST010,FEMUR FIXATION,308,HIP & FEMUR FRACTURE REPAIR,08,DISEASES AND DISORDERS OF THE MUSCULOSKELETAL SYSTEM AND CONNECTIVE TISSUE,2,Moderate,Minor,Surgical,Medicare,,,,,true,103709.94,19355.92
New York City,Manhattan,7002032,001466,Mount Sinai West,70 or Older,100,F,White,Not Span/Hispanic,7,Emergency,Skilled Nursing Home,2018,INJ006,"FRACTURE OF THE NECK OF THE FEMUR (HIP), INITIAL ENCOUNTER",MST010,FEMUR FIXATION,308,HIP & FEMUR FRACTURE REPAIR,08,DISEASES AND DISORDERS OF THE MUSCULOSKELETAL SYSTEM AND CONNECTIVE TISSUE,1,Minor,Minor,Surgical,Medicare,Medicare,Self-Pay,,,true,93835.31,25612.89
Long Island,Suffolk,5154001,000925,Good Samaritan Hospital Medical Center,50 to 69,117,M,Black/African American,Not Span/Hispanic,4,Emergency,Skilled Nursing Home,2018,INJ006,"FRACTURE OF THE NECK OF THE FEMUR (HIP), INITIAL ENCOUNTER",MST010,FEMUR FIXATION,308,HIP & FEMUR FRACTURE REPAIR,08,DISEASES AND DISORDERS OF THE MUSCULOSKELETAL SYSTEM AND CONNECTIVE TISSUE,1,Minor,Minor,Surgical,Medicaid,,,,,true,56710.16,10748.64
Hudson Valley,Orange,3522000,000694,St Luke's Cornwall Hospital/Newburgh,50 to 69,125,F,White,Unknown,4,Emergency,Inpatient Rehabilitation Facility,2018,INJ006,"FRACTURE OF THE NECK OF THE FEMUR (HIP), INITIAL ENCOUNTER",MST010,FEMUR FIXATION,308,HIP & FEMUR FRACTURE REPAIR,08,DISEASES AND DISORDERS OF THE MUSCULOSKELETAL SYSTEM AND CONNECTIVE TISSUE,2,Moderate,Minor,Surgical,Medicare,Blue Cross/Blue Shield,,,,true,57090.13,17440.07
New York City,Queens,7003004,001638,Long Island Jewish Forest Hills,70 or Older,113,F,White,Not Span/Hispanic,5,Emergency,Skilled Nursing Home,2018,INJ006,"FRACTURE OF THE NECK OF THE FEMUR (HIP), INITIAL ENCOUNTER",MST010,FEMUR FIXATION,308,HIP & FEMUR FRACTURE REPAIR,08,DISEASES AND DISORDERS OF THE MUSCULOSKELETAL SYSTEM AND CONNECTIVE TISSUE,2,Moderate,Moderate,Surgical,Medicare,Medicaid,,,,true,74236.49,16560.56