Hospital Service Area,Hospital County,Operating Certificate Number,Permanent Facility Id,Facility Name,Age Group,Zip Code - 3 digits,Gender,Race,Ethnicity,Length of Stay,Type of Admission,Patient Disposition,Discharge Year,CCS Diagnosis Code,CCS Diagnosis Description,CCS Procedure Code,CCS Procedure Description,APR DRG Code,APR DRG Description,APR MDC Code,APR MDC Description,APR Severity of Illness Code,APR Severity of Illness Description,APR Risk of Mortality,APR Medical Surgical Description,Payment Typology 1,Payment Typology 2,Payment Typology 3,Birth Weight,Abortion Edit Indicator,Emergency Department Indicator,Total Charges,Total Costs
New York City,Bronx,7000006,001169,Montefiore Medical Center - Henry & Lucy Moses Div,50 to 69,104,M,Black/African American,Not Span/Hispanic,6,Emergency,Home w/ Home Health Services,2017,201,Infective arthritis and osteomyelitis (except that caused by tuberculosis or sexually transmitted disease),161,OT OR THER PRCS ON BONE,309,Other significant hip and femur surgery,08,Diseases and Disorders of the Musculoskeletal System and Conn Tissue,1,Minor,Minor,Surgical,Medicaid,,,,N,N,93442.71,21082.78
New York City,Bronx,7000006,001169,Montefiore Medical Center - Henry & Lucy Moses Div,50 to 69,104,M,Other Race,Spanish/Hispanic,3,Elective,Home w/ Home Health Services,2017,201,Infective arthritis and osteomyelitis (except that caused by tuberculosis or sexually transmitted disease),161,OT OR THER PRCS ON BONE,309,Other significant hip and femur surgery,08,Diseases and Disorders of the Musculoskeletal System and Conn Tissue,1,Minor,Minor,Surgical,Private Health Insurance,,,,N,N,49237.61,10609.81
Hudson Valley,Orange,3523000,000699,Orange Regional Medical Center,70 or Older,109,M,Black/African American,Not Span/Hispanic,16,Emergency,Skilled Nursing Home,2017,201,Infective arthritis and osteomyelitis (except that caused by tuberculosis or sexually transmitted disease),162,OT OR THER PRC ON JOINT,309,Other significant hip and femur surgery,08,Diseases and Disorders of the Musculoskeletal System and Conn Tissue,3,Major,Major,Surgical,Medicare,Private Health Insurance,,,N,Y,134672.12,38945.21
New York City,Bronx,7000006,001169,Montefiore Medical Center - Henry & Lucy Moses Div,50 to 69,100,M,Other Race,Not Span/Hispanic,3,Emergency,Home w/ Home Health Services,2017,047,Other and unspecified benign neoplasm,159,OT DX PRCS ON MUSC/SKEL,309,Other significant hip and femur surgery,08,Diseases and Disorders of the Musculoskeletal System and Conn Tissue,1,Minor,Minor,Surgical,Medicare,Medicaid,,,N,N,74224.78,17015.64
New York City,Bronx,7000006,001169,Montefiore Medical Center - Henry & Lucy Moses Div,0 to 17,104,M,Black/African American,Not Span/Hispanic,4,Elective,Home or Self Care,2017,237,Complication of device; implant or graft,161,OT OR THER PRCS ON BONE,309,Other significant hip and femur surgery,08,Diseases and Disorders of the Musculoskeletal System and Conn Tissue,2,Moderate,Minor,Surgical,Self-Pay,,,,N,N,89917.92,25297.33
New York City,Bronx,7000006,001169,Montefiore Medical Center - Henry & Lucy Moses Div,0 to 17,104,M,Black/African American,Not Span/Hispanic,6,Emergency,Home w/ Home Health Services,2017,212,Other bone disease and musculoskeletal deformities,146,"TRTMNT,FRAC HIP/FEMUR",309,Other significant hip and femur surgery,08,Diseases and Disorders of the Musculoskeletal System and Conn Tissue,1,Minor,Minor,Surgical,Private Health Insurance,,,,N,N,94058.56,25016.18
New York City,Kings,7001021,001306,New York - Presbyterian Brooklyn Methodist Hospital,70 or Older,112,F,White,Not Span/Hispanic,4,Trauma,Skilled Nursing Home,2017,238,Complications of surgical procedures or medical care,146,"TRTMNT,FRAC HIP/FEMUR",309,Other significant hip and femur surgery,08,Diseases and Disorders of the Musculoskeletal System and Conn Tissue,2,Moderate,Minor,Surgical,Medicare,Medicaid,Self-Pay,,N,Y,45387.34,19643.96
New York City,Kings,7001021,001306,New York - Presbyterian Brooklyn Methodist Hospital,50 to 69,112,F,White,Not Span/Hispanic,10,Emergency,Skilled Nursing Home,2017,238,Complications of surgical procedures or medical care,146,"TRTMNT,FRAC HIP/FEMUR",309,Other significant hip and femur surgery,08,Diseases and Disorders of the Musculoskeletal System and Conn Tissue,3,Major,Major,Surgical,Medicare,Blue Cross/Blue Shield,Self-Pay,,N,Y,107102.62,45851.52
New York City,Kings,7001021,001306,New York - Presbyterian Brooklyn Methodist Hospital,70 or Older,112,F,White,Not Span/Hispanic,5,Emergency,Skilled Nursing Home,2017,229,Fracture of upper limb,145,"TRTMNT,FRAC RADIUS/ULNA",309,Other significant hip and femur surgery,08,Diseases and Disorders of the Musculoskeletal System and Conn Tissue,2,Moderate,Moderate,Surgical,Medicare,Blue Cross/Blue Shield,Self-Pay,,N,Y,47555.28,19935.16
New York City,Manhattan,7002002,001439,Mount Sinai Beth Israel,50 to 69,100,M,Black/African American,Spanish/Hispanic,8,Emergency,Home w/ Home Health Services,2017,042,Secondary malignancies,159,OT DX PRCS ON MUSC/SKEL,309,Other significant hip and femur surgery,08,Diseases and Disorders of the Musculoskeletal System and Conn Tissue,2,Moderate,Major,Surgical,Blue Cross/Blue Shield,Self-Pay,,,N,Y,99741.92,29516.32
New York City,Manhattan,7002002,001439,Mount Sinai Beth Israel,50 to 69,100,F,White,Not Span/Hispanic,1,Urgent,Home or Self Care,2017,237,Complication of device; implant or graft,162,OT OR THER PRC ON JOINT,309,Other significant hip and femur surgery,08,Diseases and Disorders of the Musculoskeletal System and Conn Tissue,2,Moderate,Minor,Surgical,Medicare,Private Health Insurance,Self-Pay,,N,N,17636.29,6125.30
New York City,Manhattan,7002024,001456,Mount Sinai Hospital,30 to 49,105,F,Other Race,Not Span/Hispanic,7,Urgent,Home w/ Home Health Services,2017,042,Secondary malignancies,161,OT OR THER PRCS ON BONE,309,Other significant hip and femur surgery,08,Diseases and Disorders of the Musculoskeletal System and Conn Tissue,2,Moderate,Moderate,Surgical,Medicaid,Self-Pay,,,N,N,126967.68,57184.34
New York City,Manhattan,7002054,001464,New York Presbyterian Hospital - Columbia Presbyterian Center,50 to 69,100,M,White,Not Span/Hispanic,5,Urgent,Skilled Nursing Home,2017,042,Secondary malignancies,146,"TRTMNT,FRAC HIP/FEMUR",309,Other significant hip and femur surgery,08,Diseases and Disorders of the Musculoskeletal System and Conn Tissue,2,Moderate,Moderate,Surgical,Medicare,Medicaid,Self-Pay,,N,N,83485.79,24768.81
New York City,Manhattan,7002054,001464,New York Presbyterian Hospital - Columbia Presbyterian Center,18 to 29,100,F,Other Race,Not Span/Hispanic,1,Elective,Home w/ Home Health Services,2017,230,Fracture of lower limb,146,"TRTMNT,FRAC HIP/FEMUR",309,Other significant hip and femur surgery,08,Diseases and Disorders of the Musculoskeletal System and Conn Tissue,2,Moderate,Minor,Surgical,Private Health Insurance,Self-Pay,,,N,N,12072.66,3169.62
New York City,Manhattan,7002054,001464,New York Presbyterian Hospital - Columbia Presbyterian Center,0 to 17,117,F,White,Not Span/Hispanic,3,Elective,Home w/ Home Health Services,2017,217,Other congenital anomalies,161,OT OR THER PRCS ON BONE,309,Other significant hip and femur surgery,08,Diseases and Disorders of the Musculoskeletal System and Conn Tissue,1,Minor,Minor,Surgical,Blue Cross/Blue Shield,Self-Pay,,,N,N,57718.35,18663.02
New York City,Manhattan,7002054,001464,New York Presbyterian Hospital - Columbia Presbyterian Center,0 to 17,114,M,Other Race,Spanish/Hispanic,3,Elective,Home w/ Home Health Services,2017,212,Other bone disease and musculoskeletal deformities,161,OT OR THER PRCS ON BONE,309,Other significant hip and femur surgery,08,Diseases and Disorders of the Musculoskeletal System and Conn Tissue,1,Minor,Minor,Surgical,Medicaid,Medicaid,Self-Pay,,N,N,49087.68,15168.12
New York City,Manhattan,7002054,001464,New York Presbyterian Hospital - Columbia Presbyterian Center,0 to 17,104,F,Multi-racial,Spanish/Hispanic,3,Elective,Home w/ Home Health Services,2017,217,Other congenital anomalies,146,"TRTMNT,FRAC HIP/FEMUR",309,Other significant hip and femur surgery,08,Diseases and Disorders of the Musculoskeletal System and Conn Tissue,1,Minor,Minor,Surgical,Medicaid,Medicaid,Self-Pay,,N,N,47026.58,14521.68
New York City,Manhattan,7002032,001469,Mount Sinai St. Luke's,30 to 49,,M,Other Race,Not Span/Hispanic,2,Elective,Home w/ Home Health Services,2017,226,Fracture of neck of femur (hip),146,"TRTMNT,FRAC HIP/FEMUR",309,Other significant hip and femur surgery,08,Diseases and Disorders of the Musculoskeletal System and Conn Tissue,1,Minor,Minor,Surgical,Private Health Insurance,Self-Pay,,,N,N,47236.38,21824.32
Central NY,Madison,2625700,000401,Community Memorial Hospital Inc,50 to 69,133,M,White,Not Span/Hispanic,1,Elective,Home or Self Care,2017,212,Other bone disease and musculoskeletal deformities,142,PARTIAL EXCISION BONE,309,Other significant hip and femur surgery,08,Diseases and Disorders of the Musculoskeletal System and Conn Tissue,2,Moderate,Minor,Surgical,Private Health Insurance,,,,N,N,17806.38,7094.24
Central NY,Onondaga,3301008,000636,Crouse Hospital,50 to 69,132,F,Black/African American,Not Span/Hispanic,39,Emergency,Skilled Nursing Home,2017,237,Complication of device; implant or graft,146,"TRTMNT,FRAC HIP/FEMUR",309,Other significant hip and femur surgery,08,Diseases and Disorders of the Musculoskeletal System and Conn Tissue,4,Extreme,Extreme,Surgical,Medicare,,,,N,Y,216848.28,103470.56
Central NY,Onondaga,3301008,000636,Crouse Hospital,30 to 49,132,F,Black/African American,Not Span/Hispanic,3,Elective,Home or Self Care,2017,232,Sprains and strains,164,OT OR THER PRC MUSC/SKL,309,Other significant hip and femur surgery,08,Diseases and Disorders of the Musculoskeletal System and Conn Tissue,2,Moderate,Minor,Surgical,Miscellaneous/Other,Medicaid,,,N,N,30862.57,13899.91
Central NY,Onondaga,3301008,000636,Crouse Hospital,70 or Older,132,F,White,Not Span/Hispanic,7,Elective,Skilled Nursing Home,2017,237,Complication of device; implant or graft,146,"TRTMNT,FRAC HIP/FEMUR",309,Other significant hip and femur surgery,08,Diseases and Disorders of the Musculoskeletal System and Conn Tissue,3,Major,Moderate,Surgical,Medicare,Medicare,Blue Cross/Blue Shield,,N,N,226491.87,103609.65
Hudson Valley,Rockland,4329000,000779,Good Samaritan Hospital of Suffern,70 or Older,109,F,White,Not Span/Hispanic,4,Emergency,Skilled Nursing Home,2017,238,Complications of surgical procedures or medical care,146,"TRTMNT,FRAC HIP/FEMUR",309,Other significant hip and femur surgery,08,Diseases and Disorders of the Musculoskeletal System and Conn Tissue,2,Moderate,Moderate,Surgical,Medicare,Private Health Insurance,,,N,Y,103366.71,21191.08
Hudson Valley,Rockland,4329000,000779,Good Samaritan Hospital of Suffern,50 to 69,109,M,White,Not Span/Hispanic,1,Emergency,Home or Self Care,2017,230,Fracture of lower limb,146,"TRTMNT,FRAC HIP/FEMUR",309,Other significant hip and femur surgery,08,Diseases and Disorders of the Musculoskeletal System and Conn Tissue,1,Minor,Minor,Surgical,Blue Cross/Blue Shield,,,,N,Y,62032.49,10826.38
New York City,Manhattan,7002001,001438,Bellevue Hospital Center,50 to 69,100,M,Black/African American,Not Span/Hispanic,75,Emergency,Medicare Cert Long Term Care Hospital,2017,237,Complication of device; implant or graft,162,OT OR THER PRC ON JOINT,309,Other significant hip and femur surgery,08,Diseases and Disorders of the Musculoskeletal System and Conn Tissue,2,Moderate,Minor,Surgical,Medicaid,Medicaid,,,N,Y,369383.97,238159.58
New York City,Manhattan,7002053,001446,NYU Langone Orthopedic Hospital,18 to 29,100,F,Other Race,Spanish/Hispanic,7,Elective,Home w/ Home Health Services,2017,209,Other acquired deformities,146,"TRTMNT,FRAC HIP/FEMUR",309,Other significant hip and femur surgery,08,Diseases and Disorders of the Musculoskeletal System and Conn Tissue,2,Moderate,Moderate,Surgical,Federal/State/Local/VA,,,,N,N,125599.27,37584.20
New York City,Manhattan,7002053,001446,NYU Langone Orthopedic Hospital,0 to 17,,F,Other Race,Spanish/Hispanic,1,Elective,Home or Self Care,2017,212,Other bone disease and musculoskeletal deformities,142,PARTIAL EXCISION BONE,309,Other significant hip and femur surgery,08,Diseases and Disorders of the Musculoskeletal System and Conn Tissue,2,Moderate,Minor,Surgical,Medicaid,,,,N,N,105418.09,21192.24
New York City,Manhattan,7002053,001463,NYU Langone Hospitals,0 to 17,113,F,White,Not Span/Hispanic,3,Elective,Home w/ Home Health Services,2017,204,Other non-traumatic joint disorders,146,"TRTMNT,FRAC HIP/FEMUR",309,Other significant hip and femur surgery,08,Diseases and Disorders of the Musculoskeletal System and Conn Tissue,2,Moderate,Minor,Surgical,Medicaid,,,,N,N,94992.06,19305.32
New York City,Manhattan,7002053,001463,NYU Langone Hospitals,70 or Older,100,F,Other Race,Not Span/Hispanic,5,Elective,Hospice - Home,2017,042,Secondary malignancies,146,"TRTMNT,FRAC HIP/FEMUR",309,Other significant hip and femur surgery,08,Diseases and Disorders of the Musculoskeletal System and Conn Tissue,3,Major,Major,Surgical,Medicare,,,,N,N,194966.72,37604.51
New York City,Manhattan,7002032,001466,Mount Sinai West,50 to 69,100,F,Black/African American,Spanish/Hispanic,2,Elective,Home w/ Home Health Services,2017,230,Fracture of lower limb,146,"TRTMNT,FRAC HIP/FEMUR",309,Other significant hip and femur surgery,08,Diseases and Disorders of the Musculoskeletal System and Conn Tissue,1,Minor,Minor,Surgical,Medicare,Medicare,Medicaid,,N,N,32709.31,13287.28
Western NY,Erie,1401014,000207,Buffalo General Medical Center,50 to 69,142,M,White,Not Span/Hispanic,5,Elective,Home w/ Home Health Services,2017,237,Complication of device; implant or graft,162,OT OR THER PRC ON JOINT,309,Other significant hip and femur surgery,08,Diseases and Disorders of the Musculoskeletal System and Conn Tissue,2,Moderate,Minor,Surgical,Private Health Insurance,Self-Pay,,,N,N,80511.54,29832.25
Western NY,Erie,1401014,000208,Women And Children's Hospital Of Buffalo,0 to 17,142,M,Black/African American,Not Span/Hispanic,4,Elective,Home or Self Care,2017,217,Other congenital anomalies,161,OT OR THER PRCS ON BONE,309,Other significant hip and femur surgery,08,Diseases and Disorders of the Musculoskeletal System and Conn Tissue,3,Major,Minor,Surgical,Medicaid,Self-Pay,,,N,N,82970.79,27517.26
Western NY,Erie,1401005,000210,Erie County Medical Center,50 to 69,140,F,White,Not Span/Hispanic,2,Elective,Home or Self Care,2017,203,Osteoarthritis,142,PARTIAL EXCISION BONE,309,Other significant hip and femur surgery,08,Diseases and Disorders of the Musculoskeletal System and Conn Tissue,1,Minor,Minor,Surgical,Blue Cross/Blue Shield,,,,N,N,37082.62,19635.76
Western NY,Erie,1401005,000210,Erie County Medical Center,50 to 69,147,M,White,Not Span/Hispanic,33,Emergency,Home or Self Care,2017,237,Complication of device; implant or graft,162,OT OR THER PRC ON JOINT,309,Other significant hip and femur surgery,08,Diseases and Disorders of the Musculoskeletal System and Conn Tissue,3,Major,Moderate,Surgical,Medicare,Medicaid,,,N,Y,62345.65,44927.24
Western NY,Erie,1401005,000210,Erie County Medical Center,30 to 49,142,M,Black/African American,Not Span/Hispanic,25,Emergency,Home or Self Care,2017,229,Fracture of upper limb,145,"TRTMNT,FRAC RADIUS/ULNA",309,Other significant hip and femur surgery,08,Diseases and Disorders of the Musculoskeletal System and Conn Tissue,3,Major,Moderate,Surgical,Miscellaneous/Other,Blue Cross/Blue Shield,,,N,Y,81243.94,44532.99
Western NY,Erie,1401005,000210,Erie County Medical Center,70 or Older,140,M,White,Not Span/Hispanic,9,Elective,Skilled Nursing Home,2017,237,Complication of device; implant or graft,146,"TRTMNT,FRAC HIP/FEMUR",309,Other significant hip and femur surgery,08,Diseases and Disorders of the Musculoskeletal System and Conn Tissue,2,Moderate,Moderate,Surgical,Miscellaneous/Other,Self-Pay,Self-Pay,,N,N,37643.16,22225.26
Western NY,Erie,1401005,000210,Erie County Medical Center,70 or Older,147,F,White,Not Span/Hispanic,8,Elective,Skilled Nursing Home,2017,238,Complications of surgical procedures or medical care,146,"TRTMNT,FRAC HIP/FEMUR",309,Other significant hip and femur surgery,08,Diseases and Disorders of the Musculoskeletal System and Conn Tissue,1,Minor,Moderate,Surgical,Medicare,Blue Cross/Blue Shield,Private Health Insurance,,N,N,44093.15,25232.65
Western NY,Erie,1401005,000210,Erie County Medical Center,50 to 69,140,M,White,Not Span/Hispanic,2,Elective,Home w/ Home Health Services,2017,203,Osteoarthritis,160,OT THER PRCS ON MUSCLES,309,Other significant hip and femur surgery,08,Diseases and Disorders of the Musculoskeletal System and Conn Tissue,2,Moderate,Minor,Surgical,Self-Pay,,,,N,N,20274.32,11980.81
Western NY,Erie,1401014,003067,Millard Fillmore Suburban Hospital,70 or Older,140,F,White,Not Span/Hispanic,4,Emergency,Skilled Nursing Home,2017,238,Complications of surgical procedures or medical care,146,"TRTMNT,FRAC HIP/FEMUR",309,Other significant hip and femur surgery,08,Diseases and Disorders of the Musculoskeletal System and Conn Tissue,2,Moderate,Moderate,Surgical,Medicare,Medicaid,Self-Pay,,N,Y,38158.07,15398.87
Capital/Adirond,Rensselaer,4102002,000756,Samaritan Hospital,50 to 69,121,M,White,Not Span/Hispanic,8,Emergency,Home or Self Care,2017,230,Fracture of lower limb,146,"TRTMNT,FRAC HIP/FEMUR",309,Other significant hip and femur surgery,08,Diseases and Disorders of the Musculoskeletal System and Conn Tissue,3,Major,Major,Surgical,Medicare,Federal/State/Local/VA,Self-Pay,,N,Y,44875.40,17698.84
Hudson Valley,Orange,3523000,000699,Orange Regional Medical Center,70 or Older,109,M,White,Not Span/Hispanic,9,Elective,Home w/ Home Health Services,2017,237,Complication of device; implant or graft,162,OT OR THER PRC ON JOINT,309,Other significant hip and femur surgery,08,Diseases and Disorders of the Musculoskeletal System and Conn Tissue,2,Moderate,Major,Surgical,Medicare,Blue Cross/Blue Shield,Blue Cross/Blue Shield,,N,N,85467.79,26881.83
Hudson Valley,Orange,3523000,000699,Orange Regional Medical Center,70 or Older,109,F,White,Not Span/Hispanic,14,Emergency,Skilled Nursing Home,2017,201,Infective arthritis and osteomyelitis (except that caused by tuberculosis or sexually transmitted disease),162,OT OR THER PRC ON JOINT,309,Other significant hip and femur surgery,08,Diseases and Disorders of the Musculoskeletal System and Conn Tissue,3,Major,Major,Surgical,Medicare,Private Health Insurance,,,N,Y,101624.30,26643.43
Hudson Valley,Westchester,5901000,001039,NewYork-Presbyterian/Hudson Valley Hospital,70 or Older,105,F,White,Not Span/Hispanic,3,Emergency,Skilled Nursing Home,2017,238,Complications of surgical procedures or medical care,146,"TRTMNT,FRAC HIP/FEMUR",309,Other significant hip and femur surgery,08,Diseases and Disorders of the Musculoskeletal System and Conn Tissue,3,Major,Moderate,Surgical,Medicare,,,,N,Y,167934.59,61665.21
New York City,Bronx,7000006,001169,Montefiore Medical Center - Henry & Lucy Moses Div,0 to 17,104,F,Other Race,Not Span/Hispanic,2,Elective,Home or Self Care,2017,209,Other acquired deformities,146,"TRTMNT,FRAC HIP/FEMUR",309,Other significant hip and femur surgery,08,Diseases and Disorders of the Musculoskeletal System and Conn Tissue,2,Moderate,Minor,Surgical,Medicaid,,,,N,N,44300.60,12167.32
New York City,Bronx,7000006,001169,Montefiore Medical Center - Henry & Lucy Moses Div,50 to 69,104,M,Black/African American,Not Span/Hispanic,6,Elective,Skilled Nursing Home,2017,204,Other non-traumatic joint disorders,142,PARTIAL EXCISION BONE,309,Other significant hip and femur surgery,08,Diseases and Disorders of the Musculoskeletal System and Conn Tissue,3,Major,Major,Surgical,Medicaid,,,,N,N,103411.36,27203.95
New York City,Bronx,7000006,001169,Montefiore Medical Center - Henry & Lucy Moses Div,30 to 49,105,F,Black/African American,Not Span/Hispanic,9,Emergency,Home or Self Care,2017,042,Secondary malignancies,159,OT DX PRCS ON MUSC/SKEL,309,Other significant hip and femur surgery,08,Diseases and Disorders of the Musculoskeletal System and Conn Tissue,2,Moderate,Moderate,Surgical,Medicare,Medicaid,,,N,Y,145675.17,31504.52
New York City,Bronx,7000006,001169,Montefiore Medical Center - Henry & Lucy Moses Div,0 to 17,104,F,Black/African American,Not Span/Hispanic,15,Emergency,Home or Self Care,2017,201,Infective arthritis and osteomyelitis (except that caused by tuberculosis or sexually transmitted disease),155,ARTHROCENTESIS,309,Other significant hip and femur surgery,08,Diseases and Disorders of the Musculoskeletal System and Conn Tissue,4,Extreme,Moderate,Surgical,Medicaid,,,,N,N,182909.75,44964.19
New York City,Bronx,7000006,001169,Montefiore Medical Center - Henry & Lucy Moses Div,0 to 17,104,M,Other Race,Not Span/Hispanic,2,Emergency,Home or Self Care,2017,229,Fracture of upper limb,146,"TRTMNT,FRAC HIP/FEMUR",309,Other significant hip and femur surgery,08,Diseases and Disorders of the Musculoskeletal System and Conn Tissue,1,Minor,Minor,Surgical,Medicaid,,,,N,Y,38054.20,9365.82
New York City,Manhattan,7002024,001456,Mount Sinai Hospital,30 to 49,100,F,White,Not Span/Hispanic,2,Elective,Home or Self Care,2017,211,Other connective tissue disease,159,OT DX PRCS ON MUSC/SKEL,309,Other significant hip and femur surgery,08,Diseases and Disorders of the Musculoskeletal System and Conn Tissue,3,Major,Minor,Surgical,Private Health Insurance,Self-Pay,,,N,N,35748.28,14322.34
New York City,Manhattan,7002032,001469,Mount Sinai St. Luke's,70 or Older,100,F,Black/African American,Spanish/Hispanic,8,Emergency,Skilled Nursing Home,2017,201,Infective arthritis and osteomyelitis (except that caused by tuberculosis or sexually transmitted disease),142,PARTIAL EXCISION BONE,309,Other significant hip and femur surgery,08,Diseases and Disorders of the Musculoskeletal System and Conn Tissue,4,Extreme,Major,Surgical,Medicare,Medicare,Medicaid,,N,Y,68430.88,18753.17
New York City,Richmond,7004003,001740,Staten Island University Hosp-North,70 or Older,103,F,White,Not Span/Hispanic,13,Emergency,Skilled Nursing Home,2017,229,Fracture of upper limb,146,"TRTMNT,FRAC HIP/FEMUR",309,Other significant hip and femur surgery,08,Diseases and Disorders of the Musculoskeletal System and Conn Tissue,3,Major,Major,Surgical,Medicare,Medicare,,,N,Y,138169.87,34719.06
Central NY,Jefferson,2201000,000367,Samaritan Medical Center,70 or Older,136,M,White,Not Span/Hispanic,5,Emergency,Inpatient Rehabilitation Facility,2017,238,Complications of surgical procedures or medical care,146,"TRTMNT,FRAC HIP/FEMUR",309,Other significant hip and femur surgery,08,Diseases and Disorders of the Musculoskeletal System and Conn Tissue,3,Major,Major,Surgical,Medicare,Private Health Insurance,Self-Pay,,N,Y,46188.74,17678.93
Central NY,Oneida,3202002,000598,St Elizabeth Medical Center,70 or Older,133,F,White,Not Span/Hispanic,3,Urgent,Inpatient Rehabilitation Facility,2017,238,Complications of surgical procedures or medical care,146,"TRTMNT,FRAC HIP/FEMUR",309,Other significant hip and femur surgery,08,Diseases and Disorders of the Musculoskeletal System and Conn Tissue,2,Moderate,Minor,Surgical,Medicare,,,,N,N,20655.10,8056.16
Central NY,Oneida,3202002,000598,St Elizabeth Medical Center,50 to 69,133,M,White,Not Span/Hispanic,4,Elective,Skilled Nursing Home,2017,237,Complication of device; implant or graft,162,OT OR THER PRC ON JOINT,309,Other significant hip and femur surgery,08,Diseases and Disorders of the Musculoskeletal System and Conn Tissue,2,Moderate,Minor,Surgical,Blue Cross/Blue Shield,,,,N,N,35865.50,16333.08
Capital/Adirond,Otsego,3824000,000746,Mary Imogene Bassett Hospital,70 or Older,133,F,White,Not Span/Hispanic,7,Urgent,Inpatient Rehabilitation Facility,2017,230,Fracture of lower limb,146,"TRTMNT,FRAC HIP/FEMUR",309,Other significant hip and femur surgery,08,Diseases and Disorders of the Musculoskeletal System and Conn Tissue,3,Major,Moderate,Surgical,Medicare,Blue Cross/Blue Shield,Self-Pay,,N,N,45714.40,21229.66