Hospital Service Area,Hospital County,Operating Certificate Number,Permanent Facility Id,Facility Name,Age Group,Zip Code - 3 digits,Gender,Race,Ethnicity,Length of Stay,Type of Admission,Patient Disposition,Discharge Year,CCS Diagnosis Code,CCS Diagnosis Description,CCS Procedure Code,CCS Procedure Description,APR DRG Code,APR DRG Description,APR MDC Code,APR MDC Description,APR Severity of Illness Code,APR Severity of Illness Description,APR Risk of Mortality,APR Medical Surgical Description,Payment Typology 1,Payment Typology 2,Payment Typology 3,Birth Weight,Abortion Edit Indicator,Emergency Department Indicator,Total Charges,Total Costs
New York City,Manhattan,7002053,001446,NYU Langone Orthopedic Hospital,18 to 29,100,F,Other Race,Spanish/Hispanic,7,Elective,Home w/ Home Health Services,2017,209,Other acquired deformities,146,"TRTMNT,FRAC HIP/FEMUR",309,Other significant hip and femur surgery,08,Diseases and Disorders of the Musculoskeletal System and Conn Tissue,2,Moderate,Moderate,Surgical,Federal/State/Local/VA,,,,N,N,125599.27,37584.20
New York City,Manhattan,7002053,001446,NYU Langone Orthopedic Hospital,0 to 17,,F,Other Race,Spanish/Hispanic,1,Elective,Home or Self Care,2017,212,Other bone disease and musculoskeletal deformities,142,PARTIAL EXCISION BONE,309,Other significant hip and femur surgery,08,Diseases and Disorders of the Musculoskeletal System and Conn Tissue,2,Moderate,Minor,Surgical,Medicaid,,,,N,N,105418.09,21192.24
New York City,Manhattan,7002053,001446,NYU Langone Orthopedic Hospital,18 to 29,113,F,Other Race,Spanish/Hispanic,4,Elective,Home w/ Home Health Services,2017,257,Other aftercare,146,"TRTMNT,FRAC HIP/FEMUR",309,Other significant hip and femur surgery,08,Diseases and Disorders of the Musculoskeletal System and Conn Tissue,1,Minor,Minor,Surgical,Medicaid,,,,N,N,99102.22,24271.56
New York City,Manhattan,7002053,001446,NYU Langone Orthopedic Hospital,0 to 17,OOS,F,Other Race,Spanish/Hispanic,2,Elective,Home w/ Home Health Services,2017,237,Complication of device; implant or graft,146,"TRTMNT,FRAC HIP/FEMUR",309,Other significant hip and femur surgery,08,Diseases and Disorders of the Musculoskeletal System and Conn Tissue,2,Moderate,Moderate,Surgical,Private Health Insurance,,,,N,N,107328.39,23691.07
New York City,Manhattan,7002053,001446,NYU Langone Orthopedic Hospital,50 to 69,112,M,Black/African American,Not Span/Hispanic,7,Elective,Home w/ Home Health Services,2017,237,Complication of device; implant or graft,162,OT OR THER PRC ON JOINT,309,Other significant hip and femur surgery,08,Diseases and Disorders of the Musculoskeletal System and Conn Tissue,2,Moderate,Minor,Surgical,Medicare,,,,N,N,199568.65,51298.74
New York City,Manhattan,7002053,001446,NYU Langone Orthopedic Hospital,50 to 69,,M,Other Race,Not Span/Hispanic,3,Elective,Home w/ Home Health Services,2017,226,Fracture of neck of femur (hip),146,"TRTMNT,FRAC HIP/FEMUR",309,Other significant hip and femur surgery,08,Diseases and Disorders of the Musculoskeletal System and Conn Tissue,1,Minor,Minor,Surgical,Private Health Insurance,,,,N,N,91291.41,23419.99
New York City,Manhattan,7002053,001446,NYU Langone Orthopedic Hospital,0 to 17,113,M,White,Not Span/Hispanic,5,Elective,Home w/ Home Health Services,2017,217,Other congenital anomalies,146,"TRTMNT,FRAC HIP/FEMUR",309,Other significant hip and femur surgery,08,Diseases and Disorders of the Musculoskeletal System and Conn Tissue,1,Minor,Minor,Surgical,Private Health Insurance,,,,N,N,121448.75,32737.19
New York City,Manhattan,7002053,001446,NYU Langone Orthopedic Hospital,70 or Older,OOS,F,Other Race,Not Span/Hispanic,8,Elective,Skilled Nursing Home,2017,237,Complication of device; implant or graft,162,OT OR THER PRC ON JOINT,309,Other significant hip and femur surgery,08,Diseases and Disorders of the Musculoskeletal System and Conn Tissue,2,Moderate,Minor,Surgical,Medicaid,,,,N,N,224549.54,57528.22
New York City,Manhattan,7002053,001446,NYU Langone Orthopedic Hospital,30 to 49,100,F,White,Not Span/Hispanic,5,Elective,Home w/ Home Health Services,2017,237,Complication of device; implant or graft,162,OT OR THER PRC ON JOINT,309,Other significant hip and femur surgery,08,Diseases and Disorders of the Musculoskeletal System and Conn Tissue,2,Moderate,Minor,Surgical,Private Health Insurance,,,,N,N,103167.28,29615.92
New York City,Manhattan,7002053,001446,NYU Langone Orthopedic Hospital,18 to 29,100,F,Black/African American,Not Span/Hispanic,1,Elective,Home or Self Care,2017,204,Other non-traumatic joint disorders,142,PARTIAL EXCISION BONE,309,Other significant hip and femur surgery,08,Diseases and Disorders of the Musculoskeletal System and Conn Tissue,2,Moderate,Minor,Surgical,Private Health Insurance,,,,N,N,80512.01,16586.90
New York City,Manhattan,7002053,001446,NYU Langone Orthopedic Hospital,70 or Older,100,M,White,Not Span/Hispanic,7,Emergency,Inpatient Rehabilitation Facility,2017,229,Fracture of upper limb,146,"TRTMNT,FRAC HIP/FEMUR",309,Other significant hip and femur surgery,08,Diseases and Disorders of the Musculoskeletal System and Conn Tissue,3,Major,Major,Surgical,Medicare,,,,N,Y,156058.19,47988.14
New York City,Manhattan,7002053,001446,NYU Langone Orthopedic Hospital,30 to 49,OOS,F,White,Not Span/Hispanic,1,Elective,Home or Self Care,2017,237,Complication of device; implant or graft,162,OT OR THER PRC ON JOINT,309,Other significant hip and femur surgery,08,Diseases and Disorders of the Musculoskeletal System and Conn Tissue,2,Moderate,Minor,Surgical,Blue Cross/Blue Shield,,,,N,N,77483.02,18806.55
New York City,Manhattan,7002053,001446,NYU Langone Orthopedic Hospital,0 to 17,100,F,Other Race,Unknown,2,Elective,Home w/ Home Health Services,2017,217,Other congenital anomalies,161,OT OR THER PRCS ON BONE,309,Other significant hip and femur surgery,08,Diseases and Disorders of the Musculoskeletal System and Conn Tissue,1,Minor,Minor,Surgical,Medicaid,,,,N,N,49858.92,13392.36
New York City,Manhattan,7002053,001446,NYU Langone Orthopedic Hospital,50 to 69,113,F,White,Not Span/Hispanic,5,Elective,Home w/ Home Health Services,2017,237,Complication of device; implant or graft,162,OT OR THER PRC ON JOINT,309,Other significant hip and femur surgery,08,Diseases and Disorders of the Musculoskeletal System and Conn Tissue,3,Major,Moderate,Surgical,Medicare,,,,N,N,160926.63,40236.21
New York City,Manhattan,7002053,001446,NYU Langone Orthopedic Hospital,30 to 49,104,M,Other Race,Spanish/Hispanic,2,Elective,Home w/ Home Health Services,2017,201,Infective arthritis and osteomyelitis (except that caused by tuberculosis or sexually transmitted disease),161,OT OR THER PRCS ON BONE,309,Other significant hip and femur surgery,08,Diseases and Disorders of the Musculoskeletal System and Conn Tissue,2,Moderate,Minor,Surgical,Private Health Insurance,,,,N,N,101580.58,22663.49
New York City,Manhattan,7002053,001446,NYU Langone Orthopedic Hospital,0 to 17,112,M,Other Race,Not Span/Hispanic,1,Urgent,Home w/ Home Health Services,2017,212,Other bone disease and musculoskeletal deformities,146,"TRTMNT,FRAC HIP/FEMUR",309,Other significant hip and femur surgery,08,Diseases and Disorders of the Musculoskeletal System and Conn Tissue,1,Minor,Minor,Surgical,Private Health Insurance,,,,N,N,34188.38,8323.61
New York City,Manhattan,7002053,001446,NYU Langone Orthopedic Hospital,30 to 49,104,F,Other Race,Spanish/Hispanic,4,Elective,Home w/ Home Health Services,2017,230,Fracture of lower limb,146,"TRTMNT,FRAC HIP/FEMUR",309,Other significant hip and femur surgery,08,Diseases and Disorders of the Musculoskeletal System and Conn Tissue,2,Moderate,Minor,Surgical,Private Health Insurance,,,,N,N,190970.59,46676.88
New York City,Manhattan,7002053,001446,NYU Langone Orthopedic Hospital,30 to 49,112,M,White,Not Span/Hispanic,1,Elective,Home or Self Care,2017,201,Infective arthritis and osteomyelitis (except that caused by tuberculosis or sexually transmitted disease),142,PARTIAL EXCISION BONE,309,Other significant hip and femur surgery,08,Diseases and Disorders of the Musculoskeletal System and Conn Tissue,1,Minor,Minor,Surgical,Private Health Insurance,,,,N,N,45832.57,10221.26
New York City,Manhattan,7002053,001446,NYU Langone Orthopedic Hospital,50 to 69,100,F,White,Not Span/Hispanic,2,Emergency,Home w/ Home Health Services,2017,204,Other non-traumatic joint disorders,162,OT OR THER PRC ON JOINT,309,Other significant hip and femur surgery,08,Diseases and Disorders of the Musculoskeletal System and Conn Tissue,1,Minor,Minor,Surgical,Private Health Insurance,,,,N,Y,70420.25,18001.76
New York City,Manhattan,7002053,001446,NYU Langone Orthopedic Hospital,0 to 17,104,F,Other Race,Unknown,4,Elective,Home w/ Home Health Services,2017,217,Other congenital anomalies,146,"TRTMNT,FRAC HIP/FEMUR",309,Other significant hip and femur surgery,08,Diseases and Disorders of the Musculoskeletal System and Conn Tissue,1,Minor,Minor,Surgical,Medicaid,,,,N,N,80093.76,21149.46
New York City,Manhattan,7002053,001446,NYU Langone Orthopedic Hospital,0 to 17,104,F,Other Race,Spanish/Hispanic,3,Elective,Inpatient Rehabilitation Facility,2017,217,Other congenital anomalies,146,"TRTMNT,FRAC HIP/FEMUR",309,Other significant hip and femur surgery,08,Diseases and Disorders of the Musculoskeletal System and Conn Tissue,1,Minor,Minor,Surgical,Private Health Insurance,,,,N,N,120222.65,28286.42
New York City,Manhattan,7002053,001446,NYU Langone Orthopedic Hospital,70 or Older,116,F,White,Not Span/Hispanic,4,Elective,Skilled Nursing Home,2017,230,Fracture of lower limb,162,OT OR THER PRC ON JOINT,309,Other significant hip and femur surgery,08,Diseases and Disorders of the Musculoskeletal System and Conn Tissue,3,Major,Major,Surgical,Private Health Insurance,,,,N,N,198006.90,39466.12
New York City,Manhattan,7002053,001446,NYU Langone Orthopedic Hospital,50 to 69,114,F,Black/African American,Not Span/Hispanic,5,Elective,Skilled Nursing Home,2017,237,Complication of device; implant or graft,162,OT OR THER PRC ON JOINT,309,Other significant hip and femur surgery,08,Diseases and Disorders of the Musculoskeletal System and Conn Tissue,1,Minor,Minor,Surgical,Private Health Insurance,,,,N,Y,154233.88,46335.26
New York City,Manhattan,7002053,001446,NYU Langone Orthopedic Hospital,0 to 17,112,M,Other Race,Spanish/Hispanic,14,Elective,Home or Self Care,2017,217,Other congenital anomalies,146,"TRTMNT,FRAC HIP/FEMUR",309,Other significant hip and femur surgery,08,Diseases and Disorders of the Musculoskeletal System and Conn Tissue,2,Moderate,Minor,Surgical,Blue Cross/Blue Shield,,,,N,N,153726.63,59018.24
New York City,Manhattan,7002053,001446,NYU Langone Orthopedic Hospital,0 to 17,112,F,White,Not Span/Hispanic,3,Urgent,Home or Self Care,2017,212,Other bone disease and musculoskeletal deformities,146,"TRTMNT,FRAC HIP/FEMUR",309,Other significant hip and femur surgery,08,Diseases and Disorders of the Musculoskeletal System and Conn Tissue,2,Moderate,Minor,Surgical,Medicaid,,,,N,N,45832.77,14910.94
New York City,Manhattan,7002053,001446,NYU Langone Orthopedic Hospital,0 to 17,104,M,Other Race,Spanish/Hispanic,3,Elective,Home w/ Home Health Services,2017,204,Other non-traumatic joint disorders,162,OT OR THER PRC ON JOINT,309,Other significant hip and femur surgery,08,Diseases and Disorders of the Musculoskeletal System and Conn Tissue,3,Major,Minor,Surgical,Private Health Insurance,,,,N,N,154631.60,32226.15
New York City,Manhattan,7002053,001446,NYU Langone Orthopedic Hospital,0 to 17,112,F,White,Not Span/Hispanic,1,Elective,Home or Self Care,2017,217,Other congenital anomalies,146,"TRTMNT,FRAC HIP/FEMUR",309,Other significant hip and femur surgery,08,Diseases and Disorders of the Musculoskeletal System and Conn Tissue,1,Minor,Minor,Surgical,Medicaid,,,,N,N,59986.69,13183.94
New York City,Manhattan,7002053,001446,NYU Langone Orthopedic Hospital,0 to 17,113,F,White,Not Span/Hispanic,4,Elective,Home or Self Care,2017,217,Other congenital anomalies,146,"TRTMNT,FRAC HIP/FEMUR",309,Other significant hip and femur surgery,08,Diseases and Disorders of the Musculoskeletal System and Conn Tissue,1,Minor,Minor,Surgical,Medicaid,,,,N,N,98408.77,29186.29
New York City,Manhattan,7002053,001446,NYU Langone Orthopedic Hospital,30 to 49,,F,White,Not Span/Hispanic,5,Elective,Home or Self Care,2017,204,Other non-traumatic joint disorders,162,OT OR THER PRC ON JOINT,309,Other significant hip and femur surgery,08,Diseases and Disorders of the Musculoskeletal System and Conn Tissue,2,Moderate,Minor,Surgical,Medicaid,,,,N,N,160358.78,39840.99
New York City,Manhattan,7002053,001446,NYU Langone Orthopedic Hospital,70 or Older,100,F,White,Not Span/Hispanic,3,Elective,Home w/ Home Health Services,2017,042,Secondary malignancies,146,"TRTMNT,FRAC HIP/FEMUR",309,Other significant hip and femur surgery,08,Diseases and Disorders of the Musculoskeletal System and Conn Tissue,2,Moderate,Moderate,Surgical,Medicare,,,,N,N,111041.68,26817.85
New York City,Manhattan,7002053,001446,NYU Langone Orthopedic Hospital,70 or Older,112,F,White,Not Span/Hispanic,3,Elective,Home w/ Home Health Services,2017,230,Fracture of lower limb,146,"TRTMNT,FRAC HIP/FEMUR",309,Other significant hip and femur surgery,08,Diseases and Disorders of the Musculoskeletal System and Conn Tissue,2,Moderate,Minor,Surgical,Miscellaneous/Other,,,,N,N,214469.68,45607.72
New York City,Manhattan,7002053,001446,NYU Langone Orthopedic Hospital,18 to 29,,F,White,Not Span/Hispanic,2,Elective,Home w/ Home Health Services,2017,209,Other acquired deformities,146,"TRTMNT,FRAC HIP/FEMUR",309,Other significant hip and femur surgery,08,Diseases and Disorders of the Musculoskeletal System and Conn Tissue,2,Moderate,Minor,Surgical,Blue Cross/Blue Shield,,,,N,N,174387.72,33407.32
New York City,Manhattan,7002053,001446,NYU Langone Orthopedic Hospital,70 or Older,115,M,White,Not Span/Hispanic,2,Elective,Home w/ Home Health Services,2017,237,Complication of device; implant or graft,162,OT OR THER PRC ON JOINT,309,Other significant hip and femur surgery,08,Diseases and Disorders of the Musculoskeletal System and Conn Tissue,2,Moderate,Minor,Surgical,Medicaid,,,,N,N,167452.19,36406.97
New York City,Manhattan,7002053,001446,NYU Langone Orthopedic Hospital,50 to 69,112,M,Other Race,Not Span/Hispanic,4,Elective,Home w/ Home Health Services,2017,230,Fracture of lower limb,146,"TRTMNT,FRAC HIP/FEMUR",309,Other significant hip and femur surgery,08,Diseases and Disorders of the Musculoskeletal System and Conn Tissue,3,Major,Minor,Surgical,Private Health Insurance,,,,N,N,171480.84,38927.34
New York City,Manhattan,7002053,001446,NYU Langone Orthopedic Hospital,50 to 69,104,F,Black/African American,Not Span/Hispanic,10,Urgent,Skilled Nursing Home,2017,237,Complication of device; implant or graft,146,"TRTMNT,FRAC HIP/FEMUR",309,Other significant hip and femur surgery,08,Diseases and Disorders of the Musculoskeletal System and Conn Tissue,3,Major,Moderate,Surgical,Medicaid,,,,N,N,266345.66,72940.38
New York City,Manhattan,7002053,001446,NYU Langone Orthopedic Hospital,0 to 17,112,F,Other Race,Not Span/Hispanic,3,Elective,Home w/ Home Health Services,2017,217,Other congenital anomalies,146,"TRTMNT,FRAC HIP/FEMUR",309,Other significant hip and femur surgery,08,Diseases and Disorders of the Musculoskeletal System and Conn Tissue,2,Moderate,Minor,Surgical,Medicaid,,,,N,N,81497.66,21700.49
New York City,Manhattan,7002053,001446,NYU Langone Orthopedic Hospital,70 or Older,117,M,White,Not Span/Hispanic,5,Urgent,Home w/ Home Health Services,2017,237,Complication of device; implant or graft,146,"TRTMNT,FRAC HIP/FEMUR",309,Other significant hip and femur surgery,08,Diseases and Disorders of the Musculoskeletal System and Conn Tissue,2,Moderate,Minor,Surgical,Medicare,,,,N,N,95281.02,31214.58
New York City,Manhattan,7002053,001446,NYU Langone Orthopedic Hospital,0 to 17,113,F,White,Not Span/Hispanic,2,Urgent,Home w/ Home Health Services,2017,237,Complication of device; implant or graft,146,"TRTMNT,FRAC HIP/FEMUR",309,Other significant hip and femur surgery,08,Diseases and Disorders of the Musculoskeletal System and Conn Tissue,1,Minor,Minor,Surgical,Medicaid,,,,N,N,69922.96,17310.32
New York City,Manhattan,7002053,001446,NYU Langone Orthopedic Hospital,0 to 17,114,M,Other Race,Not Span/Hispanic,6,Elective,Inpatient Rehabilitation Facility,2017,257,Other aftercare,146,"TRTMNT,FRAC HIP/FEMUR",309,Other significant hip and femur surgery,08,Diseases and Disorders of the Musculoskeletal System and Conn Tissue,2,Moderate,Minor,Surgical,Medicaid,,,,N,N,76241.67,27173.02
New York City,Manhattan,7002053,001446,NYU Langone Orthopedic Hospital,70 or Older,115,M,White,Not Span/Hispanic,4,Elective,Skilled Nursing Home,2017,237,Complication of device; implant or graft,162,OT OR THER PRC ON JOINT,309,Other significant hip and femur surgery,08,Diseases and Disorders of the Musculoskeletal System and Conn Tissue,2,Moderate,Minor,Surgical,Medicaid,,,,N,N,97683.05,28863.45
New York City,Manhattan,7002053,001446,NYU Langone Orthopedic Hospital,50 to 69,113,F,White,Not Span/Hispanic,1,Elective,Home or Self Care,2017,232,Sprains and strains,160,OT THER PRCS ON MUSCLES,309,Other significant hip and femur surgery,08,Diseases and Disorders of the Musculoskeletal System and Conn Tissue,2,Moderate,Minor,Surgical,Medicare,,,,N,N,108928.85,21760.99
New York City,Manhattan,7002053,001446,NYU Langone Orthopedic Hospital,18 to 29,,F,White,Not Span/Hispanic,2,Elective,Home w/ Home Health Services,2017,204,Other non-traumatic joint disorders,162,OT OR THER PRC ON JOINT,309,Other significant hip and femur surgery,08,Diseases and Disorders of the Musculoskeletal System and Conn Tissue,2,Moderate,Moderate,Surgical,Private Health Insurance,,,,N,N,105616.24,23347.76
New York City,Manhattan,7002053,001446,NYU Langone Orthopedic Hospital,0 to 17,,F,White,Spanish/Hispanic,3,Elective,Home or Self Care,2017,209,Other acquired deformities,142,PARTIAL EXCISION BONE,309,Other significant hip and femur surgery,08,Diseases and Disorders of the Musculoskeletal System and Conn Tissue,2,Moderate,Minor,Surgical,Medicaid,,,,N,N,58978.75,17170.80
New York City,Manhattan,7002053,001446,NYU Langone Orthopedic Hospital,0 to 17,112,F,Other Race,Spanish/Hispanic,2,Elective,Home or Self Care,2017,217,Other congenital anomalies,146,"TRTMNT,FRAC HIP/FEMUR",309,Other significant hip and femur surgery,08,Diseases and Disorders of the Musculoskeletal System and Conn Tissue,2,Moderate,Minor,Surgical,Private Health Insurance,,,,N,N,70688.92,17162.67
New York City,Manhattan,7002053,001446,NYU Langone Orthopedic Hospital,0 to 17,112,F,Other Race,Not Span/Hispanic,3,Elective,Home w/ Home Health Services,2017,217,Other congenital anomalies,146,"TRTMNT,FRAC HIP/FEMUR",309,Other significant hip and femur surgery,08,Diseases and Disorders of the Musculoskeletal System and Conn Tissue,2,Moderate,Minor,Surgical,Medicaid,,,,N,N,94949.13,23523.78
New York City,Manhattan,7002053,001446,NYU Langone Orthopedic Hospital,30 to 49,100,M,Other Race,Unknown,2,Elective,Home w/ Home Health Services,2017,204,Other non-traumatic joint disorders,142,PARTIAL EXCISION BONE,309,Other significant hip and femur surgery,08,Diseases and Disorders of the Musculoskeletal System and Conn Tissue,1,Minor,Minor,Surgical,Private Health Insurance,,,,N,N,110865.79,24379.46
New York City,Manhattan,7002053,001446,NYU Langone Orthopedic Hospital,0 to 17,112,M,Black/African American,Not Span/Hispanic,4,Elective,Inpatient Rehabilitation Facility,2017,209,Other acquired deformities,146,"TRTMNT,FRAC HIP/FEMUR",309,Other significant hip and femur surgery,08,Diseases and Disorders of the Musculoskeletal System and Conn Tissue,3,Major,Minor,Surgical,Medicaid,,,,N,N,224508.22,49253.85
New York City,Manhattan,7002053,001446,NYU Langone Orthopedic Hospital,0 to 17,113,M,Other Race,Spanish/Hispanic,5,Elective,Inpatient Rehabilitation Facility,2017,209,Other acquired deformities,146,"TRTMNT,FRAC HIP/FEMUR",309,Other significant hip and femur surgery,08,Diseases and Disorders of the Musculoskeletal System and Conn Tissue,2,Moderate,Minor,Surgical,Private Health Insurance,,,,N,N,150521.73,38541.13
New York City,Manhattan,7002053,001446,NYU Langone Orthopedic Hospital,18 to 29,113,F,Other Race,Spanish/Hispanic,7,Elective,Home w/ Home Health Services,2017,209,Other acquired deformities,146,"TRTMNT,FRAC HIP/FEMUR",309,Other significant hip and femur surgery,08,Diseases and Disorders of the Musculoskeletal System and Conn Tissue,2,Moderate,Minor,Surgical,Private Health Insurance,,,,N,N,156196.69,44370.57
New York City,Manhattan,7002053,001446,NYU Langone Orthopedic Hospital,0 to 17,100,F,Other Race,Unknown,2,Elective,Home w/ Home Health Services,2017,237,Complication of device; implant or graft,146,"TRTMNT,FRAC HIP/FEMUR",309,Other significant hip and femur surgery,08,Diseases and Disorders of the Musculoskeletal System and Conn Tissue,2,Moderate,Minor,Surgical,Medicaid,,,,N,N,74283.48,17810.24
New York City,Manhattan,7002053,001446,NYU Langone Orthopedic Hospital,0 to 17,112,M,White,Not Span/Hispanic,1,Elective,Home or Self Care,2017,209,Other acquired deformities,146,"TRTMNT,FRAC HIP/FEMUR",309,Other significant hip and femur surgery,08,Diseases and Disorders of the Musculoskeletal System and Conn Tissue,2,Moderate,Minor,Surgical,Medicaid,,,,N,N,101188.73,20362.54
New York City,Manhattan,7002053,001446,NYU Langone Orthopedic Hospital,0 to 17,109,M,White,Not Span/Hispanic,3,Elective,Home w/ Home Health Services,2017,217,Other congenital anomalies,146,"TRTMNT,FRAC HIP/FEMUR",309,Other significant hip and femur surgery,08,Diseases and Disorders of the Musculoskeletal System and Conn Tissue,2,Moderate,Minor,Surgical,Medicaid,,,,N,N,155708.33,34638.49
New York City,Manhattan,7002053,001446,NYU Langone Orthopedic Hospital,70 or Older,OOS,M,White,Not Span/Hispanic,7,Elective,Skilled Nursing Home,2017,237,Complication of device; implant or graft,162,OT OR THER PRC ON JOINT,309,Other significant hip and femur surgery,08,Diseases and Disorders of the Musculoskeletal System and Conn Tissue,3,Major,Major,Surgical,Medicare,,,,N,Y,189791.03,56382.54
New York City,Manhattan,7002053,001446,NYU Langone Orthopedic Hospital,18 to 29,,F,White,Not Span/Hispanic,5,Elective,Home w/ Home Health Services,2017,209,Other acquired deformities,146,"TRTMNT,FRAC HIP/FEMUR",309,Other significant hip and femur surgery,08,Diseases and Disorders of the Musculoskeletal System and Conn Tissue,2,Moderate,Moderate,Surgical,Blue Cross/Blue Shield,,,,N,N,106426.63,30312.65
New York City,Manhattan,7002053,001446,NYU Langone Orthopedic Hospital,50 to 69,112,M,Other Race,Not Span/Hispanic,5,Elective,Home w/ Home Health Services,2017,237,Complication of device; implant or graft,161,OT OR THER PRCS ON BONE,309,Other significant hip and femur surgery,08,Diseases and Disorders of the Musculoskeletal System and Conn Tissue,3,Major,Minor,Surgical,Private Health Insurance,,,,N,N,120294.06,43207.87
New York City,Manhattan,7002053,001446,NYU Langone Orthopedic Hospital,50 to 69,115,M,White,Not Span/Hispanic,5,Elective,Home w/ Home Health Services,2017,237,Complication of device; implant or graft,162,OT OR THER PRC ON JOINT,309,Other significant hip and femur surgery,08,Diseases and Disorders of the Musculoskeletal System and Conn Tissue,3,Major,Major,Surgical,Blue Cross/Blue Shield,,,,N,Y,116278.25,38899.14
New York City,Manhattan,7002053,001446,NYU Langone Orthopedic Hospital,0 to 17,114,M,Other Race,Not Span/Hispanic,7,Elective,Inpatient Rehabilitation Facility,2017,209,Other acquired deformities,146,"TRTMNT,FRAC HIP/FEMUR",309,Other significant hip and femur surgery,08,Diseases and Disorders of the Musculoskeletal System and Conn Tissue,2,Moderate,Minor,Surgical,Medicaid,,,,N,N,237996.15,61133.75