Hospital Service Area,Hospital County,Operating Certificate Number,Permanent Facility Id,Facility Name,Age Group,Zip Code - 3 digits,Gender,Race,Ethnicity,Length of Stay,Type of Admission,Patient Disposition,Discharge Year,CCS Diagnosis Code,CCS Diagnosis Description,CCS Procedure Code,CCS Procedure Description,APR DRG Code,APR DRG Description,APR MDC Code,APR MDC Description,APR Severity of Illness Code,APR Severity of Illness Description,APR Risk of Mortality,APR Medical Surgical Description,Payment Typology 1,Payment Typology 2,Payment Typology 3,Birth Weight,Abortion Edit Indicator,Emergency Department Indicator,Total Charges,Total Costs
Long Island,Suffolk,5123000,000885,Brookhaven Memorial Hospital Medical Center Inc,70 or Older,119,M,White,Not Span/Hispanic,4,Elective,Home or Self Care,2017,205,Spondylosis; intervertebral disc disorders; other back problems,003,LAMINECTOMY; EXC IV DSC,310,Intervertebral disc excision & decompression,08,Diseases and Disorders of the Musculoskeletal System and Conn Tissue,2,Moderate,Moderate,Surgical,Medicare,Medicare,Blue Cross/Blue Shield,,N,N,52359.58,12441.89
Long Island,Suffolk,5123000,000885,Brookhaven Memorial Hospital Medical Center Inc,30 to 49,117,M,Other Race,Not Span/Hispanic,1,Elective,Home or Self Care,2017,205,Spondylosis; intervertebral disc disorders; other back problems,003,LAMINECTOMY; EXC IV DSC,310,Intervertebral disc excision & decompression,08,Diseases and Disorders of the Musculoskeletal System and Conn Tissue,2,Moderate,Minor,Surgical,Private Health Insurance,,,,N,N,25522.99,6052.11
Long Island,Suffolk,5123000,000885,Brookhaven Memorial Hospital Medical Center Inc,30 to 49,117,M,Other Race,Not Span/Hispanic,4,Emergency,Home or Self Care,2017,205,Spondylosis; intervertebral disc disorders; other back problems,006,DECOMP PERIPHERAL NERVE,310,Intervertebral disc excision & decompression,08,Diseases and Disorders of the Musculoskeletal System and Conn Tissue,2,Moderate,Minor,Surgical,Private Health Insurance,Blue Cross/Blue Shield,Blue Cross/Blue Shield,,N,Y,50718.58,10396.32
Long Island,Suffolk,5123000,000885,Brookhaven Memorial Hospital Medical Center Inc,50 to 69,117,F,White,Not Span/Hispanic,3,Emergency,Home or Self Care,2017,205,Spondylosis; intervertebral disc disorders; other back problems,003,LAMINECTOMY; EXC IV DSC,310,Intervertebral disc excision & decompression,08,Diseases and Disorders of the Musculoskeletal System and Conn Tissue,2,Moderate,Minor,Surgical,Medicare,Medicare,Blue Cross/Blue Shield,,N,Y,48823.55,9620.27
Long Island,Suffolk,5123000,000885,Brookhaven Memorial Hospital Medical Center Inc,18 to 29,117,M,Other Race,Not Span/Hispanic,2,Emergency,Home or Self Care,2017,205,Spondylosis; intervertebral disc disorders; other back problems,003,LAMINECTOMY; EXC IV DSC,310,Intervertebral disc excision & decompression,08,Diseases and Disorders of the Musculoskeletal System and Conn Tissue,1,Minor,Minor,Surgical,Private Health Insurance,,,,N,Y,42475.34,8075.30
Long Island,Suffolk,5123000,000885,Brookhaven Memorial Hospital Medical Center Inc,30 to 49,119,M,Other Race,Not Span/Hispanic,4,Emergency,Home or Self Care,2017,205,Spondylosis; intervertebral disc disorders; other back problems,003,LAMINECTOMY; EXC IV DSC,310,Intervertebral disc excision & decompression,08,Diseases and Disorders of the Musculoskeletal System and Conn Tissue,2,Moderate,Minor,Surgical,Private Health Insurance,,,,N,Y,42601.67,9445.47
Long Island,Suffolk,5123000,000885,Brookhaven Memorial Hospital Medical Center Inc,18 to 29,119,M,Other Race,Not Span/Hispanic,4,Emergency,Home or Self Care,2017,205,Spondylosis; intervertebral disc disorders; other back problems,003,LAMINECTOMY; EXC IV DSC,310,Intervertebral disc excision & decompression,08,Diseases and Disorders of the Musculoskeletal System and Conn Tissue,1,Minor,Minor,Surgical,Blue Cross/Blue Shield,Private Health Insurance,,,N,Y,43866.49,10093.12
Long Island,Suffolk,5123000,000885,Brookhaven Memorial Hospital Medical Center Inc,30 to 49,117,F,White,Not Span/Hispanic,4,Emergency,Home or Self Care,2017,205,Spondylosis; intervertebral disc disorders; other back problems,006,DECOMP PERIPHERAL NERVE,310,Intervertebral disc excision & decompression,08,Diseases and Disorders of the Musculoskeletal System and Conn Tissue,1,Minor,Minor,Surgical,Private Health Insurance,,,,N,Y,59388.72,10277.76
Long Island,Suffolk,5123000,000885,Brookhaven Memorial Hospital Medical Center Inc,70 or Older,117,F,White,Not Span/Hispanic,29,Emergency,Skilled Nursing Home,2017,231,Other fractures,159,OT DX PRCS ON MUSC/SKEL,310,Intervertebral disc excision & decompression,08,Diseases and Disorders of the Musculoskeletal System and Conn Tissue,3,Major,Moderate,Surgical,Medicare,,,,N,Y,261953.65,51393.46
Long Island,Suffolk,5123000,000885,Brookhaven Memorial Hospital Medical Center Inc,70 or Older,117,F,White,Not Span/Hispanic,8,Emergency,Skilled Nursing Home,2017,205,Spondylosis; intervertebral disc disorders; other back problems,003,LAMINECTOMY; EXC IV DSC,310,Intervertebral disc excision & decompression,08,Diseases and Disorders of the Musculoskeletal System and Conn Tissue,2,Moderate,Minor,Surgical,Medicare,Medicare,Blue Cross/Blue Shield,,N,Y,76462.51,16598.04
Long Island,Suffolk,5123000,000885,Brookhaven Memorial Hospital Medical Center Inc,30 to 49,117,M,White,Not Span/Hispanic,1,Elective,Home w/ Home Health Services,2017,231,Other fractures,161,OT OR THER PRCS ON BONE,310,Intervertebral disc excision & decompression,08,Diseases and Disorders of the Musculoskeletal System and Conn Tissue,3,Major,Minor,Surgical,Medicare,Medicare,,,N,N,65427.00,13300.34
Long Island,Suffolk,5123000,000885,Brookhaven Memorial Hospital Medical Center Inc,50 to 69,,M,White,Not Span/Hispanic,23,Emergency,Skilled Nursing Home,2017,201,Infective arthritis and osteomyelitis (except that caused by tuberculosis or sexually transmitted disease),003,LAMINECTOMY; EXC IV DSC,310,Intervertebral disc excision & decompression,08,Diseases and Disorders of the Musculoskeletal System and Conn Tissue,3,Major,Moderate,Surgical,Blue Cross/Blue Shield,,,,N,Y,177368.32,34422.96
Long Island,Suffolk,5123000,000885,Brookhaven Memorial Hospital Medical Center Inc,50 to 69,119,F,White,Not Span/Hispanic,13,Emergency,Inpatient Rehabilitation Facility,2017,207,Pathological fracture,154,ARTHROPLASTY-NOT HIP/KN,310,Intervertebral disc excision & decompression,08,Diseases and Disorders of the Musculoskeletal System and Conn Tissue,3,Major,Major,Surgical,Medicare,Medicare,Private Health Insurance,,N,Y,183700.49,29691.78
Long Island,Suffolk,5123000,000885,Brookhaven Memorial Hospital Medical Center Inc,50 to 69,119,F,White,Not Span/Hispanic,9,Emergency,Home or Self Care,2017,205,Spondylosis; intervertebral disc disorders; other back problems,003,LAMINECTOMY; EXC IV DSC,310,Intervertebral disc excision & decompression,08,Diseases and Disorders of the Musculoskeletal System and Conn Tissue,2,Moderate,Minor,Surgical,Private Health Insurance,,,,N,Y,113801.05,19495.38
Long Island,Suffolk,5123000,000885,Brookhaven Memorial Hospital Medical Center Inc,18 to 29,117,M,Other Race,Not Span/Hispanic,7,Emergency,Home w/ Home Health Services,2017,205,Spondylosis; intervertebral disc disorders; other back problems,003,LAMINECTOMY; EXC IV DSC,310,Intervertebral disc excision & decompression,08,Diseases and Disorders of the Musculoskeletal System and Conn Tissue,2,Moderate,Minor,Surgical,Private Health Insurance,,,,N,Y,69872.14,14801.10
Long Island,Suffolk,5123000,000885,Brookhaven Memorial Hospital Medical Center Inc,30 to 49,119,M,White,Not Span/Hispanic,8,Emergency,Home w/ Home Health Services,2017,205,Spondylosis; intervertebral disc disorders; other back problems,003,LAMINECTOMY; EXC IV DSC,310,Intervertebral disc excision & decompression,08,Diseases and Disorders of the Musculoskeletal System and Conn Tissue,3,Major,Minor,Surgical,Private Health Insurance,,,,N,Y,81996.90,17536.04
Long Island,Suffolk,5123000,000885,Brookhaven Memorial Hospital Medical Center Inc,30 to 49,117,F,White,Not Span/Hispanic,4,Emergency,Home w/ Home Health Services,2017,231,Other fractures,154,ARTHROPLASTY-NOT HIP/KN,310,Intervertebral disc excision & decompression,08,Diseases and Disorders of the Musculoskeletal System and Conn Tissue,3,Major,Minor,Surgical,Medicare,Medicare,Medicaid,,N,Y,105470.74,17138.52
Long Island,Suffolk,5123000,000885,Brookhaven Memorial Hospital Medical Center Inc,30 to 49,117,M,White,Not Span/Hispanic,2,Emergency,Home or Self Care,2017,205,Spondylosis; intervertebral disc disorders; other back problems,003,LAMINECTOMY; EXC IV DSC,310,Intervertebral disc excision & decompression,08,Diseases and Disorders of the Musculoskeletal System and Conn Tissue,1,Minor,Minor,Surgical,Private Health Insurance,Private Health Insurance,,,N,Y,29905.86,6635.81
Long Island,Suffolk,5123000,000885,Brookhaven Memorial Hospital Medical Center Inc,30 to 49,119,M,Black/African American,Not Span/Hispanic,5,Elective,Home or Self Care,2017,205,Spondylosis; intervertebral disc disorders; other back problems,003,LAMINECTOMY; EXC IV DSC,310,Intervertebral disc excision & decompression,08,Diseases and Disorders of the Musculoskeletal System and Conn Tissue,2,Moderate,Minor,Surgical,Private Health Insurance,,,,N,N,52558.41,12238.49
Long Island,Suffolk,5123000,000885,Brookhaven Memorial Hospital Medical Center Inc,30 to 49,117,M,Black/African American,Not Span/Hispanic,5,Emergency,Home or Self Care,2017,205,Spondylosis; intervertebral disc disorders; other back problems,109,PRCS ON THE URETHRA,310,Intervertebral disc excision & decompression,08,Diseases and Disorders of the Musculoskeletal System and Conn Tissue,2,Moderate,Minor,Surgical,Private Health Insurance,Medicaid,,,N,Y,81718.25,15999.07
Long Island,Suffolk,5123000,000885,Brookhaven Memorial Hospital Medical Center Inc,30 to 49,117,F,White,Not Span/Hispanic,3,Emergency,Home or Self Care,2017,205,Spondylosis; intervertebral disc disorders; other back problems,175,OT OR THER PRC SKN/BRST,310,Intervertebral disc excision & decompression,08,Diseases and Disorders of the Musculoskeletal System and Conn Tissue,1,Minor,Minor,Surgical,Private Health Insurance,,,,N,Y,105850.99,20644.40
Long Island,Suffolk,5123000,000885,Brookhaven Memorial Hospital Medical Center Inc,70 or Older,117,F,White,Not Span/Hispanic,11,Emergency,Skilled Nursing Home,2017,231,Other fractures,154,ARTHROPLASTY-NOT HIP/KN,310,Intervertebral disc excision & decompression,08,Diseases and Disorders of the Musculoskeletal System and Conn Tissue,2,Moderate,Moderate,Surgical,Medicare,Medicare,Private Health Insurance,,N,Y,137341.28,23426.21
Long Island,Suffolk,5123000,000885,Brookhaven Memorial Hospital Medical Center Inc,30 to 49,119,M,Other Race,Not Span/Hispanic,3,Emergency,Home or Self Care,2017,205,Spondylosis; intervertebral disc disorders; other back problems,003,LAMINECTOMY; EXC IV DSC,310,Intervertebral disc excision & decompression,08,Diseases and Disorders of the Musculoskeletal System and Conn Tissue,1,Minor,Minor,Surgical,Private Health Insurance,,,,N,Y,45398.16,9399.10
Long Island,Suffolk,5123000,000885,Brookhaven Memorial Hospital Medical Center Inc,70 or Older,117,M,White,Not Span/Hispanic,13,Emergency,Skilled Nursing Home,2017,205,Spondylosis; intervertebral disc disorders; other back problems,003,LAMINECTOMY; EXC IV DSC,310,Intervertebral disc excision & decompression,08,Diseases and Disorders of the Musculoskeletal System and Conn Tissue,2,Moderate,Moderate,Surgical,Medicare,Medicare,Blue Cross/Blue Shield,,N,Y,134278.45,27873.99
Long Island,Suffolk,5123000,000885,Brookhaven Memorial Hospital Medical Center Inc,50 to 69,119,F,White,Not Span/Hispanic,5,Emergency,Home or Self Care,2017,205,Spondylosis; intervertebral disc disorders; other back problems,003,LAMINECTOMY; EXC IV DSC,310,Intervertebral disc excision & decompression,08,Diseases and Disorders of the Musculoskeletal System and Conn Tissue,1,Minor,Minor,Surgical,Private Health Insurance,Medicaid,,,N,Y,70766.97,13066.86
Long Island,Suffolk,5123000,000885,Brookhaven Memorial Hospital Medical Center Inc,30 to 49,117,F,Other Race,Not Span/Hispanic,4,Emergency,Home or Self Care,2017,205,Spondylosis; intervertebral disc disorders; other back problems,003,LAMINECTOMY; EXC IV DSC,310,Intervertebral disc excision & decompression,08,Diseases and Disorders of the Musculoskeletal System and Conn Tissue,1,Minor,Minor,Surgical,Private Health Insurance,Medicaid,,,N,Y,56082.06,11254.22
Long Island,Suffolk,5123000,000885,Brookhaven Memorial Hospital Medical Center Inc,30 to 49,119,M,White,Not Span/Hispanic,2,Emergency,Home or Self Care,2017,205,Spondylosis; intervertebral disc disorders; other back problems,003,LAMINECTOMY; EXC IV DSC,310,Intervertebral disc excision & decompression,08,Diseases and Disorders of the Musculoskeletal System and Conn Tissue,1,Minor,Minor,Surgical,Self-Pay,,,,N,Y,40448.02,8065.04
