Hospital Service Area,Hospital County,Operating Certificate Number,Permanent Facility Id,Facility Name,Age Group,Zip Code - 3 digits,Gender,Race,Ethnicity,Length of Stay,Type of Admission,Patient Disposition,Discharge Year,CCS Diagnosis Code,CCS Diagnosis Description,CCS Procedure Code,CCS Procedure Description,APR DRG Code,APR DRG Description,APR MDC Code,APR MDC Description,APR Severity of Illness Code,APR Severity of Illness Description,APR Risk of Mortality,APR Medical Surgical Description,Payment Typology 1,Payment Typology 2,Payment Typology 3,Birth Weight,Abortion Edit Indicator,Emergency Department Indicator,Total Charges,Total Costs
Long Island,Nassau,2908000,000511,NYU Langone Hospital-Long Island,50 to 69,114,F,Other Race,Not Span/Hispanic,8,Emergency,Home w/ Home Health Services,2019,MUS011,SPONDYLOPATHIES/SPONDYLOARTHROPATHY (INCLUDING INFECTIVE),CNS008,SPINAL CORD DECOMPRESSION,310,INTERVERTEBRAL DISC EXCISION & DECOMPRESSION,08,DISEASES AND DISORDERS OF THE MUSCULOSKELETAL SYSTEM AND CONNECTIVE TISSUE,3,Major,Minor,Surgical,Medicaid,,,,,true,153852.14,25568.12
Long Island,Nassau,2908000,000511,NYU Langone Hospital-Long Island,50 to 69,115,M,White,Not Span/Hispanic,8,Emergency,Home w/ Home Health Services,2019,MUS011,SPONDYLOPATHIES/SPONDYLOARTHROPATHY (INCLUDING INFECTIVE),MST016,VERTEBRAL DISCECTOMY,310,INTERVERTEBRAL DISC EXCISION & DECOMPRESSION,08,DISEASES AND DISORDERS OF THE MUSCULOSKELETAL SYSTEM AND CONNECTIVE TISSUE,2,Moderate,Minor,Surgical,Blue Cross/Blue Shield,Medicare,Medicare,,,true,405497.45,58458.41
Long Island,Nassau,2908000,000511,NYU Langone Hospital-Long Island,50 to 69,115,F,White,Not Span/Hispanic,2,Emergency,Home w/ Home Health Services,2019,MUS011,SPONDYLOPATHIES/SPONDYLOARTHROPATHY (INCLUDING INFECTIVE),MST016,VERTEBRAL DISCECTOMY,310,INTERVERTEBRAL DISC EXCISION & DECOMPRESSION,08,DISEASES AND DISORDERS OF THE MUSCULOSKELETAL SYSTEM AND CONNECTIVE TISSUE,2,Moderate,Minor,Surgical,Blue Cross/Blue Shield,,,,,true,123422.33,17696.34
Long Island,Nassau,2908000,000511,NYU Langone Hospital-Long Island,50 to 69,115,M,White,Not Span/Hispanic,2,Emergency,Home or Self Care,2019,MUS011,SPONDYLOPATHIES/SPONDYLOARTHROPATHY (INCLUDING INFECTIVE),MST016,VERTEBRAL DISCECTOMY,310,INTERVERTEBRAL DISC EXCISION & DECOMPRESSION,08,DISEASES AND DISORDERS OF THE MUSCULOSKELETAL SYSTEM AND CONNECTIVE TISSUE,1,Minor,Minor,Surgical,Blue Cross/Blue Shield,Medicare,,,,true,108813.52,16959.76
Long Island,Nassau,2908000,000511,NYU Langone Hospital-Long Island,70 or Older,115,F,White,Spanish/Hispanic,3,Elective,Home w/ Home Health Services,2019,MUS011,SPONDYLOPATHIES/SPONDYLOARTHROPATHY (INCLUDING INFECTIVE),CNS008,SPINAL CORD DECOMPRESSION,310,INTERVERTEBRAL DISC EXCISION & DECOMPRESSION,08,DISEASES AND DISORDERS OF THE MUSCULOSKELETAL SYSTEM AND CONNECTIVE TISSUE,2,Moderate,Minor,Surgical,Medicare,Medicare,Private Health Insurance,,,false,170460.5,26772.83
Long Island,Nassau,2908000,000511,NYU Langone Hospital-Long Island,30 to 49,117,F,White,Not Span/Hispanic,3,Emergency,Home w/ Home Health Services,2019,MUS011,SPONDYLOPATHIES/SPONDYLOARTHROPATHY (INCLUDING INFECTIVE),MST016,VERTEBRAL DISCECTOMY,310,INTERVERTEBRAL DISC EXCISION & DECOMPRESSION,08,DISEASES AND DISORDERS OF THE MUSCULOSKELETAL SYSTEM AND CONNECTIVE TISSUE,2,Moderate,Minor,Surgical,Blue Cross/Blue Shield,,,,,true,165517.89,23866.25
Long Island,Nassau,2908000,000511,NYU Langone Hospital-Long Island,30 to 49,117,M,White,Not Span/Hispanic,5,Emergency,Home w/ Home Health Services,2019,MUS011,SPONDYLOPATHIES/SPONDYLOARTHROPATHY (INCLUDING INFECTIVE),CNS008,SPINAL CORD DECOMPRESSION,310,INTERVERTEBRAL DISC EXCISION & DECOMPRESSION,08,DISEASES AND DISORDERS OF THE MUSCULOSKELETAL SYSTEM AND CONNECTIVE TISSUE,1,Minor,Minor,Surgical,Private Health Insurance,,,,,true,106603.2,18515.59
Long Island,Nassau,2908000,000511,NYU Langone Hospital-Long Island,50 to 69,118,F,White,Not Span/Hispanic,2,Elective,Home w/ Home Health Services,2019,MUS011,SPONDYLOPATHIES/SPONDYLOARTHROPATHY (INCLUDING INFECTIVE),PNS001,LUMBOSACRAL NERVE DECOMPRESSION,310,INTERVERTEBRAL DISC EXCISION & DECOMPRESSION,08,DISEASES AND DISORDERS OF THE MUSCULOSKELETAL SYSTEM AND CONNECTIVE TISSUE,2,Moderate,Minor,Surgical,Medicare,Medicare,Private Health Insurance,,,false,140883.64,21337.57
Long Island,Nassau,2908000,000511,NYU Langone Hospital-Long Island,18 to 29,117,M,White,Not Span/Hispanic,1,Elective,Home w/ Home Health Services,2019,MUS011,SPONDYLOPATHIES/SPONDYLOARTHROPATHY (INCLUDING INFECTIVE),MST016,VERTEBRAL DISCECTOMY,310,INTERVERTEBRAL DISC EXCISION & DECOMPRESSION,08,DISEASES AND DISORDERS OF THE MUSCULOSKELETAL SYSTEM AND CONNECTIVE TISSUE,1,Minor,Minor,Surgical,Miscellaneous/Other,,,,,false,61985.29,10022.99
Long Island,Nassau,2908000,000511,NYU Langone Hospital-Long Island,30 to 49,117,F,Other Race,Not Span/Hispanic,1,Emergency,Home or Self Care,2019,MUS011,SPONDYLOPATHIES/SPONDYLOARTHROPATHY (INCLUDING INFECTIVE),MST016,VERTEBRAL DISCECTOMY,310,INTERVERTEBRAL DISC EXCISION & DECOMPRESSION,08,DISEASES AND DISORDERS OF THE MUSCULOSKELETAL SYSTEM AND CONNECTIVE TISSUE,2,Moderate,Minor,Surgical,Medicaid,Medicaid,,,,true,108543.16,15081.89
Long Island,Nassau,2908000,000511,NYU Langone Hospital-Long Island,50 to 69,113,M,Other Race,Not Span/Hispanic,3,Emergency,Home w/ Home Health Services,2019,MUS011,SPONDYLOPATHIES/SPONDYLOARTHROPATHY (INCLUDING INFECTIVE),PNS001,LUMBOSACRAL NERVE DECOMPRESSION,310,INTERVERTEBRAL DISC EXCISION & DECOMPRESSION,08,DISEASES AND DISORDERS OF THE MUSCULOSKELETAL SYSTEM AND CONNECTIVE TISSUE,3,Major,Moderate,Surgical,Blue Cross/Blue Shield,,,,,true,187232.48,29451.47
Long Island,Nassau,2908000,000511,NYU Langone Hospital-Long Island,18 to 29,117,F,White,Not Span/Hispanic,2,Elective,Home w/ Home Health Services,2019,MUS011,SPONDYLOPATHIES/SPONDYLOARTHROPATHY (INCLUDING INFECTIVE),MST016,VERTEBRAL DISCECTOMY,310,INTERVERTEBRAL DISC EXCISION & DECOMPRESSION,08,DISEASES AND DISORDERS OF THE MUSCULOSKELETAL SYSTEM AND CONNECTIVE TISSUE,2,Moderate,Minor,Surgical,Blue Cross/Blue Shield,,,,,false,137020.42,20101.32
Long Island,Nassau,2908000,000511,NYU Langone Hospital-Long Island,70 or Older,115,F,White,Not Span/Hispanic,11,Emergency,Skilled Nursing Home,2019,MUS011,SPONDYLOPATHIES/SPONDYLOARTHROPATHY (INCLUDING INFECTIVE),CNS008,SPINAL CORD DECOMPRESSION,310,INTERVERTEBRAL DISC EXCISION & DECOMPRESSION,08,DISEASES AND DISORDERS OF THE MUSCULOSKELETAL SYSTEM AND CONNECTIVE TISSUE,3,Major,Moderate,Surgical,Medicare,Medicare,,,,true,187712.51,35414.34
Long Island,Nassau,2908000,000511,NYU Langone Hospital-Long Island,50 to 69,117,M,White,Not Span/Hispanic,3,Elective,Home w/ Home Health Services,2019,MUS011,SPONDYLOPATHIES/SPONDYLOARTHROPATHY (INCLUDING INFECTIVE),CNS008,SPINAL CORD DECOMPRESSION,310,INTERVERTEBRAL DISC EXCISION & DECOMPRESSION,08,DISEASES AND DISORDERS OF THE MUSCULOSKELETAL SYSTEM AND CONNECTIVE TISSUE,2,Moderate,Minor,Surgical,Private Health Insurance,,,,,false,135492.77,21148.41
Long Island,Nassau,2908000,000511,NYU Langone Hospital-Long Island,30 to 49,117,M,White,Not Span/Hispanic,1,Emergency,Home or Self Care,2019,MUS011,SPONDYLOPATHIES/SPONDYLOARTHROPATHY (INCLUDING INFECTIVE),MST016,VERTEBRAL DISCECTOMY,310,INTERVERTEBRAL DISC EXCISION & DECOMPRESSION,08,DISEASES AND DISORDERS OF THE MUSCULOSKELETAL SYSTEM AND CONNECTIVE TISSUE,1,Minor,Minor,Surgical,Private Health Insurance,,,,,true,100972.31,13283.62
Long Island,Nassau,2908000,000511,NYU Langone Hospital-Long Island,50 to 69,117,M,White,Not Span/Hispanic,2,Urgent,Home w/ Home Health Services,2019,MUS011,SPONDYLOPATHIES/SPONDYLOARTHROPATHY (INCLUDING INFECTIVE),PNS001,LUMBOSACRAL NERVE DECOMPRESSION,310,INTERVERTEBRAL DISC EXCISION & DECOMPRESSION,08,DISEASES AND DISORDERS OF THE MUSCULOSKELETAL SYSTEM AND CONNECTIVE TISSUE,2,Moderate,Minor,Surgical,Medicare,Medicare,,,,false,94171.65,15303.69
Long Island,Nassau,2908000,000511,NYU Langone Hospital-Long Island,50 to 69,113,M,White,Not Span/Hispanic,3,Urgent,Home w/ Home Health Services,2019,MUS011,SPONDYLOPATHIES/SPONDYLOARTHROPATHY (INCLUDING INFECTIVE),CNS008,SPINAL CORD DECOMPRESSION,310,INTERVERTEBRAL DISC EXCISION & DECOMPRESSION,08,DISEASES AND DISORDERS OF THE MUSCULOSKELETAL SYSTEM AND CONNECTIVE TISSUE,2,Moderate,Minor,Surgical,Blue Cross/Blue Shield,,,,,false,138342.76,21918.05
Long Island,Nassau,2908000,000511,NYU Langone Hospital-Long Island,70 or Older,117,M,White,Not Span/Hispanic,2,Urgent,Home w/ Home Health Services,2019,MUS011,SPONDYLOPATHIES/SPONDYLOARTHROPATHY (INCLUDING INFECTIVE),MST016,VERTEBRAL DISCECTOMY,310,INTERVERTEBRAL DISC EXCISION & DECOMPRESSION,08,DISEASES AND DISORDERS OF THE MUSCULOSKELETAL SYSTEM AND CONNECTIVE TISSUE,2,Moderate,Minor,Surgical,Medicare,Medicare,Private Health Insurance,,,false,124811.84,20155.53
Long Island,Nassau,2908000,000511,NYU Langone Hospital-Long Island,50 to 69,117,M,White,Not Span/Hispanic,13,Emergency,Home w/ Home Health Services,2019,NEO070,SECONDARY MALIGNANCIES,MST002,BONE AND JOINT BIOPSY,310,INTERVERTEBRAL DISC EXCISION & DECOMPRESSION,08,DISEASES AND DISORDERS OF THE MUSCULOSKELETAL SYSTEM AND CONNECTIVE TISSUE,3,Major,Major,Surgical,Blue Cross/Blue Shield,,,,,true,297547.02,48028.95
Long Island,Nassau,2908000,000511,NYU Langone Hospital-Long Island,50 to 69,117,F,White,Not Span/Hispanic,1,Urgent,Home or Self Care,2019,MUS011,SPONDYLOPATHIES/SPONDYLOARTHROPATHY (INCLUDING INFECTIVE),PNS001,LUMBOSACRAL NERVE DECOMPRESSION,310,INTERVERTEBRAL DISC EXCISION & DECOMPRESSION,08,DISEASES AND DISORDERS OF THE MUSCULOSKELETAL SYSTEM AND CONNECTIVE TISSUE,2,Moderate,Minor,Surgical,Medicare,Medicare,,,,false,98045.51,15499.52
Long Island,Nassau,2908000,000511,NYU Langone Hospital-Long Island,30 to 49,OOS,M,White,Not Span/Hispanic,2,Emergency,Home or Self Care,2019,MUS011,SPONDYLOPATHIES/SPONDYLOARTHROPATHY (INCLUDING INFECTIVE),MST016,VERTEBRAL DISCECTOMY,310,INTERVERTEBRAL DISC EXCISION & DECOMPRESSION,08,DISEASES AND DISORDERS OF THE MUSCULOSKELETAL SYSTEM AND CONNECTIVE TISSUE,1,Minor,Minor,Surgical,Blue Cross/Blue Shield,,,,,true,76601.86,12457.89
Long Island,Nassau,2908000,000511,NYU Langone Hospital-Long Island,50 to 69,113,M,White,Not Span/Hispanic,4,Emergency,Home w/ Home Health Services,2019,MUS011,SPONDYLOPATHIES/SPONDYLOARTHROPATHY (INCLUDING INFECTIVE),MST016,VERTEBRAL DISCECTOMY,310,INTERVERTEBRAL DISC EXCISION & DECOMPRESSION,08,DISEASES AND DISORDERS OF THE MUSCULOSKELETAL SYSTEM AND CONNECTIVE TISSUE,1,Minor,Minor,Surgical,Blue Cross/Blue Shield,,,,,true,113569.92,17673.15
Long Island,Nassau,2908000,000511,NYU Langone Hospital-Long Island,50 to 69,117,M,White,Not Span/Hispanic,3,Elective,Home w/ Home Health Services,2019,MUS011,SPONDYLOPATHIES/SPONDYLOARTHROPATHY (INCLUDING INFECTIVE),CNS008,SPINAL CORD DECOMPRESSION,310,INTERVERTEBRAL DISC EXCISION & DECOMPRESSION,08,DISEASES AND DISORDERS OF THE MUSCULOSKELETAL SYSTEM AND CONNECTIVE TISSUE,1,Minor,Minor,Surgical,Private Health Insurance,Medicare,Medicare,,,false,100998.65,17437.5
Long Island,Nassau,2908000,000511,NYU Langone Hospital-Long Island,50 to 69,115,F,Black/African American,Not Span/Hispanic,15,Emergency,Home w/ Home Health Services,2019,MUS007,OTHER SPECIFIED JOINT DISORDERS,MST016,VERTEBRAL DISCECTOMY,310,INTERVERTEBRAL DISC EXCISION & DECOMPRESSION,08,DISEASES AND DISORDERS OF THE MUSCULOSKELETAL SYSTEM AND CONNECTIVE TISSUE,2,Moderate,Minor,Surgical,Medicare,Medicare,,,,true,276752.58,49244.95
Long Island,Nassau,2908000,000511,NYU Langone Hospital-Long Island,50 to 69,115,M,White,Not Span/Hispanic,3,Emergency,Home w/ Home Health Services,2019,MUS011,SPONDYLOPATHIES/SPONDYLOARTHROPATHY (INCLUDING INFECTIVE),MST016,VERTEBRAL DISCECTOMY,310,INTERVERTEBRAL DISC EXCISION & DECOMPRESSION,08,DISEASES AND DISORDERS OF THE MUSCULOSKELETAL SYSTEM AND CONNECTIVE TISSUE,1,Minor,Moderate,Surgical,Blue Cross/Blue Shield,,,,,true,105091.4,15095.82
Long Island,Nassau,2908000,000511,NYU Langone Hospital-Long Island,50 to 69,117,F,White,Not Span/Hispanic,2,Elective,Home w/ Home Health Services,2019,MUS011,SPONDYLOPATHIES/SPONDYLOARTHROPATHY (INCLUDING INFECTIVE),CNS008,SPINAL CORD DECOMPRESSION,310,INTERVERTEBRAL DISC EXCISION & DECOMPRESSION,08,DISEASES AND DISORDERS OF THE MUSCULOSKELETAL SYSTEM AND CONNECTIVE TISSUE,2,Moderate,Minor,Surgical,Medicare,Medicare,,,,false,103493.08,16795.28
Long Island,Nassau,2908000,000511,NYU Langone Hospital-Long Island,30 to 49,117,F,White,Not Span/Hispanic,5,Elective,Home w/ Home Health Services,2019,MUS011,SPONDYLOPATHIES/SPONDYLOARTHROPATHY (INCLUDING INFECTIVE),MST016,VERTEBRAL DISCECTOMY,310,INTERVERTEBRAL DISC EXCISION & DECOMPRESSION,08,DISEASES AND DISORDERS OF THE MUSCULOSKELETAL SYSTEM AND CONNECTIVE TISSUE,2,Moderate,Minor,Surgical,Blue Cross/Blue Shield,Medicare,,,,false,114461.91,21018.57
Long Island,Nassau,2908000,000511,NYU Langone Hospital-Long Island,70 or Older,118,M,White,Not Span/Hispanic,7,Elective,Home w/ Home Health Services,2019,MUS011,SPONDYLOPATHIES/SPONDYLOARTHROPATHY (INCLUDING INFECTIVE),CNS008,SPINAL CORD DECOMPRESSION,310,INTERVERTEBRAL DISC EXCISION & DECOMPRESSION,08,DISEASES AND DISORDERS OF THE MUSCULOSKELETAL SYSTEM AND CONNECTIVE TISSUE,3,Major,Moderate,Surgical,Medicare,Medicare,,,,false,108274.65,21988.41
Long Island,Nassau,2908000,000511,NYU Langone Hospital-Long Island,50 to 69,115,M,White,Not Span/Hispanic,2,Urgent,Home w/ Home Health Services,2019,MUS011,SPONDYLOPATHIES/SPONDYLOARTHROPATHY (INCLUDING INFECTIVE),MST016,VERTEBRAL DISCECTOMY,310,INTERVERTEBRAL DISC EXCISION & DECOMPRESSION,08,DISEASES AND DISORDERS OF THE MUSCULOSKELETAL SYSTEM AND CONNECTIVE TISSUE,1,Minor,Minor,Surgical,Medicare,Medicare,,,,false,74241.87,12788.16
Long Island,Nassau,2908000,000511,NYU Langone Hospital-Long Island,70 or Older,117,M,White,Not Span/Hispanic,3,Elective,Home w/ Home Health Services,2019,MUS011,SPONDYLOPATHIES/SPONDYLOARTHROPATHY (INCLUDING INFECTIVE),PNS001,LUMBOSACRAL NERVE DECOMPRESSION,310,INTERVERTEBRAL DISC EXCISION & DECOMPRESSION,08,DISEASES AND DISORDERS OF THE MUSCULOSKELETAL SYSTEM AND CONNECTIVE TISSUE,3,Major,Minor,Surgical,Medicare,Medicare,,,,false,139391.93,23253.77
Long Island,Nassau,2908000,000511,NYU Langone Hospital-Long Island,70 or Older,115,M,White,Not Span/Hispanic,12,Emergency,Skilled Nursing Home,2019,MUS016,"STRESS FRACTURE, INITIAL ENCOUNTER",MST016,VERTEBRAL DISCECTOMY,310,INTERVERTEBRAL DISC EXCISION & DECOMPRESSION,08,DISEASES AND DISORDERS OF THE MUSCULOSKELETAL SYSTEM AND CONNECTIVE TISSUE,3,Major,Major,Surgical,Medicare,Medicare,Private Health Insurance,,,true,320706.4,50032.51
Long Island,Nassau,2908000,000511,NYU Langone Hospital-Long Island,70 or Older,117,M,White,Not Span/Hispanic,9,Emergency,Inpatient Rehabilitation Facility,2019,MUS011,SPONDYLOPATHIES/SPONDYLOARTHROPATHY (INCLUDING INFECTIVE),MST016,VERTEBRAL DISCECTOMY,310,INTERVERTEBRAL DISC EXCISION & DECOMPRESSION,08,DISEASES AND DISORDERS OF THE MUSCULOSKELETAL SYSTEM AND CONNECTIVE TISSUE,2,Moderate,Minor,Surgical,Medicare,Medicare,Private Health Insurance,,,true,192971.55,35043.46
Long Island,Nassau,2908000,000511,NYU Langone Hospital-Long Island,70 or Older,119,F,White,Not Span/Hispanic,4,Emergency,Home w/ Home Health Services,2019,MUS011,SPONDYLOPATHIES/SPONDYLOARTHROPATHY (INCLUDING INFECTIVE),PNS001,LUMBOSACRAL NERVE DECOMPRESSION,310,INTERVERTEBRAL DISC EXCISION & DECOMPRESSION,08,DISEASES AND DISORDERS OF THE MUSCULOSKELETAL SYSTEM AND CONNECTIVE TISSUE,2,Moderate,Moderate,Surgical,Private Health Insurance,Medicare,Medicare,,,true,146240.49,24501.18
Long Island,Nassau,2908000,000511,NYU Langone Hospital-Long Island,70 or Older,115,M,Black/African American,Not Span/Hispanic,2,Elective,Home w/ Home Health Services,2019,MUS011,SPONDYLOPATHIES/SPONDYLOARTHROPATHY (INCLUDING INFECTIVE),CNS008,SPINAL CORD DECOMPRESSION,310,INTERVERTEBRAL DISC EXCISION & DECOMPRESSION,08,DISEASES AND DISORDERS OF THE MUSCULOSKELETAL SYSTEM AND CONNECTIVE TISSUE,2,Moderate,Minor,Surgical,Blue Cross/Blue Shield,Medicare,Medicare,,,false,141900.12,23169.99
Long Island,Nassau,2908000,000511,NYU Langone Hospital-Long Island,30 to 49,117,M,White,Not Span/Hispanic,2,Emergency,Home w/ Home Health Services,2019,MUS011,SPONDYLOPATHIES/SPONDYLOARTHROPATHY (INCLUDING INFECTIVE),MST016,VERTEBRAL DISCECTOMY,310,INTERVERTEBRAL DISC EXCISION & DECOMPRESSION,08,DISEASES AND DISORDERS OF THE MUSCULOSKELETAL SYSTEM AND CONNECTIVE TISSUE,2,Moderate,Minor,Surgical,Private Health Insurance,,,,,true,86013.16,13299.28
Long Island,Nassau,2908000,000511,NYU Langone Hospital-Long Island,50 to 69,115,F,Black/African American,Not Span/Hispanic,1,Urgent,Home w/ Home Health Services,2019,MUS011,SPONDYLOPATHIES/SPONDYLOARTHROPATHY (INCLUDING INFECTIVE),MST016,VERTEBRAL DISCECTOMY,310,INTERVERTEBRAL DISC EXCISION & DECOMPRESSION,08,DISEASES AND DISORDERS OF THE MUSCULOSKELETAL SYSTEM AND CONNECTIVE TISSUE,1,Minor,Minor,Surgical,Federal/State/Local/VA,,,,,false,70799.9,11585.78
Long Island,Nassau,2908000,000511,NYU Langone Hospital-Long Island,30 to 49,111,F,White,Not Span/Hispanic,2,Elective,Home w/ Home Health Services,2019,MUS011,SPONDYLOPATHIES/SPONDYLOARTHROPATHY (INCLUDING INFECTIVE),MST016,VERTEBRAL DISCECTOMY,310,INTERVERTEBRAL DISC EXCISION & DECOMPRESSION,08,DISEASES AND DISORDERS OF THE MUSCULOSKELETAL SYSTEM AND CONNECTIVE TISSUE,2,Moderate,Minor,Surgical,Blue Cross/Blue Shield,,,,,false,136002.25,22193.38
Long Island,Nassau,2908000,000511,NYU Langone Hospital-Long Island,50 to 69,115,F,Other Race,Not Span/Hispanic,3,Urgent,Home w/ Home Health Services,2019,MUS011,SPONDYLOPATHIES/SPONDYLOARTHROPATHY (INCLUDING INFECTIVE),MST016,VERTEBRAL DISCECTOMY,310,INTERVERTEBRAL DISC EXCISION & DECOMPRESSION,08,DISEASES AND DISORDERS OF THE MUSCULOSKELETAL SYSTEM AND CONNECTIVE TISSUE,2,Moderate,Minor,Surgical,Medicare,Medicare,Private Health Insurance,,,false,95961.74,16938.84
Long Island,Nassau,2908000,000511,NYU Langone Hospital-Long Island,50 to 69,115,M,White,Not Span/Hispanic,2,Elective,Home w/ Home Health Services,2019,MUS011,SPONDYLOPATHIES/SPONDYLOARTHROPATHY (INCLUDING INFECTIVE),CNS008,SPINAL CORD DECOMPRESSION,310,INTERVERTEBRAL DISC EXCISION & DECOMPRESSION,08,DISEASES AND DISORDERS OF THE MUSCULOSKELETAL SYSTEM AND CONNECTIVE TISSUE,2,Moderate,Minor,Surgical,Private Health Insurance,,,,,false,130502.56,21272.61
Long Island,Nassau,2908000,000511,NYU Langone Hospital-Long Island,50 to 69,117,M,White,Not Span/Hispanic,2,Emergency,Home w/ Home Health Services,2019,MUS011,SPONDYLOPATHIES/SPONDYLOARTHROPATHY (INCLUDING INFECTIVE),MST016,VERTEBRAL DISCECTOMY,310,INTERVERTEBRAL DISC EXCISION & DECOMPRESSION,08,DISEASES AND DISORDERS OF THE MUSCULOSKELETAL SYSTEM AND CONNECTIVE TISSUE,2,Moderate,Minor,Surgical,Private Health Insurance,,,,,true,108142.57,16780.52
Long Island,Nassau,2908000,000511,NYU Langone Hospital-Long Island,70 or Older,115,M,White,Not Span/Hispanic,3,Elective,Home w/ Home Health Services,2019,MUS011,SPONDYLOPATHIES/SPONDYLOARTHROPATHY (INCLUDING INFECTIVE),MST016,VERTEBRAL DISCECTOMY,310,INTERVERTEBRAL DISC EXCISION & DECOMPRESSION,08,DISEASES AND DISORDERS OF THE MUSCULOSKELETAL SYSTEM AND CONNECTIVE TISSUE,1,Minor,Minor,Surgical,Private Health Insurance,Medicare,,,,false,139192.82,20004.74
Long Island,Nassau,2908000,000511,NYU Langone Hospital-Long Island,50 to 69,113,M,White,Not Span/Hispanic,2,Elective,Home w/ Home Health Services,2019,MUS011,SPONDYLOPATHIES/SPONDYLOARTHROPATHY (INCLUDING INFECTIVE),CNS008,SPINAL CORD DECOMPRESSION,310,INTERVERTEBRAL DISC EXCISION & DECOMPRESSION,08,DISEASES AND DISORDERS OF THE MUSCULOSKELETAL SYSTEM AND CONNECTIVE TISSUE,2,Moderate,Minor,Surgical,Private Health Insurance,,,,,false,64979.63,11067.19
Long Island,Nassau,2908000,000511,NYU Langone Hospital-Long Island,50 to 69,115,F,White,Not Span/Hispanic,4,Elective,Home w/ Home Health Services,2019,MUS011,SPONDYLOPATHIES/SPONDYLOARTHROPATHY (INCLUDING INFECTIVE),CNS008,SPINAL CORD DECOMPRESSION,310,INTERVERTEBRAL DISC EXCISION & DECOMPRESSION,08,DISEASES AND DISORDERS OF THE MUSCULOSKELETAL SYSTEM AND CONNECTIVE TISSUE,1,Minor,Minor,Surgical,Blue Cross/Blue Shield,Medicare,,,,false,99534.08,17636.07
Long Island,Nassau,2908000,000511,NYU Langone Hospital-Long Island,30 to 49,110,F,Black/African American,Not Span/Hispanic,1,Emergency,Home or Self Care,2019,MUS011,SPONDYLOPATHIES/SPONDYLOARTHROPATHY (INCLUDING INFECTIVE),MST016,VERTEBRAL DISCECTOMY,310,INTERVERTEBRAL DISC EXCISION & DECOMPRESSION,08,DISEASES AND DISORDERS OF THE MUSCULOSKELETAL SYSTEM AND CONNECTIVE TISSUE,1,Minor,Minor,Surgical,Blue Cross/Blue Shield,,,,,true,112221.87,17340.35
Long Island,Nassau,2908000,000511,NYU Langone Hospital-Long Island,50 to 69,OOS,M,White,Not Span/Hispanic,2,Elective,Home w/ Home Health Services,2019,MUS011,SPONDYLOPATHIES/SPONDYLOARTHROPATHY (INCLUDING INFECTIVE),CNS008,SPINAL CORD DECOMPRESSION,310,INTERVERTEBRAL DISC EXCISION & DECOMPRESSION,08,DISEASES AND DISORDERS OF THE MUSCULOSKELETAL SYSTEM AND CONNECTIVE TISSUE,2,Moderate,Minor,Surgical,Medicare,Medicare,,,,false,132134.27,18913.5
Long Island,Nassau,2908000,000511,NYU Langone Hospital-Long Island,70 or Older,115,F,White,Not Span/Hispanic,8,Elective,Home or Self Care,2019,MUS011,SPONDYLOPATHIES/SPONDYLOARTHROPATHY (INCLUDING INFECTIVE),PNS001,LUMBOSACRAL NERVE DECOMPRESSION,310,INTERVERTEBRAL DISC EXCISION & DECOMPRESSION,08,DISEASES AND DISORDERS OF THE MUSCULOSKELETAL SYSTEM AND CONNECTIVE TISSUE,2,Moderate,Moderate,Surgical,Medicare,Blue Cross/Blue Shield,,,,true,195750.54,29134.27
Long Island,Nassau,2908000,000511,NYU Langone Hospital-Long Island,30 to 49,117,F,White,Not Span/Hispanic,7,Elective,Home w/ Home Health Services,2019,MUS011,SPONDYLOPATHIES/SPONDYLOARTHROPATHY (INCLUDING INFECTIVE),PNS001,LUMBOSACRAL NERVE DECOMPRESSION,310,INTERVERTEBRAL DISC EXCISION & DECOMPRESSION,08,DISEASES AND DISORDERS OF THE MUSCULOSKELETAL SYSTEM AND CONNECTIVE TISSUE,2,Moderate,Minor,Surgical,Blue Cross/Blue Shield,,,,,false,162743.87,29209.02
Long Island,Nassau,2908000,000511,NYU Langone Hospital-Long Island,50 to 69,115,M,White,Not Span/Hispanic,2,Emergency,Home or Self Care,2019,MUS011,SPONDYLOPATHIES/SPONDYLOARTHROPATHY (INCLUDING INFECTIVE),MST016,VERTEBRAL DISCECTOMY,310,INTERVERTEBRAL DISC EXCISION & DECOMPRESSION,08,DISEASES AND DISORDERS OF THE MUSCULOSKELETAL SYSTEM AND CONNECTIVE TISSUE,1,Minor,Minor,Surgical,Private Health Insurance,,,,,true,89996.25,14673
Long Island,Nassau,2908000,000511,NYU Langone Hospital-Long Island,50 to 69,119,M,White,Not Span/Hispanic,1,Elective,Home w/ Home Health Services,2019,MUS011,SPONDYLOPATHIES/SPONDYLOARTHROPATHY (INCLUDING INFECTIVE),PNS001,LUMBOSACRAL NERVE DECOMPRESSION,310,INTERVERTEBRAL DISC EXCISION & DECOMPRESSION,08,DISEASES AND DISORDERS OF THE MUSCULOSKELETAL SYSTEM AND CONNECTIVE TISSUE,1,Minor,Minor,Surgical,Private Health Insurance,,,,,false,60844.05,9740.44
Long Island,Nassau,2908000,000511,NYU Langone Hospital-Long Island,50 to 69,115,M,White,Not Span/Hispanic,4,Elective,Home w/ Home Health Services,2019,MUS011,SPONDYLOPATHIES/SPONDYLOARTHROPATHY (INCLUDING INFECTIVE),PNS001,LUMBOSACRAL NERVE DECOMPRESSION,310,INTERVERTEBRAL DISC EXCISION & DECOMPRESSION,08,DISEASES AND DISORDERS OF THE MUSCULOSKELETAL SYSTEM AND CONNECTIVE TISSUE,2,Moderate,Moderate,Surgical,Blue Cross/Blue Shield,Medicare,,,,false,143399.9,20081.79
Long Island,Nassau,2908000,000511,NYU Langone Hospital-Long Island,18 to 29,115,F,White,Not Span/Hispanic,5,Emergency,Home w/ Home Health Services,2019,MUS011,SPONDYLOPATHIES/SPONDYLOARTHROPATHY (INCLUDING INFECTIVE),PNS001,LUMBOSACRAL NERVE DECOMPRESSION,310,INTERVERTEBRAL DISC EXCISION & DECOMPRESSION,08,DISEASES AND DISORDERS OF THE MUSCULOSKELETAL SYSTEM AND CONNECTIVE TISSUE,2,Moderate,Minor,Surgical,Private Health Insurance,,,,,true,109858.82,16974.46