Hospital Service Area,Hospital County,Operating Certificate Number,Permanent Facility Id,Facility Name,Age Group,Zip Code - 3 digits,Gender,Race,Ethnicity,Length of Stay,Type of Admission,Patient Disposition,Discharge Year,CCS Diagnosis Code,CCS Diagnosis Description,CCS Procedure Code,CCS Procedure Description,APR DRG Code,APR DRG Description,APR MDC Code,APR MDC Description,APR Severity of Illness Code,APR Severity of Illness Description,APR Risk of Mortality,APR Medical Surgical Description,Payment Typology 1,Payment Typology 2,Payment Typology 3,Birth Weight,Abortion Edit Indicator,Emergency Department Indicator,Total Charges,Total Costs
Long Island,Nassau,2908000,000511,NYU Langone Hospital-Long Island,50 to 69,113,F,White,Not Span/Hispanic,1,Elective,Home or Self Care,2020,MUS011,SPONDYLOPATHIES/SPONDYLOARTHROPATHY (INCLUDING INFECTIVE),CNS008,SPINAL CORD DECOMPRESSION,310,INTERVERTEBRAL DISC EXCISION & DECOMPRESSION,08,DISEASES AND DISORDERS OF THE MUSCULOSKELETAL SYSTEM AND CONNECTIVE TISSUE,2,Moderate,Minor,Surgical,Blue Cross/Blue Shield,,,,,N,88639.02,14294.08
Long Island,Nassau,2908000,000511,NYU Langone Hospital-Long Island,50 to 69,115,M,White,Not Span/Hispanic,1,Elective,Home w/ Home Health Services,2020,MUS011,SPONDYLOPATHIES/SPONDYLOARTHROPATHY (INCLUDING INFECTIVE),MST016,VERTEBRAL DISCECTOMY,310,INTERVERTEBRAL DISC EXCISION & DECOMPRESSION,08,DISEASES AND DISORDERS OF THE MUSCULOSKELETAL SYSTEM AND CONNECTIVE TISSUE,2,Moderate,Minor,Surgical,Private Health Insurance,,,,,N,61351.03,10718.02
Long Island,Nassau,2908000,000511,NYU Langone Hospital-Long Island,50 to 69,115,M,White,Not Span/Hispanic,2,Elective,Home w/ Home Health Services,2020,MUS011,SPONDYLOPATHIES/SPONDYLOARTHROPATHY (INCLUDING INFECTIVE),PNS001,LUMBOSACRAL NERVE DECOMPRESSION,310,INTERVERTEBRAL DISC EXCISION & DECOMPRESSION,08,DISEASES AND DISORDERS OF THE MUSCULOSKELETAL SYSTEM AND CONNECTIVE TISSUE,2,Moderate,Minor,Surgical,Blue Cross/Blue Shield,,,,,N,73269.27,14167.06
Long Island,Nassau,2908000,000511,NYU Langone Hospital-Long Island,50 to 69,113,M,Other Race,Not Span/Hispanic,6,Emergency,Home or Self Care,2020,MUS011,SPONDYLOPATHIES/SPONDYLOARTHROPATHY (INCLUDING INFECTIVE),MST016,VERTEBRAL DISCECTOMY,310,INTERVERTEBRAL DISC EXCISION & DECOMPRESSION,08,DISEASES AND DISORDERS OF THE MUSCULOSKELETAL SYSTEM AND CONNECTIVE TISSUE,1,Minor,Minor,Surgical,Miscellaneous/Other,,,,,Y,165565.23,33233.59
Long Island,Nassau,2908000,000511,NYU Langone Hospital-Long Island,50 to 69,118,M,White,Not Span/Hispanic,5,Elective,Home w/ Home Health Services,2020,MUS011,SPONDYLOPATHIES/SPONDYLOARTHROPATHY (INCLUDING INFECTIVE),CNS008,SPINAL CORD DECOMPRESSION,310,INTERVERTEBRAL DISC EXCISION & DECOMPRESSION,08,DISEASES AND DISORDERS OF THE MUSCULOSKELETAL SYSTEM AND CONNECTIVE TISSUE,2,Moderate,Minor,Surgical,Medicare,,,,,N,145049.48,43768.33
Long Island,Nassau,2908000,000511,NYU Langone Hospital-Long Island,50 to 69,115,M,White,Not Span/Hispanic,4,Emergency,Home w/ Home Health Services,2020,MUS011,SPONDYLOPATHIES/SPONDYLOARTHROPATHY (INCLUDING INFECTIVE),PNS001,LUMBOSACRAL NERVE DECOMPRESSION,310,INTERVERTEBRAL DISC EXCISION & DECOMPRESSION,08,DISEASES AND DISORDERS OF THE MUSCULOSKELETAL SYSTEM AND CONNECTIVE TISSUE,1,Minor,Minor,Surgical,Private Health Insurance,,,,,Y,124517.8,25206.57
Long Island,Nassau,2908000,000511,NYU Langone Hospital-Long Island,50 to 69,110,F,White,Not Span/Hispanic,2,Elective,Home w/ Home Health Services,2020,MUS011,SPONDYLOPATHIES/SPONDYLOARTHROPATHY (INCLUDING INFECTIVE),MST016,VERTEBRAL DISCECTOMY,310,INTERVERTEBRAL DISC EXCISION & DECOMPRESSION,08,DISEASES AND DISORDERS OF THE MUSCULOSKELETAL SYSTEM AND CONNECTIVE TISSUE,2,Moderate,Minor,Surgical,Blue Cross/Blue Shield,,,,,N,69303.77,13574.46
Long Island,Nassau,2908000,000511,NYU Langone Hospital-Long Island,50 to 69,115,F,White,Not Span/Hispanic,2,Elective,Home w/ Home Health Services,2020,MUS011,SPONDYLOPATHIES/SPONDYLOARTHROPATHY (INCLUDING INFECTIVE),MST016,VERTEBRAL DISCECTOMY,310,INTERVERTEBRAL DISC EXCISION & DECOMPRESSION,08,DISEASES AND DISORDERS OF THE MUSCULOSKELETAL SYSTEM AND CONNECTIVE TISSUE,2,Moderate,Minor,Surgical,Blue Cross/Blue Shield,,,,,N,71518.78,13828.62
Long Island,Nassau,2908000,000511,NYU Langone Hospital-Long Island,70 or Older,113,M,White,Not Span/Hispanic,9,Emergency,Home w/ Home Health Services,2020,MUS011,SPONDYLOPATHIES/SPONDYLOARTHROPATHY (INCLUDING INFECTIVE),CNS008,SPINAL CORD DECOMPRESSION,310,INTERVERTEBRAL DISC EXCISION & DECOMPRESSION,08,DISEASES AND DISORDERS OF THE MUSCULOSKELETAL SYSTEM AND CONNECTIVE TISSUE,2,Moderate,Moderate,Surgical,Private Health Insurance,Medicare,,,,Y,245411.13,62119.05
Long Island,Nassau,2908000,000511,NYU Langone Hospital-Long Island,50 to 69,115,F,Black/African American,Not Span/Hispanic,1,Elective,Home or Self Care,2020,MUS011,SPONDYLOPATHIES/SPONDYLOARTHROPATHY (INCLUDING INFECTIVE),CNS008,SPINAL CORD DECOMPRESSION,310,INTERVERTEBRAL DISC EXCISION & DECOMPRESSION,08,DISEASES AND DISORDERS OF THE MUSCULOSKELETAL SYSTEM AND CONNECTIVE TISSUE,1,Minor,Minor,Surgical,Miscellaneous/Other,,,,,N,98635.94,15634.64
Long Island,Nassau,2908000,000511,NYU Langone Hospital-Long Island,50 to 69,110,M,Other Race,Not Span/Hispanic,6,Emergency,Home w/ Home Health Services,2020,MUS011,SPONDYLOPATHIES/SPONDYLOARTHROPATHY (INCLUDING INFECTIVE),MST016,VERTEBRAL DISCECTOMY,310,INTERVERTEBRAL DISC EXCISION & DECOMPRESSION,08,DISEASES AND DISORDERS OF THE MUSCULOSKELETAL SYSTEM AND CONNECTIVE TISSUE,1,Minor,Minor,Surgical,Medicaid,,,,,Y,119374.64,28107.17
Long Island,Nassau,2908000,000511,NYU Langone Hospital-Long Island,30 to 49,113,M,Other Race,Not Span/Hispanic,3,Elective,Home w/ Home Health Services,2020,MUS011,SPONDYLOPATHIES/SPONDYLOARTHROPATHY (INCLUDING INFECTIVE),CNS008,SPINAL CORD DECOMPRESSION,310,INTERVERTEBRAL DISC EXCISION & DECOMPRESSION,08,DISEASES AND DISORDERS OF THE MUSCULOSKELETAL SYSTEM AND CONNECTIVE TISSUE,2,Moderate,Minor,Surgical,Blue Cross/Blue Shield,,,,,N,126431.96,23472.22
Long Island,Nassau,2908000,000511,NYU Langone Hospital-Long Island,50 to 69,117,F,White,Not Span/Hispanic,4,Elective,Home w/ Home Health Services,2020,MUS011,SPONDYLOPATHIES/SPONDYLOARTHROPATHY (INCLUDING INFECTIVE),MST016,VERTEBRAL DISCECTOMY,310,INTERVERTEBRAL DISC EXCISION & DECOMPRESSION,08,DISEASES AND DISORDERS OF THE MUSCULOSKELETAL SYSTEM AND CONNECTIVE TISSUE,1,Minor,Minor,Surgical,Blue Cross/Blue Shield,,,,,N,106186.61,22158.84
Long Island,Nassau,2908000,000511,NYU Langone Hospital-Long Island,30 to 49,115,M,White,Not Span/Hispanic,8,Emergency,Home w/ Home Health Services,2020,MUS011,SPONDYLOPATHIES/SPONDYLOARTHROPATHY (INCLUDING INFECTIVE),MST016,VERTEBRAL DISCECTOMY,310,INTERVERTEBRAL DISC EXCISION & DECOMPRESSION,08,DISEASES AND DISORDERS OF THE MUSCULOSKELETAL SYSTEM AND CONNECTIVE TISSUE,1,Minor,Minor,Surgical,Blue Cross/Blue Shield,,,,,Y,149870.57,36372.4
Long Island,Nassau,2908000,000511,NYU Langone Hospital-Long Island,30 to 49,115,F,Other Race,Not Span/Hispanic,6,Emergency,Home w/ Home Health Services,2020,MUS011,SPONDYLOPATHIES/SPONDYLOARTHROPATHY (INCLUDING INFECTIVE),MST016,VERTEBRAL DISCECTOMY,310,INTERVERTEBRAL DISC EXCISION & DECOMPRESSION,08,DISEASES AND DISORDERS OF THE MUSCULOSKELETAL SYSTEM AND CONNECTIVE TISSUE,1,Minor,Minor,Surgical,Blue Cross/Blue Shield,,,,,Y,140762.77,29690.91
Long Island,Nassau,2908000,000511,NYU Langone Hospital-Long Island,50 to 69,,M,White,Not Span/Hispanic,1,Elective,Home or Self Care,2020,MUS011,SPONDYLOPATHIES/SPONDYLOARTHROPATHY (INCLUDING INFECTIVE),MST016,VERTEBRAL DISCECTOMY,310,INTERVERTEBRAL DISC EXCISION & DECOMPRESSION,08,DISEASES AND DISORDERS OF THE MUSCULOSKELETAL SYSTEM AND CONNECTIVE TISSUE,1,Minor,Minor,Surgical,Private Health Insurance,Blue Cross/Blue Shield,,,,N,90226.76,14385.28
Long Island,Nassau,2908000,000511,NYU Langone Hospital-Long Island,30 to 49,110,M,Black/African American,Not Span/Hispanic,4,Emergency,Home w/ Home Health Services,2020,INJ007,"DISLOCATIONS, INITIAL ENCOUNTER",MST016,VERTEBRAL DISCECTOMY,310,INTERVERTEBRAL DISC EXCISION & DECOMPRESSION,08,DISEASES AND DISORDERS OF THE MUSCULOSKELETAL SYSTEM AND CONNECTIVE TISSUE,2,Moderate,Minor,Surgical,Self-Pay,,,,,Y,189351.35,28503.28
Long Island,Nassau,2908000,000511,NYU Langone Hospital-Long Island,50 to 69,115,M,White,Not Span/Hispanic,2,Elective,Home w/ Home Health Services,2020,MUS011,SPONDYLOPATHIES/SPONDYLOARTHROPATHY (INCLUDING INFECTIVE),MST018,BONE EXCISION,310,INTERVERTEBRAL DISC EXCISION & DECOMPRESSION,08,DISEASES AND DISORDERS OF THE MUSCULOSKELETAL SYSTEM AND CONNECTIVE TISSUE,1,Minor,Minor,Surgical,Blue Cross/Blue Shield,Medicare,,,,N,101025.33,18150.2
Long Island,Nassau,2908000,000511,NYU Langone Hospital-Long Island,50 to 69,117,M,White,Not Span/Hispanic,1,Elective,Home w/ Home Health Services,2020,MUS011,SPONDYLOPATHIES/SPONDYLOARTHROPATHY (INCLUDING INFECTIVE),MST016,VERTEBRAL DISCECTOMY,310,INTERVERTEBRAL DISC EXCISION & DECOMPRESSION,08,DISEASES AND DISORDERS OF THE MUSCULOSKELETAL SYSTEM AND CONNECTIVE TISSUE,2,Moderate,Minor,Surgical,Blue Cross/Blue Shield,,,,,N,98106.94,15243.91
Long Island,Nassau,2908000,000511,NYU Langone Hospital-Long Island,70 or Older,117,M,White,Not Span/Hispanic,4,Emergency,Home w/ Home Health Services,2020,NEO070,SECONDARY MALIGNANCIES,MST029,"MUSCULOSKELETAL DEVICE PROCEDURES, NEC",310,INTERVERTEBRAL DISC EXCISION & DECOMPRESSION,08,DISEASES AND DISORDERS OF THE MUSCULOSKELETAL SYSTEM AND CONNECTIVE TISSUE,2,Moderate,Moderate,Surgical,Blue Cross/Blue Shield,Medicare,Private Health Insurance,,,Y,152836.25,32491.57
Long Island,Nassau,2908000,000511,NYU Langone Hospital-Long Island,30 to 49,117,M,White,Not Span/Hispanic,2,Elective,Home w/ Home Health Services,2020,MUS011,SPONDYLOPATHIES/SPONDYLOARTHROPATHY (INCLUDING INFECTIVE),MST016,VERTEBRAL DISCECTOMY,310,INTERVERTEBRAL DISC EXCISION & DECOMPRESSION,08,DISEASES AND DISORDERS OF THE MUSCULOSKELETAL SYSTEM AND CONNECTIVE TISSUE,1,Minor,Minor,Surgical,Private Health Insurance,,,,,N,74820.24,16378.97
Long Island,Nassau,2908000,000511,NYU Langone Hospital-Long Island,50 to 69,113,M,White,Not Span/Hispanic,6,Emergency,Home or Self Care,2020,MUS011,SPONDYLOPATHIES/SPONDYLOARTHROPATHY (INCLUDING INFECTIVE),MST016,VERTEBRAL DISCECTOMY,310,INTERVERTEBRAL DISC EXCISION & DECOMPRESSION,08,DISEASES AND DISORDERS OF THE MUSCULOSKELETAL SYSTEM AND CONNECTIVE TISSUE,2,Moderate,Minor,Surgical,Blue Cross/Blue Shield,,,,,Y,140981.19,36909.09
Long Island,Nassau,2908000,000511,NYU Langone Hospital-Long Island,50 to 69,115,M,White,Not Span/Hispanic,5,Emergency,Home w/ Home Health Services,2020,MUS011,SPONDYLOPATHIES/SPONDYLOARTHROPATHY (INCLUDING INFECTIVE),CNS008,SPINAL CORD DECOMPRESSION,310,INTERVERTEBRAL DISC EXCISION & DECOMPRESSION,08,DISEASES AND DISORDERS OF THE MUSCULOSKELETAL SYSTEM AND CONNECTIVE TISSUE,1,Minor,Minor,Surgical,Blue Cross/Blue Shield,Medicare,Blue Cross/Blue Shield,,,Y,143887.04,33815.12
Long Island,Nassau,2908000,000511,NYU Langone Hospital-Long Island,70 or Older,115,F,Black/African American,Not Span/Hispanic,19,Emergency,Skilled Nursing Home,2020,MUS016,"STRESS FRACTURE, INITIAL ENCOUNTER",MST029,"MUSCULOSKELETAL DEVICE PROCEDURES, NEC",310,INTERVERTEBRAL DISC EXCISION & DECOMPRESSION,08,DISEASES AND DISORDERS OF THE MUSCULOSKELETAL SYSTEM AND CONNECTIVE TISSUE,3,Major,Major,Surgical,Medicare,,,,,Y,315776.27,101255.11
Long Island,Nassau,2908000,000511,NYU Langone Hospital-Long Island,70 or Older,117,M,White,Not Span/Hispanic,2,Elective,Home w/ Home Health Services,2020,MUS011,SPONDYLOPATHIES/SPONDYLOARTHROPATHY (INCLUDING INFECTIVE),CNS008,SPINAL CORD DECOMPRESSION,310,INTERVERTEBRAL DISC EXCISION & DECOMPRESSION,08,DISEASES AND DISORDERS OF THE MUSCULOSKELETAL SYSTEM AND CONNECTIVE TISSUE,2,Moderate,Moderate,Surgical,Medicare,Blue Cross/Blue Shield,,,,N,175465.14,30331.01
Long Island,Nassau,2908000,000511,NYU Langone Hospital-Long Island,50 to 69,114,F,Black/African American,Not Span/Hispanic,13,Emergency,Home w/ Home Health Services,2020,MUS011,SPONDYLOPATHIES/SPONDYLOARTHROPATHY (INCLUDING INFECTIVE),MST012,BONE FIXATION (EXCLUDING EXTREMITIES),310,INTERVERTEBRAL DISC EXCISION & DECOMPRESSION,08,DISEASES AND DISORDERS OF THE MUSCULOSKELETAL SYSTEM AND CONNECTIVE TISSUE,1,Minor,Minor,Surgical,Miscellaneous/Other,,,,,Y,507337.3,109594.1
Long Island,Nassau,2908000,000511,NYU Langone Hospital-Long Island,18 to 29,117,F,White,Not Span/Hispanic,6,Emergency,Home w/ Home Health Services,2020,MUS011,SPONDYLOPATHIES/SPONDYLOARTHROPATHY (INCLUDING INFECTIVE),MST016,VERTEBRAL DISCECTOMY,310,INTERVERTEBRAL DISC EXCISION & DECOMPRESSION,08,DISEASES AND DISORDERS OF THE MUSCULOSKELETAL SYSTEM AND CONNECTIVE TISSUE,2,Moderate,Minor,Surgical,Private Health Insurance,,,,,Y,192117.05,44180.89
Long Island,Nassau,2908000,000511,NYU Langone Hospital-Long Island,30 to 49,117,M,White,Not Span/Hispanic,7,Emergency,Home w/ Home Health Services,2020,MUS011,SPONDYLOPATHIES/SPONDYLOARTHROPATHY (INCLUDING INFECTIVE),PNS001,LUMBOSACRAL NERVE DECOMPRESSION,310,INTERVERTEBRAL DISC EXCISION & DECOMPRESSION,08,DISEASES AND DISORDERS OF THE MUSCULOSKELETAL SYSTEM AND CONNECTIVE TISSUE,1,Minor,Minor,Surgical,Blue Cross/Blue Shield,,,,,Y,155446.74,43665.13
Long Island,Nassau,2908000,000511,NYU Langone Hospital-Long Island,70 or Older,115,F,White,Not Span/Hispanic,6,Elective,Skilled Nursing Home,2020,MUS011,SPONDYLOPATHIES/SPONDYLOARTHROPATHY (INCLUDING INFECTIVE),CNS008,SPINAL CORD DECOMPRESSION,310,INTERVERTEBRAL DISC EXCISION & DECOMPRESSION,08,DISEASES AND DISORDERS OF THE MUSCULOSKELETAL SYSTEM AND CONNECTIVE TISSUE,2,Moderate,Minor,Surgical,Medicare,,,,,N,153176.42,38653.93
Long Island,Nassau,2908000,000511,NYU Langone Hospital-Long Island,30 to 49,115,M,White,Not Span/Hispanic,1,Emergency,Home or Self Care,2020,MUS011,SPONDYLOPATHIES/SPONDYLOARTHROPATHY (INCLUDING INFECTIVE),MST016,VERTEBRAL DISCECTOMY,310,INTERVERTEBRAL DISC EXCISION & DECOMPRESSION,08,DISEASES AND DISORDERS OF THE MUSCULOSKELETAL SYSTEM AND CONNECTIVE TISSUE,1,Minor,Minor,Surgical,Private Health Insurance,,,,,Y,125964.45,21917.89
Long Island,Nassau,2908000,000511,NYU Langone Hospital-Long Island,30 to 49,117,F,White,Not Span/Hispanic,7,Emergency,Home w/ Home Health Services,2020,MUS011,SPONDYLOPATHIES/SPONDYLOARTHROPATHY (INCLUDING INFECTIVE),MST016,VERTEBRAL DISCECTOMY,310,INTERVERTEBRAL DISC EXCISION & DECOMPRESSION,08,DISEASES AND DISORDERS OF THE MUSCULOSKELETAL SYSTEM AND CONNECTIVE TISSUE,1,Minor,Minor,Surgical,Blue Cross/Blue Shield,,,,,Y,185194.88,45954.84
Long Island,Nassau,2908000,000511,NYU Langone Hospital-Long Island,70 or Older,115,F,Black/African American,Not Span/Hispanic,40,Emergency,Hospice - Medical Facility,2020,NEO070,SECONDARY MALIGNANCIES,CNS008,SPINAL CORD DECOMPRESSION,310,INTERVERTEBRAL DISC EXCISION & DECOMPRESSION,08,DISEASES AND DISORDERS OF THE MUSCULOSKELETAL SYSTEM AND CONNECTIVE TISSUE,4,Extreme,Major,Surgical,Medicare,Medicaid,,,,Y,1262317.37,302108.08
Long Island,Nassau,2908000,000511,NYU Langone Hospital-Long Island,50 to 69,,F,Black/African American,Spanish/Hispanic,1,Elective,Home or Self Care,2020,MUS011,SPONDYLOPATHIES/SPONDYLOARTHROPATHY (INCLUDING INFECTIVE),MST016,VERTEBRAL DISCECTOMY,310,INTERVERTEBRAL DISC EXCISION & DECOMPRESSION,08,DISEASES AND DISORDERS OF THE MUSCULOSKELETAL SYSTEM AND CONNECTIVE TISSUE,2,Moderate,Moderate,Surgical,Medicare,Medicaid,,,,N,79354.22,13351.77
Long Island,Nassau,2908000,000511,NYU Langone Hospital-Long Island,30 to 49,115,F,White,Not Span/Hispanic,2,Elective,Home w/ Home Health Services,2020,MUS011,SPONDYLOPATHIES/SPONDYLOARTHROPATHY (INCLUDING INFECTIVE),CNS008,SPINAL CORD DECOMPRESSION,310,INTERVERTEBRAL DISC EXCISION & DECOMPRESSION,08,DISEASES AND DISORDERS OF THE MUSCULOSKELETAL SYSTEM AND CONNECTIVE TISSUE,1,Minor,Minor,Surgical,Private Health Insurance,,,,,N,84881.92,17923.89
Long Island,Nassau,2908000,000511,NYU Langone Hospital-Long Island,70 or Older,110,F,White,Not Span/Hispanic,12,Elective,Skilled Nursing Home,2020,MUS011,SPONDYLOPATHIES/SPONDYLOARTHROPATHY (INCLUDING INFECTIVE),CNS008,SPINAL CORD DECOMPRESSION,310,INTERVERTEBRAL DISC EXCISION & DECOMPRESSION,08,DISEASES AND DISORDERS OF THE MUSCULOSKELETAL SYSTEM AND CONNECTIVE TISSUE,2,Moderate,Minor,Surgical,Medicare,Medicare,,,,N,410307.06,98150.09
Long Island,Nassau,2908000,000511,NYU Langone Hospital-Long Island,30 to 49,117,F,White,Not Span/Hispanic,4,Elective,Home w/ Home Health Services,2020,MUS011,SPONDYLOPATHIES/SPONDYLOARTHROPATHY (INCLUDING INFECTIVE),MST016,VERTEBRAL DISCECTOMY,310,INTERVERTEBRAL DISC EXCISION & DECOMPRESSION,08,DISEASES AND DISORDERS OF THE MUSCULOSKELETAL SYSTEM AND CONNECTIVE TISSUE,2,Moderate,Minor,Surgical,Blue Cross/Blue Shield,,,,,N,126987.23,28141.54
Long Island,Nassau,2908000,000511,NYU Langone Hospital-Long Island,30 to 49,115,F,Black/African American,Not Span/Hispanic,6,Emergency,Home w/ Home Health Services,2020,MUS011,SPONDYLOPATHIES/SPONDYLOARTHROPATHY (INCLUDING INFECTIVE),PNS001,LUMBOSACRAL NERVE DECOMPRESSION,310,INTERVERTEBRAL DISC EXCISION & DECOMPRESSION,08,DISEASES AND DISORDERS OF THE MUSCULOSKELETAL SYSTEM AND CONNECTIVE TISSUE,2,Moderate,Minor,Surgical,Blue Cross/Blue Shield,Medicare,,,,Y,199167.32,44317.95
Long Island,Nassau,2908000,000511,NYU Langone Hospital-Long Island,18 to 29,117,M,White,Not Span/Hispanic,3,Emergency,Home w/ Home Health Services,2020,MUS011,SPONDYLOPATHIES/SPONDYLOARTHROPATHY (INCLUDING INFECTIVE),MST016,VERTEBRAL DISCECTOMY,310,INTERVERTEBRAL DISC EXCISION & DECOMPRESSION,08,DISEASES AND DISORDERS OF THE MUSCULOSKELETAL SYSTEM AND CONNECTIVE TISSUE,1,Minor,Minor,Surgical,Private Health Insurance,,,,,Y,161740.72,29783.05
Long Island,Nassau,2908000,000511,NYU Langone Hospital-Long Island,50 to 69,115,M,White,Not Span/Hispanic,2,Elective,Home or Self Care,2020,MUS011,SPONDYLOPATHIES/SPONDYLOARTHROPATHY (INCLUDING INFECTIVE),PNS001,LUMBOSACRAL NERVE DECOMPRESSION,310,INTERVERTEBRAL DISC EXCISION & DECOMPRESSION,08,DISEASES AND DISORDERS OF THE MUSCULOSKELETAL SYSTEM AND CONNECTIVE TISSUE,1,Minor,Minor,Surgical,Medicare,,,,,N,93755.36,18874.5
Long Island,Nassau,2908000,000511,NYU Langone Hospital-Long Island,50 to 69,115,M,White,Not Span/Hispanic,1,Elective,Home or Self Care,2020,MUS011,SPONDYLOPATHIES/SPONDYLOARTHROPATHY (INCLUDING INFECTIVE),CNS008,SPINAL CORD DECOMPRESSION,310,INTERVERTEBRAL DISC EXCISION & DECOMPRESSION,08,DISEASES AND DISORDERS OF THE MUSCULOSKELETAL SYSTEM AND CONNECTIVE TISSUE,2,Moderate,Minor,Surgical,Private Health Insurance,,,,,N,105063.14,17632.46
Long Island,Nassau,2908000,000511,NYU Langone Hospital-Long Island,30 to 49,117,M,White,Not Span/Hispanic,1,Elective,Home or Self Care,2020,MUS011,SPONDYLOPATHIES/SPONDYLOARTHROPATHY (INCLUDING INFECTIVE),MST016,VERTEBRAL DISCECTOMY,310,INTERVERTEBRAL DISC EXCISION & DECOMPRESSION,08,DISEASES AND DISORDERS OF THE MUSCULOSKELETAL SYSTEM AND CONNECTIVE TISSUE,1,Minor,Minor,Surgical,Private Health Insurance,,,,,N,65377.39,12234.02
Long Island,Nassau,2908000,000511,NYU Langone Hospital-Long Island,70 or Older,110,F,White,Not Span/Hispanic,5,Emergency,Home or Self Care,2020,MUS002,OSTEOMYELITIS,MST016,VERTEBRAL DISCECTOMY,310,INTERVERTEBRAL DISC EXCISION & DECOMPRESSION,08,DISEASES AND DISORDERS OF THE MUSCULOSKELETAL SYSTEM AND CONNECTIVE TISSUE,3,Major,Moderate,Surgical,Medicare,Blue Cross/Blue Shield,,,,Y,122316.08,29224.74
Long Island,Nassau,2908000,000511,NYU Langone Hospital-Long Island,50 to 69,115,M,White,Not Span/Hispanic,5,Elective,Skilled Nursing Home,2020,MUS011,SPONDYLOPATHIES/SPONDYLOARTHROPATHY (INCLUDING INFECTIVE),CNS008,SPINAL CORD DECOMPRESSION,310,INTERVERTEBRAL DISC EXCISION & DECOMPRESSION,08,DISEASES AND DISORDERS OF THE MUSCULOSKELETAL SYSTEM AND CONNECTIVE TISSUE,2,Moderate,Moderate,Surgical,Medicare,Medicare,,,,N,202634.69,43046.85
Long Island,Nassau,2908000,000511,NYU Langone Hospital-Long Island,50 to 69,117,F,White,Not Span/Hispanic,2,Elective,Home w/ Home Health Services,2020,MUS011,SPONDYLOPATHIES/SPONDYLOARTHROPATHY (INCLUDING INFECTIVE),CNS008,SPINAL CORD DECOMPRESSION,310,INTERVERTEBRAL DISC EXCISION & DECOMPRESSION,08,DISEASES AND DISORDERS OF THE MUSCULOSKELETAL SYSTEM AND CONNECTIVE TISSUE,2,Moderate,Minor,Surgical,Blue Cross/Blue Shield,,,,,N,120129.79,22863.41
Long Island,Nassau,2908000,000511,NYU Langone Hospital-Long Island,70 or Older,115,M,White,Not Span/Hispanic,5,Emergency,Inpatient Rehabilitation Facility,2020,MUS011,SPONDYLOPATHIES/SPONDYLOARTHROPATHY (INCLUDING INFECTIVE),MST016,VERTEBRAL DISCECTOMY,310,INTERVERTEBRAL DISC EXCISION & DECOMPRESSION,08,DISEASES AND DISORDERS OF THE MUSCULOSKELETAL SYSTEM AND CONNECTIVE TISSUE,1,Minor,Minor,Surgical,Private Health Insurance,Medicare,,,,Y,137813.8,32729.26
Long Island,Nassau,2908000,000511,NYU Langone Hospital-Long Island,50 to 69,110,M,White,Not Span/Hispanic,3,Emergency,Home or Self Care,2020,MUS011,SPONDYLOPATHIES/SPONDYLOARTHROPATHY (INCLUDING INFECTIVE),MST016,VERTEBRAL DISCECTOMY,310,INTERVERTEBRAL DISC EXCISION & DECOMPRESSION,08,DISEASES AND DISORDERS OF THE MUSCULOSKELETAL SYSTEM AND CONNECTIVE TISSUE,1,Minor,Minor,Surgical,Private Health Insurance,,,,,Y,98738.85,22605.79
Long Island,Nassau,2908000,000511,NYU Langone Hospital-Long Island,50 to 69,115,M,Black/African American,Not Span/Hispanic,12,Emergency,Home w/ Home Health Services,2020,MUS011,SPONDYLOPATHIES/SPONDYLOARTHROPATHY (INCLUDING INFECTIVE),CNS008,SPINAL CORD DECOMPRESSION,310,INTERVERTEBRAL DISC EXCISION & DECOMPRESSION,08,DISEASES AND DISORDERS OF THE MUSCULOSKELETAL SYSTEM AND CONNECTIVE TISSUE,2,Moderate,Minor,Surgical,Blue Cross/Blue Shield,,,,,Y,283167.85,71803.69
Long Island,Nassau,2908000,000511,NYU Langone Hospital-Long Island,50 to 69,115,M,White,Not Span/Hispanic,3,Elective,Home w/ Home Health Services,2020,MUS011,SPONDYLOPATHIES/SPONDYLOARTHROPATHY (INCLUDING INFECTIVE),CNS008,SPINAL CORD DECOMPRESSION,310,INTERVERTEBRAL DISC EXCISION & DECOMPRESSION,08,DISEASES AND DISORDERS OF THE MUSCULOSKELETAL SYSTEM AND CONNECTIVE TISSUE,1,Minor,Minor,Surgical,Blue Cross/Blue Shield,,,,,N,138630.5,28352.85
Long Island,Nassau,2908000,000511,NYU Langone Hospital-Long Island,50 to 69,,F,Multi-racial,Not Span/Hispanic,2,Emergency,Home w/ Home Health Services,2020,MUS011,SPONDYLOPATHIES/SPONDYLOARTHROPATHY (INCLUDING INFECTIVE),MST016,VERTEBRAL DISCECTOMY,310,INTERVERTEBRAL DISC EXCISION & DECOMPRESSION,08,DISEASES AND DISORDERS OF THE MUSCULOSKELETAL SYSTEM AND CONNECTIVE TISSUE,1,Minor,Minor,Surgical,Medicaid,,,,,Y,134865.21,22825.25
Long Island,Nassau,2908000,000511,NYU Langone Hospital-Long Island,30 to 49,110,F,White,Not Span/Hispanic,4,Emergency,Home or Self Care,2020,MUS011,SPONDYLOPATHIES/SPONDYLOARTHROPATHY (INCLUDING INFECTIVE),PNS001,LUMBOSACRAL NERVE DECOMPRESSION,310,INTERVERTEBRAL DISC EXCISION & DECOMPRESSION,08,DISEASES AND DISORDERS OF THE MUSCULOSKELETAL SYSTEM AND CONNECTIVE TISSUE,1,Minor,Moderate,Surgical,Medicaid,,,,,Y,135612.3,29561.26
Long Island,Nassau,2908000,000511,NYU Langone Hospital-Long Island,50 to 69,110,M,White,Not Span/Hispanic,6,Elective,Home w/ Home Health Services,2020,MUS011,SPONDYLOPATHIES/SPONDYLOARTHROPATHY (INCLUDING INFECTIVE),CNS008,SPINAL CORD DECOMPRESSION,310,INTERVERTEBRAL DISC EXCISION & DECOMPRESSION,08,DISEASES AND DISORDERS OF THE MUSCULOSKELETAL SYSTEM AND CONNECTIVE TISSUE,2,Moderate,Minor,Surgical,Medicare,Blue Cross/Blue Shield,,,,N,225717.78,49822.89
Long Island,Nassau,2908000,000511,NYU Langone Hospital-Long Island,18 to 29,115,F,White,Not Span/Hispanic,3,Elective,Home w/ Home Health Services,2020,MUS011,SPONDYLOPATHIES/SPONDYLOARTHROPATHY (INCLUDING INFECTIVE),MST016,VERTEBRAL DISCECTOMY,310,INTERVERTEBRAL DISC EXCISION & DECOMPRESSION,08,DISEASES AND DISORDERS OF THE MUSCULOSKELETAL SYSTEM AND CONNECTIVE TISSUE,1,Minor,Minor,Surgical,Blue Cross/Blue Shield,,,,,N,112814.17,24571.52