Hospital Service Area,Hospital County,Operating Certificate Number,Permanent Facility Id,Facility Name,Age Group,Zip Code - 3 digits,Gender,Race,Ethnicity,Length of Stay,Type of Admission,Patient Disposition,Discharge Year,CCS Diagnosis Code,CCS Diagnosis Description,CCS Procedure Code,CCS Procedure Description,APR DRG Code,APR DRG Description,APR MDC Code,APR MDC Description,APR Severity of Illness Code,APR Severity of Illness Description,APR Risk of Mortality,APR Medical Surgical Description,Payment Typology 1,Payment Typology 2,Payment Typology 3,Birth Weight,Abortion Edit Indicator,Emergency Department Indicator,Total Charges,Total Costs
New York City,Manhattan,7002053,001446,NYU Langone Orthopedic Hospital,70 or Older,,M,Other Race,Not Span/Hispanic,5,Elective,Skilled Nursing Home,2018,NEO024,SARCOMA,MST028,"SUBCUTANEOUS TISSUE AND FASCIA PROCEDURES, NEC",312,"SKIN GRAFT, EXCEPT HAND, FOR MUSCULOSKELETAL & CONNECTIVE TISSUE DIAGNOSES",08,DISEASES AND DISORDERS OF THE MUSCULOSKELETAL SYSTEM AND CONNECTIVE TISSUE,2,Moderate,Moderate,Surgical,Medicare,,,,,false,106088.76,26722.81
New York City,Kings,7001020,001305,Maimonides Medical Center,50 to 69,112,M,White,Not Span/Hispanic,8,Elective,Home or Self Care,2018,NEO024,SARCOMA,MST019,"MUSCLE, TENDON, BURSA, AND LIGAMENT EXCISION",312,"SKIN GRAFT, EXCEPT HAND, FOR MUSCULOSKELETAL & CONNECTIVE TISSUE DIAGNOSES",08,DISEASES AND DISORDERS OF THE MUSCULOSKELETAL SYSTEM AND CONNECTIVE TISSUE,1,Minor,Minor,Surgical,Medicare,Medicare,Medicaid,,,false,84273.01,26635.66
Long Island,Nassau,2953000,000563,St. Francis Hospital & Heart Center,70 or Older,110,M,White,Not Span/Hispanic,3,Elective,Home w/ Home Health Services,2018,INJ035,"COMPLICATION OF INTERNAL ORTHOPEDIC DEVICE OR IMPLANT, INITIAL ENCOUNTER",MST012,BONE FIXATION (EXCLUDING EXTREMITIES),312,"SKIN GRAFT, EXCEPT HAND, FOR MUSCULOSKELETAL & CONNECTIVE TISSUE DIAGNOSES",08,DISEASES AND DISORDERS OF THE MUSCULOSKELETAL SYSTEM AND CONNECTIVE TISSUE,2,Moderate,Moderate,Surgical,Medicare,Private Health Insurance,,,,false,44972.32,9483.45
New York City,Queens,7003004,001630,Long Island Jewish Medical Center,70 or Older,113,F,White,Not Span/Hispanic,1,Urgent,Home or Self Care,2018,NEO024,SARCOMA,MST028,"SUBCUTANEOUS TISSUE AND FASCIA PROCEDURES, NEC",312,"SKIN GRAFT, EXCEPT HAND, FOR MUSCULOSKELETAL & CONNECTIVE TISSUE DIAGNOSES",08,DISEASES AND DISORDERS OF THE MUSCULOSKELETAL SYSTEM AND CONNECTIVE TISSUE,2,Moderate,Moderate,Surgical,Private Health Insurance,Self-Pay,,,,false,26042.92,5594.26
Central NY,Onondaga,3301007,000628,UPSTATE University Hospital at Community General,18 to 29,,M,White,Not Span/Hispanic,2,Elective,Home or Self Care,2018,NEO024,SARCOMA,SKB008,SKIN EXCISION AND DEBRIDEMENT,312,"SKIN GRAFT, EXCEPT HAND, FOR MUSCULOSKELETAL & CONNECTIVE TISSUE DIAGNOSES",08,DISEASES AND DISORDERS OF THE MUSCULOSKELETAL SYSTEM AND CONNECTIVE TISSUE,1,Minor,Minor,Surgical,Medicaid,,,,,false,42916.43,11263.94
Long Island,Suffolk,5151001,000245,Stony Brook University Hospital,50 to 69,117,F,White,Not Span/Hispanic,17,Emergency,Home w/ Home Health Services,2018,MUS025,OTHER SPECIFIED CONNECTIVE TISSUE DISEASE,SKB004,BREAST RECONSTRUCTION,312,"SKIN GRAFT, EXCEPT HAND, FOR MUSCULOSKELETAL & CONNECTIVE TISSUE DIAGNOSES",08,DISEASES AND DISORDERS OF THE MUSCULOSKELETAL SYSTEM AND CONNECTIVE TISSUE,3,Major,Major,Surgical,Medicaid,Medicaid,,,,true,202714.13,68625.19
New York City,Queens,7003004,001638,Long Island Jewish Forest Hills,70 or Older,113,M,White,Not Span/Hispanic,5,Emergency,Skilled Nursing Home,2018,END003,DIABETES MELLITUS WITH COMPLICATION,CAR024,VENOUS AND ARTERIAL CATHETER PLACEMENT,312,"SKIN GRAFT, EXCEPT HAND, FOR MUSCULOSKELETAL & CONNECTIVE TISSUE DIAGNOSES",08,DISEASES AND DISORDERS OF THE MUSCULOSKELETAL SYSTEM AND CONNECTIVE TISSUE,3,Major,Moderate,Surgical,Medicare,Medicaid,,,,true,68721.39,11858.79
Finger Lakes,Monroe,2701005,000413,Strong Memorial Hospital,0 to 17,146,F,Other Race,Spanish/Hispanic,2,Emergency,Home or Self Care,2018,INJ004,"FRACTURE OF THE UPPER LIMB, INITIAL ENCOUNTER",SKB008,SKIN EXCISION AND DEBRIDEMENT,312,"SKIN GRAFT, EXCEPT HAND, FOR MUSCULOSKELETAL & CONNECTIVE TISSUE DIAGNOSES",08,DISEASES AND DISORDERS OF THE MUSCULOSKELETAL SYSTEM AND CONNECTIVE TISSUE,1,Minor,Minor,Surgical,Medicaid,Medicaid,Self-Pay,,,true,12667.65,6008.39
New York City,Queens,7003004,001630,Long Island Jewish Medical Center,70 or Older,114,M,White,Not Span/Hispanic,4,Emergency,Home or Self Care,2018,MUS002,OSTEOMYELITIS,SKB008,SKIN EXCISION AND DEBRIDEMENT,312,"SKIN GRAFT, EXCEPT HAND, FOR MUSCULOSKELETAL & CONNECTIVE TISSUE DIAGNOSES",08,DISEASES AND DISORDERS OF THE MUSCULOSKELETAL SYSTEM AND CONNECTIVE TISSUE,2,Moderate,Moderate,Surgical,Medicare,Medicare,Self-Pay,,,false,60681.78,11969.19
New York City,Kings,7001021,001306,New York - Presbyterian Brooklyn Methodist Hospital,50 to 69,112,M,Black/African American,Not Span/Hispanic,9,Emergency,Skilled Nursing Home,2018,END003,DIABETES MELLITUS WITH COMPLICATION,MST020,SUBCUTANEOUS TISSUE AND FASCIA EXCISION,312,"SKIN GRAFT, EXCEPT HAND, FOR MUSCULOSKELETAL & CONNECTIVE TISSUE DIAGNOSES",08,DISEASES AND DISORDERS OF THE MUSCULOSKELETAL SYSTEM AND CONNECTIVE TISSUE,2,Moderate,Moderate,Surgical,Medicare,Medicaid,Self-Pay,,,true,62166.04,19597.59
Western NY,Erie,1401005,000210,Erie County Medical Center,70 or Older,140,F,White,Not Span/Hispanic,5,Emergency,Skilled Nursing Home,2018,INJ026,OTHER SPECIFIED INJURY,ADM001,TRANSFUSION OF BLOOD AND BLOOD PRODUCTS,312,"SKIN GRAFT, EXCEPT HAND, FOR MUSCULOSKELETAL & CONNECTIVE TISSUE DIAGNOSES",08,DISEASES AND DISORDERS OF THE MUSCULOSKELETAL SYSTEM AND CONNECTIVE TISSUE,3,Major,Major,Surgical,Medicare,Medicare,,,,true,29835.87,16347.18
New York City,Queens,7003004,001638,Long Island Jewish Forest Hills,70 or Older,114,F,Other Race,Spanish/Hispanic,10,Emergency,Skilled Nursing Home,2018,END003,DIABETES MELLITUS WITH COMPLICATION,SKB007,SKIN GRAFT,312,"SKIN GRAFT, EXCEPT HAND, FOR MUSCULOSKELETAL & CONNECTIVE TISSUE DIAGNOSES",08,DISEASES AND DISORDERS OF THE MUSCULOSKELETAL SYSTEM AND CONNECTIVE TISSUE,2,Moderate,Moderate,Surgical,Medicare,Medicare,Medicaid,,,true,145323.77,31501.25
New York City,Bronx,7000008,001172,Lincoln Medical & Mental Health Center,70 or Older,104,M,Other Race,Spanish/Hispanic,19,Emergency,Skilled Nursing Home,2018,INJ026,OTHER SPECIFIED INJURY,SKB007,SKIN GRAFT,312,"SKIN GRAFT, EXCEPT HAND, FOR MUSCULOSKELETAL & CONNECTIVE TISSUE DIAGNOSES",08,DISEASES AND DISORDERS OF THE MUSCULOSKELETAL SYSTEM AND CONNECTIVE TISSUE,3,Major,Major,Surgical,Medicare,Medicare,,,,true,101835.78,60139.83
Hudson Valley,Westchester,5957001,001139,Westchester Medical Center,50 to 69,109,F,White,Not Span/Hispanic,9,Urgent,Skilled Nursing Home,2018,INJ037,"COMPLICATION OF OTHER SURGICAL OR MEDICAL CARE, INJURY, INITIAL ENCOUNTER",SKB007,SKIN GRAFT,312,"SKIN GRAFT, EXCEPT HAND, FOR MUSCULOSKELETAL & CONNECTIVE TISSUE DIAGNOSES",08,DISEASES AND DISORDERS OF THE MUSCULOSKELETAL SYSTEM AND CONNECTIVE TISSUE,2,Moderate,Minor,Surgical,Medicare,Medicaid,,,,false,213682.02,41241.37
Central NY,Onondaga,3301007,000635,University Hospital SUNY Health Science Center,30 to 49,138,F,White,Not Span/Hispanic,5,Elective,Home w/ Home Health Services,2018,NEO024,SARCOMA,MST020,SUBCUTANEOUS TISSUE AND FASCIA EXCISION,312,"SKIN GRAFT, EXCEPT HAND, FOR MUSCULOSKELETAL & CONNECTIVE TISSUE DIAGNOSES",08,DISEASES AND DISORDERS OF THE MUSCULOSKELETAL SYSTEM AND CONNECTIVE TISSUE,2,Moderate,Minor,Surgical,Medicaid,,,,,false,49169.12,12951.06
Long Island,Nassau,2951001,000541,North Shore University Hospital,50 to 69,110,F,White,Unknown,1,Elective,Home or Self Care,2018,INJ035,"COMPLICATION OF INTERNAL ORTHOPEDIC DEVICE OR IMPLANT, INITIAL ENCOUNTER",SKB008,SKIN EXCISION AND DEBRIDEMENT,312,"SKIN GRAFT, EXCEPT HAND, FOR MUSCULOSKELETAL & CONNECTIVE TISSUE DIAGNOSES",08,DISEASES AND DISORDERS OF THE MUSCULOSKELETAL SYSTEM AND CONNECTIVE TISSUE,2,Moderate,Minor,Surgical,Miscellaneous/Other,,,,,false,33438.21,9465.94
New York City,Manhattan,7002032,001466,Mount Sinai West,50 to 69,100,M,White,Not Span/Hispanic,3,Emergency,Home or Self Care,2018,MUS027,MUSCULOSKELETAL ABSCESS,SKB008,SKIN EXCISION AND DEBRIDEMENT,312,"SKIN GRAFT, EXCEPT HAND, FOR MUSCULOSKELETAL & CONNECTIVE TISSUE DIAGNOSES",08,DISEASES AND DISORDERS OF THE MUSCULOSKELETAL SYSTEM AND CONNECTIVE TISSUE,1,Minor,Minor,Surgical,Medicaid,Medicaid,Self-Pay,,,false,31953.63,8399.64
Long Island,Suffolk,5154001,000925,Good Samaritan Hospital Medical Center,30 to 49,117,M,White,Spanish/Hispanic,4,Emergency,Home or Self Care,2018,INJ004,"FRACTURE OF THE UPPER LIMB, INITIAL ENCOUNTER",MST009,FIXATION OF UPPER EXTREMITY BONES,312,"SKIN GRAFT, EXCEPT HAND, FOR MUSCULOSKELETAL & CONNECTIVE TISSUE DIAGNOSES",08,DISEASES AND DISORDERS OF THE MUSCULOSKELETAL SYSTEM AND CONNECTIVE TISSUE,2,Moderate,Minor,Surgical,Miscellaneous/Other,Private Health Insurance,,,,true,59369.8,11555.37
New York City,Manhattan,7002024,001456,Mount Sinai Hospital,70 or Older,112,F,White,Not Span/Hispanic,18,Emergency,Home w/ Home Health Services,2018,INJ035,"COMPLICATION OF INTERNAL ORTHOPEDIC DEVICE OR IMPLANT, INITIAL ENCOUNTER",MST006,KNEE ARTHROPLASTY,312,"SKIN GRAFT, EXCEPT HAND, FOR MUSCULOSKELETAL & CONNECTIVE TISSUE DIAGNOSES",08,DISEASES AND DISORDERS OF THE MUSCULOSKELETAL SYSTEM AND CONNECTIVE TISSUE,3,Major,Major,Surgical,Medicare,Private Health Insurance,Self-Pay,,,true,267411.6,94948.43
New York City,Manhattan,7002020,001453,Memorial Hospital for Cancer and Allied Diseases,30 to 49,112,F,Black/African American,Not Span/Hispanic,1,Elective,Home or Self Care,2018,NEO024,SARCOMA,MST019,"MUSCLE, TENDON, BURSA, AND LIGAMENT EXCISION",312,"SKIN GRAFT, EXCEPT HAND, FOR MUSCULOSKELETAL & CONNECTIVE TISSUE DIAGNOSES",08,DISEASES AND DISORDERS OF THE MUSCULOSKELETAL SYSTEM AND CONNECTIVE TISSUE,1,Minor,Minor,Surgical,Private Health Insurance,,,,,false,34249.35,14529.9
Western NY,Erie,1401008,000213,Mercy Hospital of Buffalo,30 to 49,140,M,White,Not Span/Hispanic,5,Elective,Home w/ Home Health Services,2018,INJ037,"COMPLICATION OF OTHER SURGICAL OR MEDICAL CARE, INJURY, INITIAL ENCOUNTER",SKB007,SKIN GRAFT,312,"SKIN GRAFT, EXCEPT HAND, FOR MUSCULOSKELETAL & CONNECTIVE TISSUE DIAGNOSES",08,DISEASES AND DISORDERS OF THE MUSCULOSKELETAL SYSTEM AND CONNECTIVE TISSUE,3,Major,Major,Surgical,Medicare,Medicare,,,,false,18364.6,8563.48
New York City,Queens,7003000,001626,Elmhurst Hospital Center,30 to 49,112,M,Other Race,Spanish/Hispanic,12,Emergency,Home or Self Care,2018,INJ005,"FRACTURE OF THE LOWER LIMB (EXCEPT HIP), INITIAL ENCOUNTER",SKB008,SKIN EXCISION AND DEBRIDEMENT,312,"SKIN GRAFT, EXCEPT HAND, FOR MUSCULOSKELETAL & CONNECTIVE TISSUE DIAGNOSES",08,DISEASES AND DISORDERS OF THE MUSCULOSKELETAL SYSTEM AND CONNECTIVE TISSUE,2,Moderate,Minor,Surgical,Medicaid,Medicaid,,,,true,65627.18,39045.94
Long Island,Suffolk,5154001,000925,Good Samaritan Hospital Medical Center,50 to 69,117,M,White,Not Span/Hispanic,18,Emergency,Skilled Nursing Home,2018,END003,DIABETES MELLITUS WITH COMPLICATION,SKB007,SKIN GRAFT,312,"SKIN GRAFT, EXCEPT HAND, FOR MUSCULOSKELETAL & CONNECTIVE TISSUE DIAGNOSES",08,DISEASES AND DISORDERS OF THE MUSCULOSKELETAL SYSTEM AND CONNECTIVE TISSUE,2,Moderate,Moderate,Surgical,Medicaid,Medicaid,,,,true,173922.49,37402.73
New York City,Manhattan,7002020,001453,Memorial Hospital for Cancer and Allied Diseases,30 to 49,OOS,M,Black/African American,Not Span/Hispanic,51,Elective,Inpatient Rehabilitation Facility,2018,NEO024,SARCOMA,GIS018,ILEOSTOMY AND COLOSTOMY,312,"SKIN GRAFT, EXCEPT HAND, FOR MUSCULOSKELETAL & CONNECTIVE TISSUE DIAGNOSES",08,DISEASES AND DISORDERS OF THE MUSCULOSKELETAL SYSTEM AND CONNECTIVE TISSUE,3,Major,Major,Surgical,"Managed Care, Unspecified",,,,,false,592602.04,249506.09
Western NY,Erie,1401014,000207,Buffalo General Medical Center,50 to 69,141,M,White,Not Span/Hispanic,7,Urgent,Home w/ Home Health Services,2018,INJ037,"COMPLICATION OF OTHER SURGICAL OR MEDICAL CARE, INJURY, INITIAL ENCOUNTER",SKB008,SKIN EXCISION AND DEBRIDEMENT,312,"SKIN GRAFT, EXCEPT HAND, FOR MUSCULOSKELETAL & CONNECTIVE TISSUE DIAGNOSES",08,DISEASES AND DISORDERS OF THE MUSCULOSKELETAL SYSTEM AND CONNECTIVE TISSUE,3,Major,Major,Surgical,Medicare,Self-Pay,,,,false,19994.88,10279.79
New York City,Kings,7001021,001306,New York - Presbyterian Brooklyn Methodist Hospital,50 to 69,112,M,Black/African American,Not Span/Hispanic,13,Emergency,Home or Self Care,2018,END003,DIABETES MELLITUS WITH COMPLICATION,SKB007,SKIN GRAFT,312,"SKIN GRAFT, EXCEPT HAND, FOR MUSCULOSKELETAL & CONNECTIVE TISSUE DIAGNOSES",08,DISEASES AND DISORDERS OF THE MUSCULOSKELETAL SYSTEM AND CONNECTIVE TISSUE,3,Major,Moderate,Surgical,Private Health Insurance,Self-Pay,,,,true,98848.05,31045.59
New York City,Richmond,7004003,001740,Staten Island University Hosp-North,30 to 49,103,M,Other Race,Spanish/Hispanic,32,Emergency,Inpatient Rehabilitation Facility,2018,MUS025,OTHER SPECIFIED CONNECTIVE TISSUE DISEASE,SKB008,SKIN EXCISION AND DEBRIDEMENT,312,"SKIN GRAFT, EXCEPT HAND, FOR MUSCULOSKELETAL & CONNECTIVE TISSUE DIAGNOSES",08,DISEASES AND DISORDERS OF THE MUSCULOSKELETAL SYSTEM AND CONNECTIVE TISSUE,4,Extreme,Major,Surgical,Medicaid,,,,,true,474381.21,124025.63
New York City,Kings,7001021,001306,New York - Presbyterian Brooklyn Methodist Hospital,30 to 49,112,M,Black/African American,Spanish/Hispanic,7,Emergency,Home or Self Care,2018,INJ037,"COMPLICATION OF OTHER SURGICAL OR MEDICAL CARE, INJURY, INITIAL ENCOUNTER",SKB007,SKIN GRAFT,312,"SKIN GRAFT, EXCEPT HAND, FOR MUSCULOSKELETAL & CONNECTIVE TISSUE DIAGNOSES",08,DISEASES AND DISORDERS OF THE MUSCULOSKELETAL SYSTEM AND CONNECTIVE TISSUE,3,Major,Moderate,Surgical,"Managed Care, Unspecified",Medicaid,Self-Pay,,,true,49138.86,16211.9
New York City,Queens,7003003,001629,Jamaica Hospital Medical Center,50 to 69,114,M,White,Spanish/Hispanic,25,Emergency,Home w/ Home Health Services,2018,END003,DIABETES MELLITUS WITH COMPLICATION,MST020,SUBCUTANEOUS TISSUE AND FASCIA EXCISION,312,"SKIN GRAFT, EXCEPT HAND, FOR MUSCULOSKELETAL & CONNECTIVE TISSUE DIAGNOSES",08,DISEASES AND DISORDERS OF THE MUSCULOSKELETAL SYSTEM AND CONNECTIVE TISSUE,3,Major,Major,Surgical,Medicare,,,,,true,213153,87679.41
New York City,Manhattan,7002020,001453,Memorial Hospital for Cancer and Allied Diseases,18 to 29,104,F,Black/African American,Not Span/Hispanic,1,Elective,Home or Self Care,2018,NEO024,SARCOMA,MST020,SUBCUTANEOUS TISSUE AND FASCIA EXCISION,312,"SKIN GRAFT, EXCEPT HAND, FOR MUSCULOSKELETAL & CONNECTIVE TISSUE DIAGNOSES",08,DISEASES AND DISORDERS OF THE MUSCULOSKELETAL SYSTEM AND CONNECTIVE TISSUE,2,Moderate,Minor,Surgical,Medicare,Private Health Insurance,Medicare,,,false,44350.37,19069.14
New York City,Manhattan,7002021,001454,Metropolitan Hospital Center,50 to 69,100,M,Black/African American,Not Span/Hispanic,1,Emergency,Left Against Medical Advice,2018,END003,DIABETES MELLITUS WITH COMPLICATION,SKB008,SKIN EXCISION AND DEBRIDEMENT,312,"SKIN GRAFT, EXCEPT HAND, FOR MUSCULOSKELETAL & CONNECTIVE TISSUE DIAGNOSES",08,DISEASES AND DISORDERS OF THE MUSCULOSKELETAL SYSTEM AND CONNECTIVE TISSUE,3,Major,Moderate,Surgical,Medicare,,,,,true,8297.87,6704.26
New York City,Kings,7001008,001293,"New York Community Hospital of Brooklyn, Inc",50 to 69,112,M,Black/African American,Not Span/Hispanic,13,Emergency,Inpatient Rehabilitation Facility,2018,END003,DIABETES MELLITUS WITH COMPLICATION,CAR008,ANGIOPLASTY AND RELATED VESSEL PROCEDURES (ENDOVASCULAR; EXCLUDING CAROTID),312,"SKIN GRAFT, EXCEPT HAND, FOR MUSCULOSKELETAL & CONNECTIVE TISSUE DIAGNOSES",08,DISEASES AND DISORDERS OF THE MUSCULOSKELETAL SYSTEM AND CONNECTIVE TISSUE,2,Moderate,Moderate,Surgical,"Managed Care, Unspecified",Medicaid,Self-Pay,,,true,52499.33,35302.79
Long Island,Suffolk,5154001,000925,Good Samaritan Hospital Medical Center,50 to 69,117,M,White,Not Span/Hispanic,2,Emergency,Home or Self Care,2018,INJ014,"AMPUTATION OF A LIMB, INITIAL ENCOUNTER",SKB008,SKIN EXCISION AND DEBRIDEMENT,312,"SKIN GRAFT, EXCEPT HAND, FOR MUSCULOSKELETAL & CONNECTIVE TISSUE DIAGNOSES",08,DISEASES AND DISORDERS OF THE MUSCULOSKELETAL SYSTEM AND CONNECTIVE TISSUE,1,Minor,Minor,Surgical,Private Health Insurance,,,,,true,32216.95,6519.32
New York City,Queens,7003003,001629,Jamaica Hospital Medical Center,50 to 69,114,M,Black/African American,Not Span/Hispanic,3,Emergency,Home or Self Care,2018,END003,DIABETES MELLITUS WITH COMPLICATION,MST018,BONE EXCISION,312,"SKIN GRAFT, EXCEPT HAND, FOR MUSCULOSKELETAL & CONNECTIVE TISSUE DIAGNOSES",08,DISEASES AND DISORDERS OF THE MUSCULOSKELETAL SYSTEM AND CONNECTIVE TISSUE,3,Major,Moderate,Surgical,Medicare,,,,,true,19926.3,9895.01
New York City,Manhattan,7002053,001463,NYU Langone Hospitals,0 to 17,103,M,Other Race,Spanish/Hispanic,1,Elective,Home or Self Care,2018,FAC010,OTHER AFTERCARE ENCOUNTER,MST012,BONE FIXATION (EXCLUDING EXTREMITIES),312,"SKIN GRAFT, EXCEPT HAND, FOR MUSCULOSKELETAL & CONNECTIVE TISSUE DIAGNOSES",08,DISEASES AND DISORDERS OF THE MUSCULOSKELETAL SYSTEM AND CONNECTIVE TISSUE,1,Minor,Minor,Surgical,Private Health Insurance,,,,,false,64597.46,14536.52
Long Island,Suffolk,5157003,000943,St Catherine of Siena Hospital,70 or Older,119,M,White,Not Span/Hispanic,1,Elective,Home or Self Care,2018,MUS033,GOUT,SKB007,SKIN GRAFT,312,"SKIN GRAFT, EXCEPT HAND, FOR MUSCULOSKELETAL & CONNECTIVE TISSUE DIAGNOSES",08,DISEASES AND DISORDERS OF THE MUSCULOSKELETAL SYSTEM AND CONNECTIVE TISSUE,3,Major,Moderate,Surgical,Medicare,Private Health Insurance,,,,false,35191.54,5916.81
Finger Lakes,Wayne,5820000,001028,Newark-Wayne Community Hospital,30 to 49,144,F,White,Not Span/Hispanic,7,Emergency,Home or Self Care,2018,END003,DIABETES MELLITUS WITH COMPLICATION,MST002,BONE AND JOINT BIOPSY,312,"SKIN GRAFT, EXCEPT HAND, FOR MUSCULOSKELETAL & CONNECTIVE TISSUE DIAGNOSES",08,DISEASES AND DISORDERS OF THE MUSCULOSKELETAL SYSTEM AND CONNECTIVE TISSUE,2,Moderate,Moderate,Surgical,Medicaid,,,,,true,39419.15,18902.62
Western NY,Erie,1401005,000210,Erie County Medical Center,30 to 49,142,M,Black/African American,Not Span/Hispanic,4,Elective,Home or Self Care,2018,MUS026,MUSCLE DISORDERS,MST028,"SUBCUTANEOUS TISSUE AND FASCIA PROCEDURES, NEC",312,"SKIN GRAFT, EXCEPT HAND, FOR MUSCULOSKELETAL & CONNECTIVE TISSUE DIAGNOSES",08,DISEASES AND DISORDERS OF THE MUSCULOSKELETAL SYSTEM AND CONNECTIVE TISSUE,2,Moderate,Minor,Surgical,Medicaid,Medicaid,,,,false,13964.05,10124.7
Long Island,Nassau,2953000,000563,St. Francis Hospital & Heart Center,30 to 49,117,M,White,Not Span/Hispanic,2,Elective,Home w/ Home Health Services,2018,NEO073,BENIGN NEOPLASMS,MST028,"SUBCUTANEOUS TISSUE AND FASCIA PROCEDURES, NEC",312,"SKIN GRAFT, EXCEPT HAND, FOR MUSCULOSKELETAL & CONNECTIVE TISSUE DIAGNOSES",08,DISEASES AND DISORDERS OF THE MUSCULOSKELETAL SYSTEM AND CONNECTIVE TISSUE,2,Moderate,Minor,Surgical,Private Health Insurance,,,,,false,61590.83,11367.7
New York City,Richmond,7004010,001738,Richmond University Medical Center,50 to 69,103,F,Other Race,Unknown,7,Emergency,Home or Self Care,2018,INJ035,"COMPLICATION OF INTERNAL ORTHOPEDIC DEVICE OR IMPLANT, INITIAL ENCOUNTER",CAR024,VENOUS AND ARTERIAL CATHETER PLACEMENT,312,"SKIN GRAFT, EXCEPT HAND, FOR MUSCULOSKELETAL & CONNECTIVE TISSUE DIAGNOSES",08,DISEASES AND DISORDERS OF THE MUSCULOSKELETAL SYSTEM AND CONNECTIVE TISSUE,3,Major,Minor,Surgical,Blue Cross/Blue Shield,Self-Pay,Self-Pay,,,true,46387.25,14940.4
Long Island,Suffolk,5154001,000925,Good Samaritan Hospital Medical Center,18 to 29,117,M,White,Not Span/Hispanic,2,Emergency,Home w/ Home Health Services,2018,INJ014,"AMPUTATION OF A LIMB, INITIAL ENCOUNTER",SKB007,SKIN GRAFT,312,"SKIN GRAFT, EXCEPT HAND, FOR MUSCULOSKELETAL & CONNECTIVE TISSUE DIAGNOSES",08,DISEASES AND DISORDERS OF THE MUSCULOSKELETAL SYSTEM AND CONNECTIVE TISSUE,1,Minor,Minor,Surgical,Miscellaneous/Other,Medicaid,Medicaid,,,true,29709.95,5984.58
New York City,Manhattan,7002032,001469,Mount Sinai Morningside,30 to 49,104,F,Other Race,Spanish/Hispanic,9,Emergency,Home or Self Care,2018,INJ037,"COMPLICATION OF OTHER SURGICAL OR MEDICAL CARE, INJURY, INITIAL ENCOUNTER",SKB007,SKIN GRAFT,312,"SKIN GRAFT, EXCEPT HAND, FOR MUSCULOSKELETAL & CONNECTIVE TISSUE DIAGNOSES",08,DISEASES AND DISORDERS OF THE MUSCULOSKELETAL SYSTEM AND CONNECTIVE TISSUE,2,Moderate,Moderate,Surgical,Medicaid,Self-Pay,,,,true,104965.68,26806.76
New York City,Bronx,7000006,001169,Montefiore Medical Center - Henry & Lucy Moses Div,70 or Older,105,F,Other Race,Unknown,1,Emergency,Home or Self Care,2018,NEO072,NEOPLASMS OF UNSPECIFIED NATURE OR UNCERTAIN BEHAVIOR,MST026,FINGER AND OTHER UPPER EXTREMITY AMPUTATION,312,"SKIN GRAFT, EXCEPT HAND, FOR MUSCULOSKELETAL & CONNECTIVE TISSUE DIAGNOSES",08,DISEASES AND DISORDERS OF THE MUSCULOSKELETAL SYSTEM AND CONNECTIVE TISSUE,2,Moderate,Moderate,Surgical,Medicare,Private Health Insurance,,,,false,32497.14,6620.19
New York City,Manhattan,7002020,001453,Memorial Hospital for Cancer and Allied Diseases,70 or Older,OOS,F,White,Spanish/Hispanic,3,Elective,Home or Self Care,2018,NEO024,SARCOMA,MST020,SUBCUTANEOUS TISSUE AND FASCIA EXCISION,312,"SKIN GRAFT, EXCEPT HAND, FOR MUSCULOSKELETAL & CONNECTIVE TISSUE DIAGNOSES",08,DISEASES AND DISORDERS OF THE MUSCULOSKELETAL SYSTEM AND CONNECTIVE TISSUE,1,Minor,Minor,Surgical,Blue Cross/Blue Shield,Medicare,,,,false,40258.35,16915.62
New York City,Manhattan,7002054,001464,New York-Presbyterian Hospital - Columbia Presbyterian Center,50 to 69,100,M,Black/African American,Not Span/Hispanic,16,Urgent,Skilled Nursing Home,2018,INJ037,"COMPLICATION OF OTHER SURGICAL OR MEDICAL CARE, INJURY, INITIAL ENCOUNTER",SKB007,SKIN GRAFT,312,"SKIN GRAFT, EXCEPT HAND, FOR MUSCULOSKELETAL & CONNECTIVE TISSUE DIAGNOSES",08,DISEASES AND DISORDERS OF THE MUSCULOSKELETAL SYSTEM AND CONNECTIVE TISSUE,2,Moderate,Minor,Surgical,Private Health Insurance,Self-Pay,,,,false,152774.17,33638.88
Long Island,Nassau,2953000,000563,St. Francis Hospital & Heart Center,50 to 69,104,F,White,Spanish/Hispanic,6,Elective,Home w/ Home Health Services,2018,MUS025,OTHER SPECIFIED CONNECTIVE TISSUE DISEASE,MST020,SUBCUTANEOUS TISSUE AND FASCIA EXCISION,312,"SKIN GRAFT, EXCEPT HAND, FOR MUSCULOSKELETAL & CONNECTIVE TISSUE DIAGNOSES",08,DISEASES AND DISORDERS OF THE MUSCULOSKELETAL SYSTEM AND CONNECTIVE TISSUE,2,Moderate,Minor,Surgical,Blue Cross/Blue Shield,,,,,false,98587.86,17385.74
New York City,Manhattan,7002054,001458,New York-Presbyterian Hospital - New York Weill Cornell Center,70 or Older,114,F,White,Not Span/Hispanic,20,Emergency,Skilled Nursing Home,2018,INJ035,"COMPLICATION OF INTERNAL ORTHOPEDIC DEVICE OR IMPLANT, INITIAL ENCOUNTER",ADM018,IRRIGATION (DIAGNOSTIC AND THERAPEUTIC),312,"SKIN GRAFT, EXCEPT HAND, FOR MUSCULOSKELETAL & CONNECTIVE TISSUE DIAGNOSES",08,DISEASES AND DISORDERS OF THE MUSCULOSKELETAL SYSTEM AND CONNECTIVE TISSUE,3,Major,Major,Surgical,Medicare,Private Health Insurance,Self-Pay,,,true,351330.97,159444.99
New York City,Kings,7001020,001305,Maimonides Medical Center,50 to 69,100,M,Other Race,Not Span/Hispanic,16,Emergency,Skilled Nursing Home,2018,END003,DIABETES MELLITUS WITH COMPLICATION,MST020,SUBCUTANEOUS TISSUE AND FASCIA EXCISION,312,"SKIN GRAFT, EXCEPT HAND, FOR MUSCULOSKELETAL & CONNECTIVE TISSUE DIAGNOSES",08,DISEASES AND DISORDERS OF THE MUSCULOSKELETAL SYSTEM AND CONNECTIVE TISSUE,3,Major,Major,Surgical,Medicaid,Self-Pay,,,,false,115412.04,33287.44
Long Island,Suffolk,5151001,000245,Stony Brook University Hospital,70 or Older,119,F,White,Not Span/Hispanic,3,Emergency,Skilled Nursing Home,2018,INJ002,"FRACTURE OF THE SPINE AND BACK, INITIAL ENCOUNTER",SKB008,SKIN EXCISION AND DEBRIDEMENT,312,"SKIN GRAFT, EXCEPT HAND, FOR MUSCULOSKELETAL & CONNECTIVE TISSUE DIAGNOSES",08,DISEASES AND DISORDERS OF THE MUSCULOSKELETAL SYSTEM AND CONNECTIVE TISSUE,3,Major,Moderate,Surgical,Medicare,Blue Cross/Blue Shield,,,,true,46424.05,12587.75