Hospital Service Area,Hospital County,Operating Certificate Number,Permanent Facility Id,Facility Name,Age Group,Zip Code - 3 digits,Gender,Race,Ethnicity,Length of Stay,Type of Admission,Patient Disposition,Discharge Year,CCS Diagnosis Code,CCS Diagnosis Description,CCS Procedure Code,CCS Procedure Description,APR DRG Code,APR DRG Description,APR MDC Code,APR MDC Description,APR Severity of Illness Code,APR Severity of Illness Description,APR Risk of Mortality,APR Medical Surgical Description,Payment Typology 1,Payment Typology 2,Payment Typology 3,Birth Weight,Abortion Edit Indicator,Emergency Department Indicator,Total Charges,Total Costs
New York City,Manhattan,7002053,001446,NYU Langone Orthopedic Hospital,30 to 49,104,M,Other Race,Not Span/Hispanic,2,Elective,Home w/ Home Health Services,2019,MUS031,TRAUMATIC ARTHROPATHY,MST008,ARTHROPLASTY OF OTHER JOINT (EXCLUDING KNEE AND HIP),313,KNEE & LOWER LEG PROCEDURES EXCEPT FOOT,08,DISEASES AND DISORDERS OF THE MUSCULOSKELETAL SYSTEM AND CONNECTIVE TISSUE,2,Moderate,Minor,Surgical,Medicare,Medicaid,,,,false,268314.03,44654.45
New York City,Manhattan,7002053,001446,NYU Langone Orthopedic Hospital,70 or Older,112,M,White,Not Span/Hispanic,2,Elective,Home or Self Care,2019,INJ005,"FRACTURE OF THE LOWER LIMB (EXCEPT HIP), INITIAL ENCOUNTER",MST011,FIXATION OF LEG AND FOOT BONES,313,KNEE & LOWER LEG PROCEDURES EXCEPT FOOT,08,DISEASES AND DISORDERS OF THE MUSCULOSKELETAL SYSTEM AND CONNECTIVE TISSUE,1,Minor,Minor,Surgical,Medicare,Medicare,,,,false,80086.32,16616.53
New York City,Manhattan,7002053,001446,NYU Langone Orthopedic Hospital,70 or Older,105,M,White,Not Span/Hispanic,4,Elective,Home w/ Home Health Services,2019,INJ035,"COMPLICATION OF INTERNAL ORTHOPEDIC DEVICE OR IMPLANT, INITIAL ENCOUNTER",MST028,"SUBCUTANEOUS TISSUE AND FASCIA PROCEDURES, NEC",313,KNEE & LOWER LEG PROCEDURES EXCEPT FOOT,08,DISEASES AND DISORDERS OF THE MUSCULOSKELETAL SYSTEM AND CONNECTIVE TISSUE,3,Major,Major,Surgical,Medicare,Medicare,,,,false,93844.06,20995.75
New York City,Manhattan,7002053,001446,NYU Langone Orthopedic Hospital,50 to 69,105,M,White,Not Span/Hispanic,1,Elective,Home or Self Care,2019,INJ042,"FRACTURE OF LOWER LIMB (EXCEPT HIP), SUBSEQUENT ENCOUNTER",MST029,"MUSCULOSKELETAL DEVICE PROCEDURES, NEC",313,KNEE & LOWER LEG PROCEDURES EXCEPT FOOT,08,DISEASES AND DISORDERS OF THE MUSCULOSKELETAL SYSTEM AND CONNECTIVE TISSUE,1,Minor,Minor,Surgical,Blue Cross/Blue Shield,,,,,false,102119.98,17359.66
New York City,Manhattan,7002053,001446,NYU Langone Orthopedic Hospital,50 to 69,112,M,Black/African American,Not Span/Hispanic,5,Emergency,Skilled Nursing Home,2019,INJ035,"COMPLICATION OF INTERNAL ORTHOPEDIC DEVICE OR IMPLANT, INITIAL ENCOUNTER",MST011,FIXATION OF LEG AND FOOT BONES,313,KNEE & LOWER LEG PROCEDURES EXCEPT FOOT,08,DISEASES AND DISORDERS OF THE MUSCULOSKELETAL SYSTEM AND CONNECTIVE TISSUE,3,Major,Moderate,Surgical,Miscellaneous/Other,Medicare,,,,false,91868.84,24306.2
New York City,Manhattan,7002053,001446,NYU Langone Orthopedic Hospital,50 to 69,103,M,White,Not Span/Hispanic,1,Elective,Home or Self Care,2019,MUS006,OSTEOARTHRITIS,MST008,ARTHROPLASTY OF OTHER JOINT (EXCLUDING KNEE AND HIP),313,KNEE & LOWER LEG PROCEDURES EXCEPT FOOT,08,DISEASES AND DISORDERS OF THE MUSCULOSKELETAL SYSTEM AND CONNECTIVE TISSUE,2,Moderate,Minor,Surgical,Medicare,Blue Cross/Blue Shield,,,,false,656826.83,99633.16
New York City,Manhattan,7002053,001446,NYU Langone Orthopedic Hospital,50 to 69,112,F,White,Not Span/Hispanic,12,Emergency,Skilled Nursing Home,2019,INJ005,"FRACTURE OF THE LOWER LIMB (EXCEPT HIP), INITIAL ENCOUNTER",MST011,FIXATION OF LEG AND FOOT BONES,313,KNEE & LOWER LEG PROCEDURES EXCEPT FOOT,08,DISEASES AND DISORDERS OF THE MUSCULOSKELETAL SYSTEM AND CONNECTIVE TISSUE,3,Major,Major,Surgical,Blue Cross/Blue Shield,,,,,true,283664.53,67630.22
New York City,Manhattan,7002053,001446,NYU Langone Orthopedic Hospital,50 to 69,100,F,Other Race,Unknown,4,Elective,Home w/ Home Health Services,2019,INJ005,"FRACTURE OF THE LOWER LIMB (EXCEPT HIP), INITIAL ENCOUNTER",MST011,FIXATION OF LEG AND FOOT BONES,313,KNEE & LOWER LEG PROCEDURES EXCEPT FOOT,08,DISEASES AND DISORDERS OF THE MUSCULOSKELETAL SYSTEM AND CONNECTIVE TISSUE,2,Moderate,Minor,Surgical,Miscellaneous/Other,Medicare,,,,false,183146.96,35737.43
New York City,Manhattan,7002053,001446,NYU Langone Orthopedic Hospital,50 to 69,100,F,Other Race,Not Span/Hispanic,4,Elective,Skilled Nursing Home,2019,INJ035,"COMPLICATION OF INTERNAL ORTHOPEDIC DEVICE OR IMPLANT, INITIAL ENCOUNTER",MST028,"SUBCUTANEOUS TISSUE AND FASCIA PROCEDURES, NEC",313,KNEE & LOWER LEG PROCEDURES EXCEPT FOOT,08,DISEASES AND DISORDERS OF THE MUSCULOSKELETAL SYSTEM AND CONNECTIVE TISSUE,3,Major,Minor,Surgical,Medicaid,,,,,false,135369.57,28401.56
New York City,Manhattan,7002053,001446,NYU Langone Orthopedic Hospital,70 or Older,100,F,Other Race,Unknown,3,Elective,Home w/ Home Health Services,2019,INJ005,"FRACTURE OF THE LOWER LIMB (EXCEPT HIP), INITIAL ENCOUNTER",MST011,FIXATION OF LEG AND FOOT BONES,313,KNEE & LOWER LEG PROCEDURES EXCEPT FOOT,08,DISEASES AND DISORDERS OF THE MUSCULOSKELETAL SYSTEM AND CONNECTIVE TISSUE,2,Moderate,Minor,Surgical,Medicare,Blue Cross/Blue Shield,,,,false,172249.44,32361.35
New York City,Manhattan,7002053,001446,NYU Langone Orthopedic Hospital,70 or Older,100,M,White,Not Span/Hispanic,3,Emergency,Home w/ Home Health Services,2019,INJ005,"FRACTURE OF THE LOWER LIMB (EXCEPT HIP), INITIAL ENCOUNTER",MST011,FIXATION OF LEG AND FOOT BONES,313,KNEE & LOWER LEG PROCEDURES EXCEPT FOOT,08,DISEASES AND DISORDERS OF THE MUSCULOSKELETAL SYSTEM AND CONNECTIVE TISSUE,1,Minor,Minor,Surgical,Medicare,Blue Cross/Blue Shield,,,,true,332026.74,57657.55
New York City,Manhattan,7002053,001446,NYU Langone Orthopedic Hospital,50 to 69,112,M,Other Race,Spanish/Hispanic,3,Elective,Home w/ Home Health Services,2019,INJ042,"FRACTURE OF LOWER LIMB (EXCEPT HIP), SUBSEQUENT ENCOUNTER",MST029,"MUSCULOSKELETAL DEVICE PROCEDURES, NEC",313,KNEE & LOWER LEG PROCEDURES EXCEPT FOOT,08,DISEASES AND DISORDERS OF THE MUSCULOSKELETAL SYSTEM AND CONNECTIVE TISSUE,1,Minor,Minor,Surgical,Medicare,Medicaid,,,,false,156991.42,29989.01
New York City,Manhattan,7002053,001446,NYU Langone Orthopedic Hospital,30 to 49,112,M,Other Race,Spanish/Hispanic,2,Urgent,Home or Self Care,2019,INJ005,"FRACTURE OF THE LOWER LIMB (EXCEPT HIP), INITIAL ENCOUNTER",MST011,FIXATION OF LEG AND FOOT BONES,313,KNEE & LOWER LEG PROCEDURES EXCEPT FOOT,08,DISEASES AND DISORDERS OF THE MUSCULOSKELETAL SYSTEM AND CONNECTIVE TISSUE,2,Moderate,Minor,Surgical,Private Health Insurance,,,,,false,104479.32,19868.96
New York City,Manhattan,7002053,001446,NYU Langone Orthopedic Hospital,50 to 69,104,F,White,Not Span/Hispanic,3,Emergency,Home w/ Home Health Services,2019,INJ005,"FRACTURE OF THE LOWER LIMB (EXCEPT HIP), INITIAL ENCOUNTER",MST011,FIXATION OF LEG AND FOOT BONES,313,KNEE & LOWER LEG PROCEDURES EXCEPT FOOT,08,DISEASES AND DISORDERS OF THE MUSCULOSKELETAL SYSTEM AND CONNECTIVE TISSUE,2,Moderate,Minor,Surgical,Miscellaneous/Other,,,,,true,162953,30604.45
New York City,Manhattan,7002053,001446,NYU Langone Orthopedic Hospital,70 or Older,112,F,Black/African American,Not Span/Hispanic,27,Emergency,Skilled Nursing Home,2019,MUS001,INFECTIVE ARTHRITIS,MST017,JOINT TISSUE EXCISION (EXCLUDING DISCECTOMY),313,KNEE & LOWER LEG PROCEDURES EXCEPT FOOT,08,DISEASES AND DISORDERS OF THE MUSCULOSKELETAL SYSTEM AND CONNECTIVE TISSUE,3,Major,Major,Surgical,Medicare,Private Health Insurance,,,,true,414997.66,119390.49
New York City,Manhattan,7002053,001446,NYU Langone Orthopedic Hospital,70 or Older,100,F,Black/African American,Not Span/Hispanic,6,Emergency,Skilled Nursing Home,2019,INJ005,"FRACTURE OF THE LOWER LIMB (EXCEPT HIP), INITIAL ENCOUNTER",MST011,FIXATION OF LEG AND FOOT BONES,313,KNEE & LOWER LEG PROCEDURES EXCEPT FOOT,08,DISEASES AND DISORDERS OF THE MUSCULOSKELETAL SYSTEM AND CONNECTIVE TISSUE,2,Moderate,Minor,Surgical,Medicare,Medicaid,,,,true,187590.12,42178.08
New York City,Manhattan,7002053,001446,NYU Langone Orthopedic Hospital,70 or Older,112,F,White,Not Span/Hispanic,1,Elective,Home w/ Home Health Services,2019,MUS031,TRAUMATIC ARTHROPATHY,MST008,ARTHROPLASTY OF OTHER JOINT (EXCLUDING KNEE AND HIP),313,KNEE & LOWER LEG PROCEDURES EXCEPT FOOT,08,DISEASES AND DISORDERS OF THE MUSCULOSKELETAL SYSTEM AND CONNECTIVE TISSUE,2,Moderate,Minor,Surgical,Medicare,Private Health Insurance,Medicaid,,,false,236688.63,37265.72
New York City,Manhattan,7002053,001446,NYU Langone Orthopedic Hospital,18 to 29,,F,White,Spanish/Hispanic,1,Elective,Home or Self Care,2019,INJ024,"SPRAINS AND STRAINS, INITIAL ENCOUNTER",MST029,"MUSCULOSKELETAL DEVICE PROCEDURES, NEC",313,KNEE & LOWER LEG PROCEDURES EXCEPT FOOT,08,DISEASES AND DISORDERS OF THE MUSCULOSKELETAL SYSTEM AND CONNECTIVE TISSUE,2,Moderate,Minor,Surgical,Private Health Insurance,,,,,false,337063.45,20878.59
New York City,Manhattan,7002053,001446,NYU Langone Orthopedic Hospital,30 to 49,112,F,Other Race,Unknown,3,Elective,Home w/ Home Health Services,2019,INJ005,"FRACTURE OF THE LOWER LIMB (EXCEPT HIP), INITIAL ENCOUNTER",MST011,FIXATION OF LEG AND FOOT BONES,313,KNEE & LOWER LEG PROCEDURES EXCEPT FOOT,08,DISEASES AND DISORDERS OF THE MUSCULOSKELETAL SYSTEM AND CONNECTIVE TISSUE,2,Moderate,Moderate,Surgical,Blue Cross/Blue Shield,,,,,false,158326.5,28600.36
New York City,Manhattan,7002053,001446,NYU Langone Orthopedic Hospital,50 to 69,112,M,White,Not Span/Hispanic,11,Emergency,Skilled Nursing Home,2019,INJ005,"FRACTURE OF THE LOWER LIMB (EXCEPT HIP), INITIAL ENCOUNTER",MST011,FIXATION OF LEG AND FOOT BONES,313,KNEE & LOWER LEG PROCEDURES EXCEPT FOOT,08,DISEASES AND DISORDERS OF THE MUSCULOSKELETAL SYSTEM AND CONNECTIVE TISSUE,2,Moderate,Minor,Surgical,Medicare,,,,,true,402107.37,85087.55
New York City,Manhattan,7002053,001446,NYU Langone Orthopedic Hospital,70 or Older,,F,Other Race,Unknown,3,Elective,Home w/ Home Health Services,2019,MUS006,OSTEOARTHRITIS,MST014,JOINT FUSION (EXCLUDING SPINE),313,KNEE & LOWER LEG PROCEDURES EXCEPT FOOT,08,DISEASES AND DISORDERS OF THE MUSCULOSKELETAL SYSTEM AND CONNECTIVE TISSUE,1,Minor,Minor,Surgical,Medicare,Private Health Insurance,,,,false,168271.4,31877.09
New York City,Manhattan,7002053,001446,NYU Langone Orthopedic Hospital,70 or Older,114,F,Black/African American,Not Span/Hispanic,3,Elective,Home w/ Home Health Services,2019,MUS007,OTHER SPECIFIED JOINT DISORDERS,MST017,JOINT TISSUE EXCISION (EXCLUDING DISCECTOMY),313,KNEE & LOWER LEG PROCEDURES EXCEPT FOOT,08,DISEASES AND DISORDERS OF THE MUSCULOSKELETAL SYSTEM AND CONNECTIVE TISSUE,2,Moderate,Moderate,Surgical,Medicaid,,,,,false,105936.96,27209.14
New York City,Manhattan,7002053,001446,NYU Langone Orthopedic Hospital,70 or Older,112,M,White,Not Span/Hispanic,4,Emergency,Home w/ Home Health Services,2019,MUS001,INFECTIVE ARTHRITIS,MST004,INCISION AND DRAINAGE OF MUSCULOSKELETAL TISSUE AND JOINTS,313,KNEE & LOWER LEG PROCEDURES EXCEPT FOOT,08,DISEASES AND DISORDERS OF THE MUSCULOSKELETAL SYSTEM AND CONNECTIVE TISSUE,1,Minor,Minor,Surgical,Medicaid,,,,,true,64948.43,18404.37
New York City,Manhattan,7002053,001446,NYU Langone Orthopedic Hospital,50 to 69,112,F,White,Unknown,10,Emergency,Home w/ Home Health Services,2019,INJ005,"FRACTURE OF THE LOWER LIMB (EXCEPT HIP), INITIAL ENCOUNTER",MST011,FIXATION OF LEG AND FOOT BONES,313,KNEE & LOWER LEG PROCEDURES EXCEPT FOOT,08,DISEASES AND DISORDERS OF THE MUSCULOSKELETAL SYSTEM AND CONNECTIVE TISSUE,2,Moderate,Minor,Surgical,Medicaid,,,,,true,449947.76,89265.36
New York City,Manhattan,7002053,001446,NYU Langone Orthopedic Hospital,50 to 69,100,F,White,Not Span/Hispanic,2,Emergency,Home or Self Care,2019,INJ005,"FRACTURE OF THE LOWER LIMB (EXCEPT HIP), INITIAL ENCOUNTER",MST011,FIXATION OF LEG AND FOOT BONES,313,KNEE & LOWER LEG PROCEDURES EXCEPT FOOT,08,DISEASES AND DISORDERS OF THE MUSCULOSKELETAL SYSTEM AND CONNECTIVE TISSUE,2,Moderate,Moderate,Surgical,Private Health Insurance,,,,,true,153304.49,27320.84
New York City,Manhattan,7002053,001446,NYU Langone Orthopedic Hospital,70 or Older,116,M,White,Not Span/Hispanic,1,Elective,Home w/ Home Health Services,2019,MUS007,OTHER SPECIFIED JOINT DISORDERS,MST017,JOINT TISSUE EXCISION (EXCLUDING DISCECTOMY),313,KNEE & LOWER LEG PROCEDURES EXCEPT FOOT,08,DISEASES AND DISORDERS OF THE MUSCULOSKELETAL SYSTEM AND CONNECTIVE TISSUE,1,Minor,Moderate,Surgical,Medicare,Medicare,,,,false,58064.75,13700.55
New York City,Manhattan,7002053,001446,NYU Langone Orthopedic Hospital,30 to 49,104,F,Other Race,Spanish/Hispanic,2,Elective,Home or Self Care,2019,MUS031,TRAUMATIC ARTHROPATHY,MST014,JOINT FUSION (EXCLUDING SPINE),313,KNEE & LOWER LEG PROCEDURES EXCEPT FOOT,08,DISEASES AND DISORDERS OF THE MUSCULOSKELETAL SYSTEM AND CONNECTIVE TISSUE,2,Moderate,Moderate,Surgical,Miscellaneous/Other,,,,,false,290481.51,47557.52
New York City,Manhattan,7002053,001446,NYU Langone Orthopedic Hospital,70 or Older,104,F,White,Not Span/Hispanic,1,Elective,Home w/ Home Health Services,2019,MUS006,OSTEOARTHRITIS,MST008,ARTHROPLASTY OF OTHER JOINT (EXCLUDING KNEE AND HIP),313,KNEE & LOWER LEG PROCEDURES EXCEPT FOOT,08,DISEASES AND DISORDERS OF THE MUSCULOSKELETAL SYSTEM AND CONNECTIVE TISSUE,2,Moderate,Minor,Surgical,Medicare,Blue Cross/Blue Shield,,,,false,248008.46,39113.79
New York City,Manhattan,7002053,001446,NYU Langone Orthopedic Hospital,70 or Older,,M,Black/African American,Not Span/Hispanic,6,Elective,Home w/ Home Health Services,2019,INJ035,"COMPLICATION OF INTERNAL ORTHOPEDIC DEVICE OR IMPLANT, INITIAL ENCOUNTER",MST006,KNEE ARTHROPLASTY,313,KNEE & LOWER LEG PROCEDURES EXCEPT FOOT,08,DISEASES AND DISORDERS OF THE MUSCULOSKELETAL SYSTEM AND CONNECTIVE TISSUE,1,Minor,Minor,Surgical,Medicaid,,,,,false,155328.21,36413.09
New York City,Manhattan,7002053,001446,NYU Langone Orthopedic Hospital,50 to 69,100,F,White,Not Span/Hispanic,3,Elective,Inpatient Rehabilitation Facility,2019,MUS006,OSTEOARTHRITIS,MST008,ARTHROPLASTY OF OTHER JOINT (EXCLUDING KNEE AND HIP),313,KNEE & LOWER LEG PROCEDURES EXCEPT FOOT,08,DISEASES AND DISORDERS OF THE MUSCULOSKELETAL SYSTEM AND CONNECTIVE TISSUE,2,Moderate,Minor,Surgical,Private Health Insurance,Medicare,,,,false,288651.16,49850.1
New York City,Manhattan,7002053,001446,NYU Langone Orthopedic Hospital,50 to 69,112,F,White,Not Span/Hispanic,8,Emergency,Skilled Nursing Home,2019,INJ005,"FRACTURE OF THE LOWER LIMB (EXCEPT HIP), INITIAL ENCOUNTER",MST011,FIXATION OF LEG AND FOOT BONES,313,KNEE & LOWER LEG PROCEDURES EXCEPT FOOT,08,DISEASES AND DISORDERS OF THE MUSCULOSKELETAL SYSTEM AND CONNECTIVE TISSUE,2,Moderate,Minor,Surgical,Private Health Insurance,,,,,true,366563.36,72956.49
New York City,Manhattan,7002053,001446,NYU Langone Orthopedic Hospital,18 to 29,117,M,White,Not Span/Hispanic,1,Elective,Home or Self Care,2019,INJ005,"FRACTURE OF THE LOWER LIMB (EXCEPT HIP), INITIAL ENCOUNTER",MST011,FIXATION OF LEG AND FOOT BONES,313,KNEE & LOWER LEG PROCEDURES EXCEPT FOOT,08,DISEASES AND DISORDERS OF THE MUSCULOSKELETAL SYSTEM AND CONNECTIVE TISSUE,2,Moderate,Minor,Surgical,Federal/State/Local/VA,,,,,false,262767.93,41260.27
New York City,Manhattan,7002053,001446,NYU Langone Orthopedic Hospital,30 to 49,112,M,White,Not Span/Hispanic,1,Urgent,Home or Self Care,2019,INJ005,"FRACTURE OF THE LOWER LIMB (EXCEPT HIP), INITIAL ENCOUNTER",MST011,FIXATION OF LEG AND FOOT BONES,313,KNEE & LOWER LEG PROCEDURES EXCEPT FOOT,08,DISEASES AND DISORDERS OF THE MUSCULOSKELETAL SYSTEM AND CONNECTIVE TISSUE,1,Minor,Minor,Surgical,Miscellaneous/Other,,,,,false,78700.11,14027.17
New York City,Manhattan,7002053,001446,NYU Langone Orthopedic Hospital,70 or Older,100,M,White,Not Span/Hispanic,8,Elective,Skilled Nursing Home,2019,INJ035,"COMPLICATION OF INTERNAL ORTHOPEDIC DEVICE OR IMPLANT, INITIAL ENCOUNTER",MST011,FIXATION OF LEG AND FOOT BONES,313,KNEE & LOWER LEG PROCEDURES EXCEPT FOOT,08,DISEASES AND DISORDERS OF THE MUSCULOSKELETAL SYSTEM AND CONNECTIVE TISSUE,4,Extreme,Extreme,Surgical,Blue Cross/Blue Shield,Medicare,,,,false,500173.65,91919.04
New York City,Manhattan,7002053,001446,NYU Langone Orthopedic Hospital,18 to 29,100,M,Black/African American,Not Span/Hispanic,14,Elective,Skilled Nursing Home,2019,INJ005,"FRACTURE OF THE LOWER LIMB (EXCEPT HIP), INITIAL ENCOUNTER",MST011,FIXATION OF LEG AND FOOT BONES,313,KNEE & LOWER LEG PROCEDURES EXCEPT FOOT,08,DISEASES AND DISORDERS OF THE MUSCULOSKELETAL SYSTEM AND CONNECTIVE TISSUE,1,Minor,Minor,Surgical,Private Health Insurance,,,,,false,323714.19,76835.25
New York City,Manhattan,7002053,001446,NYU Langone Orthopedic Hospital,50 to 69,OOS,F,White,Not Span/Hispanic,3,Elective,Home w/ Home Health Services,2019,MUS009,TENDON AND SYNOVIAL DISORDERS,MST022,"TENDON, MUSCLE, BURSA, AND LIGAMENT REPAIR (EXCLUDING PERINEAL)",313,KNEE & LOWER LEG PROCEDURES EXCEPT FOOT,08,DISEASES AND DISORDERS OF THE MUSCULOSKELETAL SYSTEM AND CONNECTIVE TISSUE,2,Moderate,Moderate,Surgical,Private Health Insurance,,,,,false,82210.13,18556.51
New York City,Manhattan,7002053,001446,NYU Langone Orthopedic Hospital,50 to 69,112,F,Black/African American,Not Span/Hispanic,5,Elective,Skilled Nursing Home,2019,MUS006,OSTEOARTHRITIS,MST008,ARTHROPLASTY OF OTHER JOINT (EXCLUDING KNEE AND HIP),313,KNEE & LOWER LEG PROCEDURES EXCEPT FOOT,08,DISEASES AND DISORDERS OF THE MUSCULOSKELETAL SYSTEM AND CONNECTIVE TISSUE,2,Moderate,Minor,Surgical,Miscellaneous/Other,Medicare,Blue Cross/Blue Shield,,,false,269448.45,50752.57
New York City,Manhattan,7002053,001446,NYU Langone Orthopedic Hospital,30 to 49,113,F,White,Not Span/Hispanic,2,Elective,Home w/ Home Health Services,2019,INJ035,"COMPLICATION OF INTERNAL ORTHOPEDIC DEVICE OR IMPLANT, INITIAL ENCOUNTER",MST006,KNEE ARTHROPLASTY,313,KNEE & LOWER LEG PROCEDURES EXCEPT FOOT,08,DISEASES AND DISORDERS OF THE MUSCULOSKELETAL SYSTEM AND CONNECTIVE TISSUE,2,Moderate,Moderate,Surgical,Medicare,Medicaid,,,,false,141873.06,25179.37
New York City,Manhattan,7002053,001446,NYU Langone Orthopedic Hospital,50 to 69,113,F,Other Race,Not Span/Hispanic,3,Emergency,Home w/ Home Health Services,2019,INJ005,"FRACTURE OF THE LOWER LIMB (EXCEPT HIP), INITIAL ENCOUNTER",MST011,FIXATION OF LEG AND FOOT BONES,313,KNEE & LOWER LEG PROCEDURES EXCEPT FOOT,08,DISEASES AND DISORDERS OF THE MUSCULOSKELETAL SYSTEM AND CONNECTIVE TISSUE,1,Minor,Minor,Surgical,Blue Cross/Blue Shield,,,,,true,106490.89,22723.31
New York City,Manhattan,7002053,001446,NYU Langone Orthopedic Hospital,18 to 29,,F,White,Not Span/Hispanic,5,Elective,Home w/ Home Health Services,2019,MUS001,INFECTIVE ARTHRITIS,MST017,JOINT TISSUE EXCISION (EXCLUDING DISCECTOMY),313,KNEE & LOWER LEG PROCEDURES EXCEPT FOOT,08,DISEASES AND DISORDERS OF THE MUSCULOSKELETAL SYSTEM AND CONNECTIVE TISSUE,3,Major,Major,Surgical,Private Health Insurance,,,,,false,78667.95,23084.83
New York City,Manhattan,7002053,001446,NYU Langone Orthopedic Hospital,70 or Older,113,F,Other Race,Not Span/Hispanic,4,Emergency,Skilled Nursing Home,2019,INJ005,"FRACTURE OF THE LOWER LIMB (EXCEPT HIP), INITIAL ENCOUNTER",MST011,FIXATION OF LEG AND FOOT BONES,313,KNEE & LOWER LEG PROCEDURES EXCEPT FOOT,08,DISEASES AND DISORDERS OF THE MUSCULOSKELETAL SYSTEM AND CONNECTIVE TISSUE,1,Minor,Minor,Surgical,Medicare,Blue Cross/Blue Shield,,,,true,135760.58,32831.92
New York City,Manhattan,7002053,001446,NYU Langone Orthopedic Hospital,50 to 69,112,F,Other Race,Not Span/Hispanic,12,Emergency,Skilled Nursing Home,2019,INJ005,"FRACTURE OF THE LOWER LIMB (EXCEPT HIP), INITIAL ENCOUNTER",MST028,"SUBCUTANEOUS TISSUE AND FASCIA PROCEDURES, NEC",313,KNEE & LOWER LEG PROCEDURES EXCEPT FOOT,08,DISEASES AND DISORDERS OF THE MUSCULOSKELETAL SYSTEM AND CONNECTIVE TISSUE,4,Extreme,Major,Surgical,Medicare,Medicaid,,,,true,419573.01,84388.63
New York City,Manhattan,7002053,001446,NYU Langone Orthopedic Hospital,50 to 69,112,F,White,Not Span/Hispanic,2,Elective,Home w/ Home Health Services,2019,INJ005,"FRACTURE OF THE LOWER LIMB (EXCEPT HIP), INITIAL ENCOUNTER",MST030,"MUSCULOSKELETAL PROCEDURES, NEC",313,KNEE & LOWER LEG PROCEDURES EXCEPT FOOT,08,DISEASES AND DISORDERS OF THE MUSCULOSKELETAL SYSTEM AND CONNECTIVE TISSUE,2,Moderate,Minor,Surgical,Medicare,Medicare,,,,false,114322.72,21659.22
New York City,Manhattan,7002053,001446,NYU Langone Orthopedic Hospital,50 to 69,100,F,Other Race,Not Span/Hispanic,6,Emergency,Home w/ Home Health Services,2019,INJ005,"FRACTURE OF THE LOWER LIMB (EXCEPT HIP), INITIAL ENCOUNTER",MST011,FIXATION OF LEG AND FOOT BONES,313,KNEE & LOWER LEG PROCEDURES EXCEPT FOOT,08,DISEASES AND DISORDERS OF THE MUSCULOSKELETAL SYSTEM AND CONNECTIVE TISSUE,2,Moderate,Minor,Surgical,Medicare,Medicaid,,,,true,177880.12,36648.87
New York City,Manhattan,7002053,001446,NYU Langone Orthopedic Hospital,50 to 69,OOS,F,White,Not Span/Hispanic,4,Elective,Skilled Nursing Home,2019,INJ005,"FRACTURE OF THE LOWER LIMB (EXCEPT HIP), INITIAL ENCOUNTER",MST011,FIXATION OF LEG AND FOOT BONES,313,KNEE & LOWER LEG PROCEDURES EXCEPT FOOT,08,DISEASES AND DISORDERS OF THE MUSCULOSKELETAL SYSTEM AND CONNECTIVE TISSUE,2,Moderate,Minor,Surgical,Private Health Insurance,,,,,false,248505.64,45265.38
New York City,Manhattan,7002053,001446,NYU Langone Orthopedic Hospital,50 to 69,103,F,White,Not Span/Hispanic,1,Elective,Home or Self Care,2019,MUS031,TRAUMATIC ARTHROPATHY,MST008,ARTHROPLASTY OF OTHER JOINT (EXCLUDING KNEE AND HIP),313,KNEE & LOWER LEG PROCEDURES EXCEPT FOOT,08,DISEASES AND DISORDERS OF THE MUSCULOSKELETAL SYSTEM AND CONNECTIVE TISSUE,2,Moderate,Minor,Surgical,Private Health Insurance,,,,,false,347685.88,53755.84
New York City,Manhattan,7002053,001446,NYU Langone Orthopedic Hospital,50 to 69,100,F,Other Race,Not Span/Hispanic,4,Elective,Skilled Nursing Home,2019,MUS007,OTHER SPECIFIED JOINT DISORDERS,MST028,"SUBCUTANEOUS TISSUE AND FASCIA PROCEDURES, NEC",313,KNEE & LOWER LEG PROCEDURES EXCEPT FOOT,08,DISEASES AND DISORDERS OF THE MUSCULOSKELETAL SYSTEM AND CONNECTIVE TISSUE,3,Major,Minor,Surgical,Medicaid,,,,,false,227746.92,41431.13
New York City,Manhattan,7002053,001446,NYU Langone Orthopedic Hospital,50 to 69,112,F,Black/African American,Not Span/Hispanic,2,Elective,Skilled Nursing Home,2019,MUS007,OTHER SPECIFIED JOINT DISORDERS,MST030,"MUSCULOSKELETAL PROCEDURES, NEC",313,KNEE & LOWER LEG PROCEDURES EXCEPT FOOT,08,DISEASES AND DISORDERS OF THE MUSCULOSKELETAL SYSTEM AND CONNECTIVE TISSUE,2,Moderate,Minor,Surgical,Private Health Insurance,Medicare,,,,false,60152.92,13385.51
New York City,Manhattan,7002053,001446,NYU Langone Orthopedic Hospital,70 or Older,100,F,Other Race,Not Span/Hispanic,3,Urgent,Skilled Nursing Home,2019,INJ005,"FRACTURE OF THE LOWER LIMB (EXCEPT HIP), INITIAL ENCOUNTER",MST011,FIXATION OF LEG AND FOOT BONES,313,KNEE & LOWER LEG PROCEDURES EXCEPT FOOT,08,DISEASES AND DISORDERS OF THE MUSCULOSKELETAL SYSTEM AND CONNECTIVE TISSUE,1,Minor,Minor,Surgical,Medicare,,,,,false,169009.91,31822.29
New York City,Manhattan,7002053,001446,NYU Langone Orthopedic Hospital,70 or Older,117,F,White,Not Span/Hispanic,1,Elective,Home w/ Home Health Services,2019,INJ035,"COMPLICATION OF INTERNAL ORTHOPEDIC DEVICE OR IMPLANT, INITIAL ENCOUNTER",MST029,"MUSCULOSKELETAL DEVICE PROCEDURES, NEC",313,KNEE & LOWER LEG PROCEDURES EXCEPT FOOT,08,DISEASES AND DISORDERS OF THE MUSCULOSKELETAL SYSTEM AND CONNECTIVE TISSUE,2,Moderate,Minor,Surgical,Medicare,Medicare,,,,false,75973.79,13485.88
New York City,Manhattan,7002053,001446,NYU Langone Orthopedic Hospital,50 to 69,OOS,F,Black/African American,Not Span/Hispanic,1,Elective,Home w/ Home Health Services,2019,MUS031,TRAUMATIC ARTHROPATHY,MST008,ARTHROPLASTY OF OTHER JOINT (EXCLUDING KNEE AND HIP),313,KNEE & LOWER LEG PROCEDURES EXCEPT FOOT,08,DISEASES AND DISORDERS OF THE MUSCULOSKELETAL SYSTEM AND CONNECTIVE TISSUE,2,Moderate,Minor,Surgical,Miscellaneous/Other,Medicaid,,,,false,304028.09,47448.25