Hospital Service Area,Hospital County,Operating Certificate Number,Permanent Facility Id,Facility Name,Age Group,Zip Code - 3 digits,Gender,Race,Ethnicity,Length of Stay,Type of Admission,Patient Disposition,Discharge Year,CCS Diagnosis Code,CCS Diagnosis Description,CCS Procedure Code,CCS Procedure Description,APR DRG Code,APR DRG Description,APR MDC Code,APR MDC Description,APR Severity of Illness Code,APR Severity of Illness Description,APR Risk of Mortality,APR Medical Surgical Description,Payment Typology 1,Payment Typology 2,Payment Typology 3,Birth Weight,Abortion Edit Indicator,Emergency Department Indicator,Total Charges,Total Costs
Hudson Valley,Westchester,5902001,001045,White Plains Hospital Center,70 or Older,106,M,Other Race,Not Span/Hispanic,7,Elective,Home w/ Home Health Services,2019,END003,DIABETES MELLITUS WITH COMPLICATION,MST023,TOE AND MID FOOT AMPUTATION,314,FOOT & TOE PROCEDURES,08,DISEASES AND DISORDERS OF THE MUSCULOSKELETAL SYSTEM AND CONNECTIVE TISSUE,3,Major,Major,Surgical,Medicare,Private Health Insurance,,,,false,55531,12856.27
New York City,Manhattan,7002017,001450,Lenox Hill Hospital,50 to 69,100,M,White,Not Span/Hispanic,5,Emergency,Home or Self Care,2019,END003,DIABETES MELLITUS WITH COMPLICATION,MST023,TOE AND MID FOOT AMPUTATION,314,FOOT & TOE PROCEDURES,08,DISEASES AND DISORDERS OF THE MUSCULOSKELETAL SYSTEM AND CONNECTIVE TISSUE,3,Major,Major,Surgical,Private Health Insurance,Medicare,Private Health Insurance,,,true,80342.44,16869.52
Long Island,Suffolk,5151001,000245,Stony Brook University Hospital,30 to 49,117,M,Other Race,Not Span/Hispanic,7,Emergency,Home or Self Care,2019,INJ005,"FRACTURE OF THE LOWER LIMB (EXCEPT HIP), INITIAL ENCOUNTER",MST011,FIXATION OF LEG AND FOOT BONES,314,FOOT & TOE PROCEDURES,08,DISEASES AND DISORDERS OF THE MUSCULOSKELETAL SYSTEM AND CONNECTIVE TISSUE,2,Moderate,Minor,Surgical,Miscellaneous/Other,Medicaid,Medicaid,,,true,89347.1,27473.19
Finger Lakes,Monroe,2701003,000411,Rochester General Hospital,50 to 69,146,F,White,Not Span/Hispanic,1,Elective,Home w/ Home Health Services,2019,INJ005,"FRACTURE OF THE LOWER LIMB (EXCEPT HIP), INITIAL ENCOUNTER",MST011,FIXATION OF LEG AND FOOT BONES,314,FOOT & TOE PROCEDURES,08,DISEASES AND DISORDERS OF THE MUSCULOSKELETAL SYSTEM AND CONNECTIVE TISSUE,2,Moderate,Minor,Surgical,Miscellaneous/Other,Blue Cross/Blue Shield,,,,false,21686.49,6569.9
New York City,Manhattan,7002017,001450,Lenox Hill Hospital,50 to 69,101,M,White,Not Span/Hispanic,4,Elective,Home or Self Care,2019,END003,DIABETES MELLITUS WITH COMPLICATION,MST023,TOE AND MID FOOT AMPUTATION,314,FOOT & TOE PROCEDURES,08,DISEASES AND DISORDERS OF THE MUSCULOSKELETAL SYSTEM AND CONNECTIVE TISSUE,2,Moderate,Minor,Surgical,Medicare,Private Health Insurance,,,,false,75565.16,13611.52
New York City,Bronx,7000008,001172,Lincoln Medical & Mental Health Center,50 to 69,104,M,Other Race,Spanish/Hispanic,7,Emergency,Home or Self Care,2019,END003,DIABETES MELLITUS WITH COMPLICATION,MST023,TOE AND MID FOOT AMPUTATION,314,FOOT & TOE PROCEDURES,08,DISEASES AND DISORDERS OF THE MUSCULOSKELETAL SYSTEM AND CONNECTIVE TISSUE,2,Moderate,Minor,Surgical,Medicaid,,,,,true,39943.58,23588.96
New York City,Bronx,7000008,001172,Lincoln Medical & Mental Health Center,50 to 69,104,M,Other Race,Spanish/Hispanic,3,Emergency,Home or Self Care,2019,END003,DIABETES MELLITUS WITH COMPLICATION,MST023,TOE AND MID FOOT AMPUTATION,314,FOOT & TOE PROCEDURES,08,DISEASES AND DISORDERS OF THE MUSCULOSKELETAL SYSTEM AND CONNECTIVE TISSUE,1,Minor,Minor,Surgical,Medicare,Medicare,,,,true,16969.78,10021.62
Capital/Adirond,Albany,0101000,000001,Albany Medical Center Hospital,50 to 69,121,F,White,Not Span/Hispanic,2,Elective,Inpatient Rehabilitation Facility,2019,MUS009,TENDON AND SYNOVIAL DISORDERS,MST019,"MUSCLE, TENDON, BURSA, AND LIGAMENT EXCISION",314,FOOT & TOE PROCEDURES,08,DISEASES AND DISORDERS OF THE MUSCULOSKELETAL SYSTEM AND CONNECTIVE TISSUE,2,Moderate,Minor,Surgical,Medicare,Blue Cross/Blue Shield,,,,false,44840.9,24700.81
New York City,Kings,7001021,001306,New York - Presbyterian Brooklyn Methodist Hospital,50 to 69,112,F,Black/African American,Not Span/Hispanic,13,Emergency,Home w/ Home Health Services,2019,END003,DIABETES MELLITUS WITH COMPLICATION,MST023,TOE AND MID FOOT AMPUTATION,314,FOOT & TOE PROCEDURES,08,DISEASES AND DISORDERS OF THE MUSCULOSKELETAL SYSTEM AND CONNECTIVE TISSUE,4,Extreme,Major,Surgical,Medicare,Medicare,Medicaid,,,true,107757.53,29618.29
New York City,Manhattan,7002024,001456,Mount Sinai Hospital,50 to 69,117,F,Black/African American,Not Span/Hispanic,3,Elective,Home w/ Home Health Services,2019,INJ024,"SPRAINS AND STRAINS, INITIAL ENCOUNTER",MST030,"MUSCULOSKELETAL PROCEDURES, NEC",314,FOOT & TOE PROCEDURES,08,DISEASES AND DISORDERS OF THE MUSCULOSKELETAL SYSTEM AND CONNECTIVE TISSUE,3,Major,Minor,Surgical,Private Health Insurance,Self-Pay,,,,false,54695.06,18867.44
Hudson Valley,Westchester,5902001,001045,White Plains Hospital Center,50 to 69,105,M,Other Race,Not Span/Hispanic,10,Emergency,Home w/ Home Health Services,2019,END003,DIABETES MELLITUS WITH COMPLICATION,MST018,BONE EXCISION,314,FOOT & TOE PROCEDURES,08,DISEASES AND DISORDERS OF THE MUSCULOSKELETAL SYSTEM AND CONNECTIVE TISSUE,2,Moderate,Moderate,Surgical,Medicaid,,,,,true,70546,17842.47
New York City,Manhattan,7002053,001463,NYU Langone Hospitals,50 to 69,101,M,White,Not Span/Hispanic,8,Emergency,Home or Self Care,2019,MUS002,OSTEOMYELITIS,MST023,TOE AND MID FOOT AMPUTATION,314,FOOT & TOE PROCEDURES,08,DISEASES AND DISORDERS OF THE MUSCULOSKELETAL SYSTEM AND CONNECTIVE TISSUE,3,Major,Major,Surgical,Blue Cross/Blue Shield,,,,,true,126752.26,35949.75
Long Island,Suffolk,5154001,000925,Good Samaritan Hospital Medical Center,50 to 69,117,F,White,Not Span/Hispanic,21,Emergency,Skilled Nursing Home,2019,END003,DIABETES MELLITUS WITH COMPLICATION,MST004,INCISION AND DRAINAGE OF MUSCULOSKELETAL TISSUE AND JOINTS,314,FOOT & TOE PROCEDURES,08,DISEASES AND DISORDERS OF THE MUSCULOSKELETAL SYSTEM AND CONNECTIVE TISSUE,4,Extreme,Major,Surgical,Medicare,Medicare,,,,true,301972.81,57078.42
Western NY,Erie,1401014,000208,John R. Oishei Children's Hospital,0 to 17,142,F,Black/African American,Not Span/Hispanic,1,Elective,Home or Self Care,2019,MUS021,ACQUIRED FOOT DEFORMITIES,MST030,"MUSCULOSKELETAL PROCEDURES, NEC",314,FOOT & TOE PROCEDURES,08,DISEASES AND DISORDERS OF THE MUSCULOSKELETAL SYSTEM AND CONNECTIVE TISSUE,2,Moderate,Moderate,Surgical,Medicaid,Self-Pay,,,,false,29033.95,10332.22
New York City,Manhattan,7002012,001447,Hospital for Special Surgery,50 to 69,OOS,F,White,Not Span/Hispanic,1,Elective,Home w/ Home Health Services,2019,MUS021,ACQUIRED FOOT DEFORMITIES,MST014,JOINT FUSION (EXCLUDING SPINE),314,FOOT & TOE PROCEDURES,08,DISEASES AND DISORDERS OF THE MUSCULOSKELETAL SYSTEM AND CONNECTIVE TISSUE,2,Moderate,Minor,Surgical,Private Health Insurance,,,,,false,46821,17272.01
New York City,Manhattan,7002012,001447,Hospital for Special Surgery,50 to 69,OOS,F,White,Not Span/Hispanic,1,Elective,Home or Self Care,2019,MUS021,ACQUIRED FOOT DEFORMITIES,MST014,JOINT FUSION (EXCLUDING SPINE),314,FOOT & TOE PROCEDURES,08,DISEASES AND DISORDERS OF THE MUSCULOSKELETAL SYSTEM AND CONNECTIVE TISSUE,2,Moderate,Minor,Surgical,Blue Cross/Blue Shield,,,,,false,44862,16511.05
New York City,Manhattan,7002024,001456,Mount Sinai Hospital,70 or Older,100,F,Black/African American,Not Span/Hispanic,11,Emergency,Inpatient Rehabilitation Facility,2019,MUS002,OSTEOMYELITIS,MST023,TOE AND MID FOOT AMPUTATION,314,FOOT & TOE PROCEDURES,08,DISEASES AND DISORDERS OF THE MUSCULOSKELETAL SYSTEM AND CONNECTIVE TISSUE,3,Major,Major,Surgical,Medicare,Medicare,Medicaid,,,true,115564.14,38476.59
New York City,Manhattan,7002024,001456,Mount Sinai Hospital,50 to 69,104,F,Black/African American,Not Span/Hispanic,9,Urgent,Home or Self Care,2019,INJ005,"FRACTURE OF THE LOWER LIMB (EXCEPT HIP), INITIAL ENCOUNTER",MST022,"TENDON, MUSCLE, BURSA, AND LIGAMENT REPAIR (EXCLUDING PERINEAL)",314,FOOT & TOE PROCEDURES,08,DISEASES AND DISORDERS OF THE MUSCULOSKELETAL SYSTEM AND CONNECTIVE TISSUE,3,Major,Moderate,Surgical,Private Health Insurance,Self-Pay,,,,false,126447.53,43060.36
Capital/Adirond,Schenectady,4601001,000829,Ellis Hospital,50 to 69,123,M,White,Not Span/Hispanic,14,Emergency,Home w/ Home Health Services,2019,END003,DIABETES MELLITUS WITH COMPLICATION,MST023,TOE AND MID FOOT AMPUTATION,314,FOOT & TOE PROCEDURES,08,DISEASES AND DISORDERS OF THE MUSCULOSKELETAL SYSTEM AND CONNECTIVE TISSUE,4,Extreme,Moderate,Surgical,Medicare,Medicare,,,,false,164977.92,40539.08
Hudson Valley,Dutchess,5957001,000180,Mid-Hudson Valley Division of Westchester Medical Center,50 to 69,126,M,White,Not Span/Hispanic,6,Emergency,Home or Self Care,2019,END003,DIABETES MELLITUS WITH COMPLICATION,MST023,TOE AND MID FOOT AMPUTATION,314,FOOT & TOE PROCEDURES,08,DISEASES AND DISORDERS OF THE MUSCULOSKELETAL SYSTEM AND CONNECTIVE TISSUE,3,Major,Moderate,Surgical,Medicare,Medicare,,,,true,123619.24,22407.6
New York City,Kings,7001046,001309,Interfaith Medical Center,30 to 49,112,M,Black/African American,Not Span/Hispanic,10,Elective,Home or Self Care,2019,MUS002,OSTEOMYELITIS,MST018,BONE EXCISION,314,FOOT & TOE PROCEDURES,08,DISEASES AND DISORDERS OF THE MUSCULOSKELETAL SYSTEM AND CONNECTIVE TISSUE,2,Moderate,Moderate,Surgical,Medicare,Medicare,Medicaid,,,true,88663.56,35713.15
Southern Tier,Broome,0301001,000043,Our Lady of Lourdes Memorial Hospital,70 or Older,139,M,White,Not Span/Hispanic,5,Elective,Home w/ Home Health Services,2019,END003,DIABETES MELLITUS WITH COMPLICATION,MST023,TOE AND MID FOOT AMPUTATION,314,FOOT & TOE PROCEDURES,08,DISEASES AND DISORDERS OF THE MUSCULOSKELETAL SYSTEM AND CONNECTIVE TISSUE,2,Moderate,Moderate,Surgical,Medicare,Self-Pay,Self-Pay,,,false,27935.01,10735.43
New York City,Bronx,7000001,001178,BronxCare Hospital Center,70 or Older,104,M,Other Race,Spanish/Hispanic,7,Emergency,Home or Self Care,2019,END003,DIABETES MELLITUS WITH COMPLICATION,MST023,TOE AND MID FOOT AMPUTATION,314,FOOT & TOE PROCEDURES,08,DISEASES AND DISORDERS OF THE MUSCULOSKELETAL SYSTEM AND CONNECTIVE TISSUE,3,Major,Major,Surgical,Medicare,Medicaid,,,,true,24885.69,31960.18
Southern Tier,Broome,0303001,000058,United Health Services Hospitals Inc. - Wilson Medical Center,18 to 29,139,M,White,Not Span/Hispanic,3,Emergency,Home or Self Care,2019,INJ005,"FRACTURE OF THE LOWER LIMB (EXCEPT HIP), INITIAL ENCOUNTER",MST011,FIXATION OF LEG AND FOOT BONES,314,FOOT & TOE PROCEDURES,08,DISEASES AND DISORDERS OF THE MUSCULOSKELETAL SYSTEM AND CONNECTIVE TISSUE,3,Major,Minor,Surgical,Blue Cross/Blue Shield,,,,,true,43301.7,14741.77
New York City,Manhattan,7002054,003975,New York Presbyterian Hospital - Allen Hospital,30 to 49,,M,Multi-racial,Not Span/Hispanic,3,Emergency,Home w/ Home Health Services,2019,END003,DIABETES MELLITUS WITH COMPLICATION,MST018,BONE EXCISION,314,FOOT & TOE PROCEDURES,08,DISEASES AND DISORDERS OF THE MUSCULOSKELETAL SYSTEM AND CONNECTIVE TISSUE,2,Moderate,Moderate,Surgical,Blue Cross/Blue Shield,Self-Pay,,,,true,41296.3,8738.69
Finger Lakes,Monroe,2701005,000413,Strong Memorial Hospital,18 to 29,146,M,Black/African American,Not Span/Hispanic,1,Emergency,Home or Self Care,2019,INJ005,"FRACTURE OF THE LOWER LIMB (EXCEPT HIP), INITIAL ENCOUNTER",MST011,FIXATION OF LEG AND FOOT BONES,314,FOOT & TOE PROCEDURES,08,DISEASES AND DISORDERS OF THE MUSCULOSKELETAL SYSTEM AND CONNECTIVE TISSUE,1,Minor,Minor,Surgical,Miscellaneous/Other,,,,,true,17472.93,7278.11
New York City,Queens,7003010,001637,New York - Presbyterian/Queens,50 to 69,113,F,White,Not Span/Hispanic,6,Emergency,Home w/ Home Health Services,2019,INJ005,"FRACTURE OF THE LOWER LIMB (EXCEPT HIP), INITIAL ENCOUNTER",MST011,FIXATION OF LEG AND FOOT BONES,314,FOOT & TOE PROCEDURES,08,DISEASES AND DISORDERS OF THE MUSCULOSKELETAL SYSTEM AND CONNECTIVE TISSUE,3,Major,Minor,Surgical,Private Health Insurance,,,,,true,82670.55,29492.26
New York City,Kings,7001021,001306,New York - Presbyterian Brooklyn Methodist Hospital,30 to 49,112,F,Black/African American,Not Span/Hispanic,3,Emergency,Home w/ Home Health Services,2019,END003,DIABETES MELLITUS WITH COMPLICATION,MST023,TOE AND MID FOOT AMPUTATION,314,FOOT & TOE PROCEDURES,08,DISEASES AND DISORDERS OF THE MUSCULOSKELETAL SYSTEM AND CONNECTIVE TISSUE,3,Major,Minor,Surgical,"Managed Care, Unspecified",Medicaid,Self-Pay,,,true,41851.3,12677.03
Western NY,Erie,1401014,003067,Millard Fillmore Suburban Hospital,50 to 69,140,M,White,Not Span/Hispanic,5,Emergency,Skilled Nursing Home,2019,END003,DIABETES MELLITUS WITH COMPLICATION,MST018,BONE EXCISION,314,FOOT & TOE PROCEDURES,08,DISEASES AND DISORDERS OF THE MUSCULOSKELETAL SYSTEM AND CONNECTIVE TISSUE,3,Major,Major,Surgical,Medicare,Self-Pay,,,,true,28390.37,10665.49
New York City,Manhattan,7002053,001446,NYU Langone Orthopedic Hospital,50 to 69,100,M,White,Not Span/Hispanic,1,Elective,Home w/ Home Health Services,2019,END003,DIABETES MELLITUS WITH COMPLICATION,MST023,TOE AND MID FOOT AMPUTATION,314,FOOT & TOE PROCEDURES,08,DISEASES AND DISORDERS OF THE MUSCULOSKELETAL SYSTEM AND CONNECTIVE TISSUE,3,Major,Minor,Surgical,Medicaid,,,,,false,50602.77,9059.64
Capital/Adirond,Warren,5601000,001005,Glens Falls Hospital,50 to 69,128,M,White,Not Span/Hispanic,23,Emergency,Skilled Nursing Home,2019,END003,DIABETES MELLITUS WITH COMPLICATION,MST023,TOE AND MID FOOT AMPUTATION,314,FOOT & TOE PROCEDURES,08,DISEASES AND DISORDERS OF THE MUSCULOSKELETAL SYSTEM AND CONNECTIVE TISSUE,2,Moderate,Moderate,Surgical,Medicare,Medicaid,,,,true,85986.9,37613.3
New York City,Kings,7001033,001315,Kingsbrook Jewish Medical Center,50 to 69,,M,White,Not Span/Hispanic,7,Emergency,Home or Self Care,2019,END003,DIABETES MELLITUS WITH COMPLICATION,MST023,TOE AND MID FOOT AMPUTATION,314,FOOT & TOE PROCEDURES,08,DISEASES AND DISORDERS OF THE MUSCULOSKELETAL SYSTEM AND CONNECTIVE TISSUE,2,Moderate,Minor,Surgical,Medicare,Private Health Insurance,Self-Pay,,,true,57200,20931.58
Southern Tier,Broome,0301001,000043,Our Lady of Lourdes Memorial Hospital,70 or Older,139,M,White,Not Span/Hispanic,49,Emergency,Skilled Nursing Home,2019,INJ037,"COMPLICATION OF OTHER SURGICAL OR MEDICAL CARE, INJURY, INITIAL ENCOUNTER",MST020,SUBCUTANEOUS TISSUE AND FASCIA EXCISION,314,FOOT & TOE PROCEDURES,08,DISEASES AND DISORDERS OF THE MUSCULOSKELETAL SYSTEM AND CONNECTIVE TISSUE,4,Extreme,Extreme,Surgical,Medicare,Medicare,Private Health Insurance,,,true,283123.81,101291.72
Hudson Valley,Westchester,5957001,001139,Westchester Medical Center,70 or Older,125,M,White,Not Span/Hispanic,12,Urgent,Skilled Nursing Home,2019,CIR026,PERIPHERAL AND VISCERAL VASCULAR DISEASE,MST023,TOE AND MID FOOT AMPUTATION,314,FOOT & TOE PROCEDURES,08,DISEASES AND DISORDERS OF THE MUSCULOSKELETAL SYSTEM AND CONNECTIVE TISSUE,2,Moderate,Moderate,Surgical,Medicare,Private Health Insurance,,,,false,208355.5,39413.07
New York City,Richmond,7004010,001738,Richmond University Medical Center,30 to 49,103,M,Other Race,Spanish/Hispanic,2,Emergency,Home w/ Home Health Services,2019,END003,DIABETES MELLITUS WITH COMPLICATION,MST018,BONE EXCISION,314,FOOT & TOE PROCEDURES,08,DISEASES AND DISORDERS OF THE MUSCULOSKELETAL SYSTEM AND CONNECTIVE TISSUE,3,Major,Moderate,Surgical,Private Health Insurance,Self-Pay,Self-Pay,,,true,31690.02,8421.39
Finger Lakes,Monroe,2701003,000411,Rochester General Hospital,30 to 49,144,F,White,Not Span/Hispanic,8,Emergency,Home or Self Care,2019,END003,DIABETES MELLITUS WITH COMPLICATION,MST023,TOE AND MID FOOT AMPUTATION,314,FOOT & TOE PROCEDURES,08,DISEASES AND DISORDERS OF THE MUSCULOSKELETAL SYSTEM AND CONNECTIVE TISSUE,3,Major,Moderate,Surgical,Medicaid,,,,,true,25157.69,11063.06
New York City,Manhattan,7002054,001464,New York-Presbyterian Hospital - Columbia Presbyterian Center,50 to 69,100,M,Other Race,Not Span/Hispanic,5,Emergency,Home w/ Home Health Services,2019,END003,DIABETES MELLITUS WITH COMPLICATION,MST023,TOE AND MID FOOT AMPUTATION,314,FOOT & TOE PROCEDURES,08,DISEASES AND DISORDERS OF THE MUSCULOSKELETAL SYSTEM AND CONNECTIVE TISSUE,3,Major,Moderate,Surgical,Private Health Insurance,Medicare,Self-Pay,,,true,81705.22,20723.81
Long Island,Nassau,2953000,000563,St. Francis Hospital & Heart Center,50 to 69,117,M,White,Not Span/Hispanic,5,Emergency,Home w/ Home Health Services,2019,END003,DIABETES MELLITUS WITH COMPLICATION,MST018,BONE EXCISION,314,FOOT & TOE PROCEDURES,08,DISEASES AND DISORDERS OF THE MUSCULOSKELETAL SYSTEM AND CONNECTIVE TISSUE,2,Moderate,Moderate,Surgical,Medicare,Medicare,,,,true,53718.61,10376.03
New York City,Kings,7002002,001324,Mount Sinai Brooklyn,50 to 69,112,M,Black/African American,Not Span/Hispanic,10,Emergency,Home w/ Home Health Services,2019,END003,DIABETES MELLITUS WITH COMPLICATION,MST023,TOE AND MID FOOT AMPUTATION,314,FOOT & TOE PROCEDURES,08,DISEASES AND DISORDERS OF THE MUSCULOSKELETAL SYSTEM AND CONNECTIVE TISSUE,3,Major,Moderate,Surgical,Blue Cross/Blue Shield,Self-Pay,,,,true,119366.53,21870.92
Western NY,Erie,1401005,000210,Erie County Medical Center,50 to 69,141,F,White,Not Span/Hispanic,3,Elective,Home or Self Care,2019,MUS003,RHEUMATOID ARTHRITIS AND RELATED DISEASE,MST014,JOINT FUSION (EXCLUDING SPINE),314,FOOT & TOE PROCEDURES,08,DISEASES AND DISORDERS OF THE MUSCULOSKELETAL SYSTEM AND CONNECTIVE TISSUE,2,Moderate,Minor,Surgical,Medicare,Medicaid,Medicare,,,false,42162.35,24087.86
New York City,Kings,7001021,001306,New York - Presbyterian Brooklyn Methodist Hospital,70 or Older,112,M,White,Not Span/Hispanic,8,Emergency,Home w/ Home Health Services,2019,END003,DIABETES MELLITUS WITH COMPLICATION,MST023,TOE AND MID FOOT AMPUTATION,314,FOOT & TOE PROCEDURES,08,DISEASES AND DISORDERS OF THE MUSCULOSKELETAL SYSTEM AND CONNECTIVE TISSUE,3,Major,Major,Surgical,Medicare,Medicaid,Self-Pay,,,false,76675.99,25752.69
Capital/Adirond,Schenectady,4601001,000829,Ellis Hospital,50 to 69,123,F,White,Not Span/Hispanic,19,Emergency,Skilled Nursing Home,2019,END003,DIABETES MELLITUS WITH COMPLICATION,MST018,BONE EXCISION,314,FOOT & TOE PROCEDURES,08,DISEASES AND DISORDERS OF THE MUSCULOSKELETAL SYSTEM AND CONNECTIVE TISSUE,3,Major,Major,Surgical,Medicare,Medicare,Medicaid,,,true,143686.15,40347
New York City,Bronx,7000006,003058,Montefiore Med Center - Jack D Weiler Hosp of A Einstein College Div,50 to 69,104,M,White,Not Span/Hispanic,15,Emergency,Home w/ Home Health Services,2019,END003,DIABETES MELLITUS WITH COMPLICATION,MST023,TOE AND MID FOOT AMPUTATION,314,FOOT & TOE PROCEDURES,08,DISEASES AND DISORDERS OF THE MUSCULOSKELETAL SYSTEM AND CONNECTIVE TISSUE,3,Major,Major,Surgical,Medicare,Private Health Insurance,,,,true,183368.11,34953.75
Hudson Valley,Westchester,5957001,001139,Westchester Medical Center,50 to 69,100,M,Black/African American,Not Span/Hispanic,2,Emergency,Home or Self Care,2019,END003,DIABETES MELLITUS WITH COMPLICATION,MST023,TOE AND MID FOOT AMPUTATION,314,FOOT & TOE PROCEDURES,08,DISEASES AND DISORDERS OF THE MUSCULOSKELETAL SYSTEM AND CONNECTIVE TISSUE,3,Major,Moderate,Surgical,Blue Cross/Blue Shield,,,,,true,63256.95,11578.14
New York City,Kings,7001021,001306,New York - Presbyterian Brooklyn Methodist Hospital,50 to 69,112,M,White,Not Span/Hispanic,8,Emergency,Home w/ Home Health Services,2019,END003,DIABETES MELLITUS WITH COMPLICATION,MST020,SUBCUTANEOUS TISSUE AND FASCIA EXCISION,314,FOOT & TOE PROCEDURES,08,DISEASES AND DISORDERS OF THE MUSCULOSKELETAL SYSTEM AND CONNECTIVE TISSUE,4,Extreme,Minor,Surgical,Private Health Insurance,Self-Pay,,,,true,66343.2,19815.37
New York City,Bronx,7000001,001178,BronxCare Hospital Center,50 to 69,104,M,Other Race,Spanish/Hispanic,14,Emergency,Home or Self Care,2019,MUS002,OSTEOMYELITIS,MST018,BONE EXCISION,314,FOOT & TOE PROCEDURES,08,DISEASES AND DISORDERS OF THE MUSCULOSKELETAL SYSTEM AND CONNECTIVE TISSUE,3,Major,Major,Surgical,Medicaid,,,,,true,41428.6,55602.42
Capital/Adirond,Albany,0101004,000005,St. Peter's Hospital,50 to 69,121,M,White,Not Span/Hispanic,3,Emergency,Home or Self Care,2019,END003,DIABETES MELLITUS WITH COMPLICATION,MST018,BONE EXCISION,314,FOOT & TOE PROCEDURES,08,DISEASES AND DISORDERS OF THE MUSCULOSKELETAL SYSTEM AND CONNECTIVE TISSUE,2,Moderate,Moderate,Surgical,Private Health Insurance,,,,,true,23468.4,8151.59
New York City,Richmond,7004003,001740,Staten Island University Hosp-North,50 to 69,103,M,White,Not Span/Hispanic,4,Emergency,Home w/ Home Health Services,2019,END003,DIABETES MELLITUS WITH COMPLICATION,MST023,TOE AND MID FOOT AMPUTATION,314,FOOT & TOE PROCEDURES,08,DISEASES AND DISORDERS OF THE MUSCULOSKELETAL SYSTEM AND CONNECTIVE TISSUE,3,Major,Minor,Surgical,Blue Cross/Blue Shield,,,,,true,74721.73,20471.3
New York City,Queens,7003004,001638,Long Island Jewish Forest Hills,70 or Older,114,M,Black/African American,Not Span/Hispanic,9,Emergency,Home w/ Home Health Services,2019,END003,DIABETES MELLITUS WITH COMPLICATION,MST023,TOE AND MID FOOT AMPUTATION,314,FOOT & TOE PROCEDURES,08,DISEASES AND DISORDERS OF THE MUSCULOSKELETAL SYSTEM AND CONNECTIVE TISSUE,3,Major,Major,Surgical,Medicare,,,,,true,102017.9,20973.8
Western NY,Erie,1401005,000210,Erie County Medical Center,50 to 69,141,F,White,Not Span/Hispanic,1,Elective,Home or Self Care,2019,INJ025,"INJURY TO NERVES, MUSCLES AND TENDONS, INITIAL ENCOUNTER",MST030,"MUSCULOSKELETAL PROCEDURES, NEC",314,FOOT & TOE PROCEDURES,08,DISEASES AND DISORDERS OF THE MUSCULOSKELETAL SYSTEM AND CONNECTIVE TISSUE,2,Moderate,Minor,Surgical,Miscellaneous/Other,Private Health Insurance,,,,false,16077.66,10097.71
New York City,Manhattan,7002032,001466,Mount Sinai West,50 to 69,104,F,Black/African American,Spanish/Hispanic,10,Elective,Home w/ Home Health Services,2019,INJ037,"COMPLICATION OF OTHER SURGICAL OR MEDICAL CARE, INJURY, INITIAL ENCOUNTER",SKB007,SKIN GRAFT,314,FOOT & TOE PROCEDURES,08,DISEASES AND DISORDERS OF THE MUSCULOSKELETAL SYSTEM AND CONNECTIVE TISSUE,4,Extreme,Major,Surgical,Medicare,Medicaid,Self-Pay,,,false,135235.88,38167.21
Western NY,Erie,1401005,000210,Erie County Medical Center,50 to 69,142,M,White,Not Span/Hispanic,3,Elective,Skilled Nursing Home,2019,INJ035,"COMPLICATION OF INTERNAL ORTHOPEDIC DEVICE OR IMPLANT, INITIAL ENCOUNTER",MST011,FIXATION OF LEG AND FOOT BONES,314,FOOT & TOE PROCEDURES,08,DISEASES AND DISORDERS OF THE MUSCULOSKELETAL SYSTEM AND CONNECTIVE TISSUE,2,Moderate,Minor,Surgical,Miscellaneous/Other,Medicare,Medicaid,,,false,15186.71,10414.57
New York City,Kings,7001021,001306,New York - Presbyterian Brooklyn Methodist Hospital,30 to 49,112,F,Black/African American,Not Span/Hispanic,8,Emergency,Home or Self Care,2019,END003,DIABETES MELLITUS WITH COMPLICATION,MST023,TOE AND MID FOOT AMPUTATION,314,FOOT & TOE PROCEDURES,08,DISEASES AND DISORDERS OF THE MUSCULOSKELETAL SYSTEM AND CONNECTIVE TISSUE,3,Major,Major,Surgical,Medicaid,Self-Pay,,,,true,76486.07,21684.13
Hudson Valley,Dutchess,1327000,000192,Northern Dutchess Hospital,70 or Older,124,M,White,Not Span/Hispanic,5,Emergency,Home or Self Care,2019,END003,DIABETES MELLITUS WITH COMPLICATION,MST018,BONE EXCISION,314,FOOT & TOE PROCEDURES,08,DISEASES AND DISORDERS OF THE MUSCULOSKELETAL SYSTEM AND CONNECTIVE TISSUE,2,Moderate,Moderate,Surgical,Blue Cross/Blue Shield,Medicare,,,,true,29674.91,9432.11
Capital/Adirond,Columbia,1001000,000146,Columbia Memorial Hospital,50 to 69,125,F,Other Race,Not Span/Hispanic,8,Elective,Home or Self Care,2019,INJ005,"FRACTURE OF THE LOWER LIMB (EXCEPT HIP), INITIAL ENCOUNTER",MST011,FIXATION OF LEG AND FOOT BONES,314,FOOT & TOE PROCEDURES,08,DISEASES AND DISORDERS OF THE MUSCULOSKELETAL SYSTEM AND CONNECTIVE TISSUE,3,Major,Minor,Surgical,Medicaid,,,,,true,36531.72,14160.85