Hospital Service Area,Hospital County,Operating Certificate Number,Permanent Facility Id,Facility Name,Age Group,Zip Code - 3 digits,Gender,Race,Ethnicity,Length of Stay,Type of Admission,Patient Disposition,Discharge Year,CCS Diagnosis Code,CCS Diagnosis Description,CCS Procedure Code,CCS Procedure Description,APR DRG Code,APR DRG Description,APR MDC Code,APR MDC Description,APR Severity of Illness Code,APR Severity of Illness Description,APR Risk of Mortality,APR Medical Surgical Description,Payment Typology 1,Payment Typology 2,Payment Typology 3,Birth Weight,Abortion Edit Indicator,Emergency Department Indicator,Total Charges,Total Costs
New York City,Kings,7002053,001304,NYU Langone Hospital-Brooklyn,30 to 49,112,M,Other Race,Not Span/Hispanic,10,Emergency,Home w/ Home Health Services,2019,INJ005,"FRACTURE OF THE LOWER LIMB (EXCEPT HIP), INITIAL ENCOUNTER",MST022,"TENDON, MUSCLE, BURSA, AND LIGAMENT REPAIR (EXCLUDING PERINEAL)",314,FOOT & TOE PROCEDURES,08,DISEASES AND DISORDERS OF THE MUSCULOSKELETAL SYSTEM AND CONNECTIVE TISSUE,3,Major,Minor,Surgical,Miscellaneous/Other,Private Health Insurance,,,,true,143079.5,43138.03
New York City,Kings,7002053,001304,NYU Langone Hospital-Brooklyn,50 to 69,112,F,White,Not Span/Hispanic,17,Emergency,Skilled Nursing Home,2019,END003,DIABETES MELLITUS WITH COMPLICATION,MST018,BONE EXCISION,314,FOOT & TOE PROCEDURES,08,DISEASES AND DISORDERS OF THE MUSCULOSKELETAL SYSTEM AND CONNECTIVE TISSUE,3,Major,Major,Surgical,Medicare,Medicaid,,,,true,230094.2,64564.68
New York City,Kings,7002053,001304,NYU Langone Hospital-Brooklyn,30 to 49,112,M,Other Race,Spanish/Hispanic,3,Emergency,Home or Self Care,2019,END003,DIABETES MELLITUS WITH COMPLICATION,MST023,TOE AND MID FOOT AMPUTATION,314,FOOT & TOE PROCEDURES,08,DISEASES AND DISORDERS OF THE MUSCULOSKELETAL SYSTEM AND CONNECTIVE TISSUE,2,Moderate,Minor,Surgical,Miscellaneous/Other,,,,,true,61194.88,15173.76
New York City,Kings,7002053,001304,NYU Langone Hospital-Brooklyn,50 to 69,112,M,Black/African American,Not Span/Hispanic,7,Emergency,Home w/ Home Health Services,2019,END003,DIABETES MELLITUS WITH COMPLICATION,MST023,TOE AND MID FOOT AMPUTATION,314,FOOT & TOE PROCEDURES,08,DISEASES AND DISORDERS OF THE MUSCULOSKELETAL SYSTEM AND CONNECTIVE TISSUE,3,Major,Moderate,Surgical,Medicare,,,,,true,110634.46,30117.73
New York City,Kings,7002053,001304,NYU Langone Hospital-Brooklyn,50 to 69,112,M,Other Race,Spanish/Hispanic,12,Emergency,Home w/ Home Health Services,2019,END003,DIABETES MELLITUS WITH COMPLICATION,MST023,TOE AND MID FOOT AMPUTATION,314,FOOT & TOE PROCEDURES,08,DISEASES AND DISORDERS OF THE MUSCULOSKELETAL SYSTEM AND CONNECTIVE TISSUE,3,Major,Minor,Surgical,Medicare,,,,,true,155137.45,45103.41
New York City,Kings,7002053,001304,NYU Langone Hospital-Brooklyn,50 to 69,112,M,Other Race,Spanish/Hispanic,5,Emergency,Home w/ Home Health Services,2019,END003,DIABETES MELLITUS WITH COMPLICATION,MST020,SUBCUTANEOUS TISSUE AND FASCIA EXCISION,314,FOOT & TOE PROCEDURES,08,DISEASES AND DISORDERS OF THE MUSCULOSKELETAL SYSTEM AND CONNECTIVE TISSUE,3,Major,Moderate,Surgical,Medicare,,,,,true,87445.38,21377.36
New York City,Kings,7002053,001304,NYU Langone Hospital-Brooklyn,50 to 69,112,M,Other Race,Spanish/Hispanic,3,Emergency,Home w/ Home Health Services,2019,END003,DIABETES MELLITUS WITH COMPLICATION,MST023,TOE AND MID FOOT AMPUTATION,314,FOOT & TOE PROCEDURES,08,DISEASES AND DISORDERS OF THE MUSCULOSKELETAL SYSTEM AND CONNECTIVE TISSUE,3,Major,Moderate,Surgical,Medicaid,,,,,true,85342.45,17771.85
New York City,Kings,7002053,001304,NYU Langone Hospital-Brooklyn,50 to 69,112,M,White,Not Span/Hispanic,12,Emergency,Home or Self Care,2019,END003,DIABETES MELLITUS WITH COMPLICATION,MST018,BONE EXCISION,314,FOOT & TOE PROCEDURES,08,DISEASES AND DISORDERS OF THE MUSCULOSKELETAL SYSTEM AND CONNECTIVE TISSUE,3,Major,Moderate,Surgical,Medicaid,,,,,true,165068.46,46536.06
New York City,Kings,7002053,001304,NYU Langone Hospital-Brooklyn,70 or Older,112,F,White,Not Span/Hispanic,14,Emergency,Skilled Nursing Home,2019,END003,DIABETES MELLITUS WITH COMPLICATION,MST023,TOE AND MID FOOT AMPUTATION,314,FOOT & TOE PROCEDURES,08,DISEASES AND DISORDERS OF THE MUSCULOSKELETAL SYSTEM AND CONNECTIVE TISSUE,3,Major,Major,Surgical,Medicare,Medicare,,,,true,227324.64,63265.51
New York City,Kings,7002053,001304,NYU Langone Hospital-Brooklyn,50 to 69,112,M,White,Unknown,12,Emergency,Home or Self Care,2019,INJ005,"FRACTURE OF THE LOWER LIMB (EXCEPT HIP), INITIAL ENCOUNTER",MST011,FIXATION OF LEG AND FOOT BONES,314,FOOT & TOE PROCEDURES,08,DISEASES AND DISORDERS OF THE MUSCULOSKELETAL SYSTEM AND CONNECTIVE TISSUE,3,Major,Minor,Surgical,Medicaid,,,,,true,147812.35,47780.22
New York City,Kings,7002053,001304,NYU Langone Hospital-Brooklyn,50 to 69,112,M,White,Not Span/Hispanic,9,Emergency,Home or Self Care,2019,MUS002,OSTEOMYELITIS,MST020,SUBCUTANEOUS TISSUE AND FASCIA EXCISION,314,FOOT & TOE PROCEDURES,08,DISEASES AND DISORDERS OF THE MUSCULOSKELETAL SYSTEM AND CONNECTIVE TISSUE,3,Major,Minor,Surgical,Medicaid,,,,,true,134521.25,36970.11
New York City,Kings,7002053,001304,NYU Langone Hospital-Brooklyn,70 or Older,112,F,Black/African American,Not Span/Hispanic,6,Emergency,Home w/ Home Health Services,2019,END003,DIABETES MELLITUS WITH COMPLICATION,MST023,TOE AND MID FOOT AMPUTATION,314,FOOT & TOE PROCEDURES,08,DISEASES AND DISORDERS OF THE MUSCULOSKELETAL SYSTEM AND CONNECTIVE TISSUE,3,Major,Major,Surgical,Medicare,Medicaid,,,,true,151246.27,37885.44
New York City,Kings,7002053,001304,NYU Langone Hospital-Brooklyn,50 to 69,103,M,White,Not Span/Hispanic,1,Emergency,Home or Self Care,2019,INJ005,"FRACTURE OF THE LOWER LIMB (EXCEPT HIP), INITIAL ENCOUNTER",MST011,FIXATION OF LEG AND FOOT BONES,314,FOOT & TOE PROCEDURES,08,DISEASES AND DISORDERS OF THE MUSCULOSKELETAL SYSTEM AND CONNECTIVE TISSUE,2,Moderate,Minor,Surgical,Private Health Insurance,,,,,true,106373.91,17878.53
New York City,Kings,7002053,001304,NYU Langone Hospital-Brooklyn,30 to 49,112,F,Other Race,Spanish/Hispanic,10,Emergency,Home w/ Home Health Services,2019,END003,DIABETES MELLITUS WITH COMPLICATION,MST018,BONE EXCISION,314,FOOT & TOE PROCEDURES,08,DISEASES AND DISORDERS OF THE MUSCULOSKELETAL SYSTEM AND CONNECTIVE TISSUE,2,Moderate,Moderate,Surgical,Medicaid,,,,,true,219743.84,43514.71
New York City,Kings,7002053,001304,NYU Langone Hospital-Brooklyn,50 to 69,112,M,Other Race,Spanish/Hispanic,10,Emergency,Home w/ Home Health Services,2019,END003,DIABETES MELLITUS WITH COMPLICATION,MST023,TOE AND MID FOOT AMPUTATION,314,FOOT & TOE PROCEDURES,08,DISEASES AND DISORDERS OF THE MUSCULOSKELETAL SYSTEM AND CONNECTIVE TISSUE,3,Major,Moderate,Surgical,Medicaid,,,,,true,142813.26,39856.75
New York City,Kings,7002053,001304,NYU Langone Hospital-Brooklyn,50 to 69,112,M,White,Not Span/Hispanic,7,Emergency,Home w/ Home Health Services,2019,END003,DIABETES MELLITUS WITH COMPLICATION,MST018,BONE EXCISION,314,FOOT & TOE PROCEDURES,08,DISEASES AND DISORDERS OF THE MUSCULOSKELETAL SYSTEM AND CONNECTIVE TISSUE,3,Major,Major,Surgical,Medicaid,,,,,true,124759.19,29587.11
New York City,Kings,7002053,001304,NYU Langone Hospital-Brooklyn,50 to 69,112,M,Other Race,Spanish/Hispanic,7,Emergency,Home w/ Home Health Services,2019,END003,DIABETES MELLITUS WITH COMPLICATION,MST020,SUBCUTANEOUS TISSUE AND FASCIA EXCISION,314,FOOT & TOE PROCEDURES,08,DISEASES AND DISORDERS OF THE MUSCULOSKELETAL SYSTEM AND CONNECTIVE TISSUE,3,Major,Major,Surgical,Medicare,,,,,true,122380.88,30154
New York City,Kings,7002053,001304,NYU Langone Hospital-Brooklyn,50 to 69,112,M,Other Race,Spanish/Hispanic,4,Emergency,Home or Self Care,2019,INJ037,"COMPLICATION OF OTHER SURGICAL OR MEDICAL CARE, INJURY, INITIAL ENCOUNTER",MST004,INCISION AND DRAINAGE OF MUSCULOSKELETAL TISSUE AND JOINTS,314,FOOT & TOE PROCEDURES,08,DISEASES AND DISORDERS OF THE MUSCULOSKELETAL SYSTEM AND CONNECTIVE TISSUE,3,Major,Major,Surgical,Medicaid,,,,,true,68524.7,15145.22
New York City,Kings,7002053,001304,NYU Langone Hospital-Brooklyn,18 to 29,100,F,Other Race,Spanish/Hispanic,7,Emergency,Home or Self Care,2019,END003,DIABETES MELLITUS WITH COMPLICATION,MST023,TOE AND MID FOOT AMPUTATION,314,FOOT & TOE PROCEDURES,08,DISEASES AND DISORDERS OF THE MUSCULOSKELETAL SYSTEM AND CONNECTIVE TISSUE,3,Major,Minor,Surgical,Private Health Insurance,,,,,true,131792.05,29212.96
New York City,Kings,7002053,001304,NYU Langone Hospital-Brooklyn,50 to 69,112,F,Other Race,Spanish/Hispanic,8,Emergency,Home w/ Home Health Services,2019,END003,DIABETES MELLITUS WITH COMPLICATION,MST023,TOE AND MID FOOT AMPUTATION,314,FOOT & TOE PROCEDURES,08,DISEASES AND DISORDERS OF THE MUSCULOSKELETAL SYSTEM AND CONNECTIVE TISSUE,3,Major,Moderate,Surgical,Medicaid,,,,,true,154567.78,33127.83
New York City,Kings,7002053,001304,NYU Langone Hospital-Brooklyn,50 to 69,112,M,Other Race,Spanish/Hispanic,12,Emergency,Skilled Nursing Home,2019,END003,DIABETES MELLITUS WITH COMPLICATION,MST023,TOE AND MID FOOT AMPUTATION,314,FOOT & TOE PROCEDURES,08,DISEASES AND DISORDERS OF THE MUSCULOSKELETAL SYSTEM AND CONNECTIVE TISSUE,3,Major,Moderate,Surgical,Medicare,,,,,true,166635.21,46182.31
New York City,Kings,7002053,001304,NYU Langone Hospital-Brooklyn,30 to 49,112,M,White,Not Span/Hispanic,4,Emergency,Home w/ Home Health Services,2019,END003,DIABETES MELLITUS WITH COMPLICATION,MST023,TOE AND MID FOOT AMPUTATION,314,FOOT & TOE PROCEDURES,08,DISEASES AND DISORDERS OF THE MUSCULOSKELETAL SYSTEM AND CONNECTIVE TISSUE,3,Major,Moderate,Surgical,Blue Cross/Blue Shield,,,,,true,98489.26,18776.46
New York City,Kings,7002053,001304,NYU Langone Hospital-Brooklyn,50 to 69,112,F,Other Race,Not Span/Hispanic,8,Emergency,Inpatient Rehabilitation Facility,2019,INJ005,"FRACTURE OF THE LOWER LIMB (EXCEPT HIP), INITIAL ENCOUNTER",MST019,"MUSCLE, TENDON, BURSA, AND LIGAMENT EXCISION",314,FOOT & TOE PROCEDURES,08,DISEASES AND DISORDERS OF THE MUSCULOSKELETAL SYSTEM AND CONNECTIVE TISSUE,2,Moderate,Moderate,Surgical,Miscellaneous/Other,Private Health Insurance,,,,true,131049.6,34196.12
New York City,Kings,7002053,001304,NYU Langone Hospital-Brooklyn,50 to 69,112,M,Other Race,Spanish/Hispanic,8,Emergency,Home w/ Home Health Services,2019,END003,DIABETES MELLITUS WITH COMPLICATION,MST023,TOE AND MID FOOT AMPUTATION,314,FOOT & TOE PROCEDURES,08,DISEASES AND DISORDERS OF THE MUSCULOSKELETAL SYSTEM AND CONNECTIVE TISSUE,3,Major,Moderate,Surgical,Medicaid,,,,,true,197371.64,35208.54
New York City,Kings,7002053,001304,NYU Langone Hospital-Brooklyn,30 to 49,112,M,White,Not Span/Hispanic,5,Emergency,Home w/ Home Health Services,2019,END003,DIABETES MELLITUS WITH COMPLICATION,MST023,TOE AND MID FOOT AMPUTATION,314,FOOT & TOE PROCEDURES,08,DISEASES AND DISORDERS OF THE MUSCULOSKELETAL SYSTEM AND CONNECTIVE TISSUE,3,Major,Moderate,Surgical,Medicaid,,,,,true,107989.66,26649.66
New York City,Kings,7002053,001304,NYU Langone Hospital-Brooklyn,50 to 69,112,M,White,Spanish/Hispanic,4,Emergency,Skilled Nursing Home,2019,END003,DIABETES MELLITUS WITH COMPLICATION,MST023,TOE AND MID FOOT AMPUTATION,314,FOOT & TOE PROCEDURES,08,DISEASES AND DISORDERS OF THE MUSCULOSKELETAL SYSTEM AND CONNECTIVE TISSUE,3,Major,Moderate,Surgical,Medicaid,,,,,true,87349.19,18812.46
New York City,Kings,7002053,001304,NYU Langone Hospital-Brooklyn,70 or Older,112,F,Other Race,Spanish/Hispanic,5,Emergency,Home w/ Home Health Services,2019,END003,DIABETES MELLITUS WITH COMPLICATION,MST023,TOE AND MID FOOT AMPUTATION,314,FOOT & TOE PROCEDURES,08,DISEASES AND DISORDERS OF THE MUSCULOSKELETAL SYSTEM AND CONNECTIVE TISSUE,2,Moderate,Moderate,Surgical,Private Health Insurance,Medicaid,,,,true,113479.5,24315.49
New York City,Kings,7002053,001304,NYU Langone Hospital-Brooklyn,70 or Older,112,F,Other Race,Not Span/Hispanic,2,Emergency,Home w/ Home Health Services,2019,INJ024,"SPRAINS AND STRAINS, INITIAL ENCOUNTER",MST022,"TENDON, MUSCLE, BURSA, AND LIGAMENT REPAIR (EXCLUDING PERINEAL)",314,FOOT & TOE PROCEDURES,08,DISEASES AND DISORDERS OF THE MUSCULOSKELETAL SYSTEM AND CONNECTIVE TISSUE,2,Moderate,Minor,Surgical,Medicare,,,,,true,82920.79,16190.37
New York City,Kings,7002053,001304,NYU Langone Hospital-Brooklyn,30 to 49,113,F,White,Not Span/Hispanic,11,Emergency,Home or Self Care,2019,MUS002,OSTEOMYELITIS,MST018,BONE EXCISION,314,FOOT & TOE PROCEDURES,08,DISEASES AND DISORDERS OF THE MUSCULOSKELETAL SYSTEM AND CONNECTIVE TISSUE,2,Moderate,Minor,Surgical,Medicaid,,,,,true,150272.58,46216.9
New York City,Kings,7002053,001304,NYU Langone Hospital-Brooklyn,50 to 69,112,M,White,Not Span/Hispanic,8,Emergency,Skilled Nursing Home,2019,END003,DIABETES MELLITUS WITH COMPLICATION,MST023,TOE AND MID FOOT AMPUTATION,314,FOOT & TOE PROCEDURES,08,DISEASES AND DISORDERS OF THE MUSCULOSKELETAL SYSTEM AND CONNECTIVE TISSUE,2,Moderate,Moderate,Surgical,Medicare,,,,,true,129210.21,32438.22
New York City,Kings,7002053,001304,NYU Langone Hospital-Brooklyn,70 or Older,112,M,White,Not Span/Hispanic,15,Emergency,Skilled Nursing Home,2019,END003,DIABETES MELLITUS WITH COMPLICATION,MST020,SUBCUTANEOUS TISSUE AND FASCIA EXCISION,314,FOOT & TOE PROCEDURES,08,DISEASES AND DISORDERS OF THE MUSCULOSKELETAL SYSTEM AND CONNECTIVE TISSUE,3,Major,Major,Surgical,Medicare,,,,,true,293047.44,59553.36
New York City,Kings,7002053,001304,NYU Langone Hospital-Brooklyn,50 to 69,104,M,Other Race,Not Span/Hispanic,10,Emergency,Home w/ Home Health Services,2019,END003,DIABETES MELLITUS WITH COMPLICATION,MST018,BONE EXCISION,314,FOOT & TOE PROCEDURES,08,DISEASES AND DISORDERS OF THE MUSCULOSKELETAL SYSTEM AND CONNECTIVE TISSUE,3,Major,Moderate,Surgical,Medicaid,,,,,true,205654.54,42369.05
New York City,Kings,7002053,001304,NYU Langone Hospital-Brooklyn,30 to 49,112,M,Other Race,Not Span/Hispanic,6,Emergency,Home w/ Home Health Services,2019,END003,DIABETES MELLITUS WITH COMPLICATION,MST023,TOE AND MID FOOT AMPUTATION,314,FOOT & TOE PROCEDURES,08,DISEASES AND DISORDERS OF THE MUSCULOSKELETAL SYSTEM AND CONNECTIVE TISSUE,4,Extreme,Major,Surgical,Medicaid,,,,,true,157675.58,28733.25
New York City,Kings,7002053,001304,NYU Langone Hospital-Brooklyn,70 or Older,112,M,White,Not Span/Hispanic,12,Emergency,Skilled Nursing Home,2019,END003,DIABETES MELLITUS WITH COMPLICATION,MST023,TOE AND MID FOOT AMPUTATION,314,FOOT & TOE PROCEDURES,08,DISEASES AND DISORDERS OF THE MUSCULOSKELETAL SYSTEM AND CONNECTIVE TISSUE,3,Major,Moderate,Surgical,Medicare,,,,,true,217971,46198.69
