Hospital Service Area,Hospital County,Operating Certificate Number,Permanent Facility Id,Facility Name,Age Group,Zip Code - 3 digits,Gender,Race,Ethnicity,Length of Stay,Type of Admission,Patient Disposition,Discharge Year,CCS Diagnosis Code,CCS Diagnosis Description,CCS Procedure Code,CCS Procedure Description,APR DRG Code,APR DRG Description,APR MDC Code,APR MDC Description,APR Severity of Illness Code,APR Severity of Illness Description,APR Risk of Mortality,APR Medical Surgical Description,Payment Typology 1,Payment Typology 2,Payment Typology 3,Birth Weight,Abortion Edit Indicator,Emergency Department Indicator,Total Charges,Total Costs
Long Island,Nassau,2908000,000511,NYU Langone Hospital-Long Island,50 to 69,117,M,White,Not Span/Hispanic,6,Emergency,Home or Self Care,2019,END003,DIABETES MELLITUS WITH COMPLICATION,MST023,TOE AND MID FOOT AMPUTATION,314,FOOT & TOE PROCEDURES,08,DISEASES AND DISORDERS OF THE MUSCULOSKELETAL SYSTEM AND CONNECTIVE TISSUE,4,Extreme,Major,Surgical,Medicare,Medicare,Medicaid,,,true,167918.25,25337.23
Long Island,Nassau,2908000,000511,NYU Langone Hospital-Long Island,50 to 69,117,M,Black/African American,Not Span/Hispanic,10,Emergency,Home w/ Home Health Services,2019,END003,DIABETES MELLITUS WITH COMPLICATION,MST023,TOE AND MID FOOT AMPUTATION,314,FOOT & TOE PROCEDURES,08,DISEASES AND DISORDERS OF THE MUSCULOSKELETAL SYSTEM AND CONNECTIVE TISSUE,3,Major,Moderate,Surgical,Medicaid,Medicaid,,,,true,106819.06,25431.05
Long Island,Nassau,2908000,000511,NYU Langone Hospital-Long Island,70 or Older,115,F,White,Not Span/Hispanic,3,Urgent,Home w/ Home Health Services,2019,END003,DIABETES MELLITUS WITH COMPLICATION,MST023,TOE AND MID FOOT AMPUTATION,314,FOOT & TOE PROCEDURES,08,DISEASES AND DISORDERS OF THE MUSCULOSKELETAL SYSTEM AND CONNECTIVE TISSUE,4,Extreme,Moderate,Surgical,Medicare,Medicare,Blue Cross/Blue Shield,,,false,140054.95,25905.49
Long Island,Nassau,2908000,000511,NYU Langone Hospital-Long Island,50 to 69,115,M,White,Spanish/Hispanic,9,Emergency,Skilled Nursing Home,2019,INJ037,"COMPLICATION OF OTHER SURGICAL OR MEDICAL CARE, INJURY, INITIAL ENCOUNTER",MST018,BONE EXCISION,314,FOOT & TOE PROCEDURES,08,DISEASES AND DISORDERS OF THE MUSCULOSKELETAL SYSTEM AND CONNECTIVE TISSUE,4,Extreme,Moderate,Surgical,Medicaid,Medicaid,,,,true,120781.06,22583.72
Long Island,Nassau,2908000,000511,NYU Langone Hospital-Long Island,70 or Older,115,M,Black/African American,Not Span/Hispanic,4,Emergency,Home w/ Home Health Services,2019,END003,DIABETES MELLITUS WITH COMPLICATION,MST023,TOE AND MID FOOT AMPUTATION,314,FOOT & TOE PROCEDURES,08,DISEASES AND DISORDERS OF THE MUSCULOSKELETAL SYSTEM AND CONNECTIVE TISSUE,3,Major,Major,Surgical,Medicare,Medicare,Blue Cross/Blue Shield,,,true,61856.01,10862.91
Long Island,Nassau,2908000,000511,NYU Langone Hospital-Long Island,50 to 69,115,M,Black/African American,Not Span/Hispanic,2,Elective,Home w/ Home Health Services,2019,MUS023,ACQUIRED DEFORMITIES (EXCLUDING FOOT),MST022,"TENDON, MUSCLE, BURSA, AND LIGAMENT REPAIR (EXCLUDING PERINEAL)",314,FOOT & TOE PROCEDURES,08,DISEASES AND DISORDERS OF THE MUSCULOSKELETAL SYSTEM AND CONNECTIVE TISSUE,1,Minor,Minor,Surgical,Medicare,Medicare,Private Health Insurance,,,false,130111.35,21123.39
Long Island,Nassau,2908000,000511,NYU Langone Hospital-Long Island,70 or Older,115,M,White,Not Span/Hispanic,3,Urgent,Skilled Nursing Home,2019,MUS021,ACQUIRED FOOT DEFORMITIES,MST030,"MUSCULOSKELETAL PROCEDURES, NEC",314,FOOT & TOE PROCEDURES,08,DISEASES AND DISORDERS OF THE MUSCULOSKELETAL SYSTEM AND CONNECTIVE TISSUE,3,Major,Moderate,Surgical,Medicare,Medicare,Private Health Insurance,,,false,103428.55,17853.66
Long Island,Nassau,2908000,000511,NYU Langone Hospital-Long Island,50 to 69,115,F,Black/African American,Not Span/Hispanic,8,Emergency,Home w/ Home Health Services,2019,END003,DIABETES MELLITUS WITH COMPLICATION,MST023,TOE AND MID FOOT AMPUTATION,314,FOOT & TOE PROCEDURES,08,DISEASES AND DISORDERS OF THE MUSCULOSKELETAL SYSTEM AND CONNECTIVE TISSUE,3,Major,Major,Surgical,Medicare,Medicare,Medicare,,,true,132273.28,24083.49
Long Island,Nassau,2908000,000511,NYU Langone Hospital-Long Island,50 to 69,115,M,White,Not Span/Hispanic,4,Emergency,Home w/ Home Health Services,2019,END003,DIABETES MELLITUS WITH COMPLICATION,MST018,BONE EXCISION,314,FOOT & TOE PROCEDURES,08,DISEASES AND DISORDERS OF THE MUSCULOSKELETAL SYSTEM AND CONNECTIVE TISSUE,3,Major,Moderate,Surgical,Private Health Insurance,,,,,true,138619.82,21040.89
Long Island,Nassau,2908000,000511,NYU Langone Hospital-Long Island,50 to 69,117,M,White,Not Span/Hispanic,2,Emergency,Home or Self Care,2019,INJ005,"FRACTURE OF THE LOWER LIMB (EXCEPT HIP), INITIAL ENCOUNTER",MST011,FIXATION OF LEG AND FOOT BONES,314,FOOT & TOE PROCEDURES,08,DISEASES AND DISORDERS OF THE MUSCULOSKELETAL SYSTEM AND CONNECTIVE TISSUE,2,Moderate,Minor,Surgical,Blue Cross/Blue Shield,,,,,true,115122.15,19246.85
Long Island,Nassau,2908000,000511,NYU Langone Hospital-Long Island,50 to 69,117,F,White,Not Span/Hispanic,4,Emergency,Home or Self Care,2019,END003,DIABETES MELLITUS WITH COMPLICATION,MST018,BONE EXCISION,314,FOOT & TOE PROCEDURES,08,DISEASES AND DISORDERS OF THE MUSCULOSKELETAL SYSTEM AND CONNECTIVE TISSUE,3,Major,Moderate,Surgical,Medicare,Medicare,Medicaid,,,true,179228.3,25282.42
Long Island,Nassau,2908000,000511,NYU Langone Hospital-Long Island,70 or Older,110,F,White,Not Span/Hispanic,5,Emergency,Skilled Nursing Home,2019,MUS002,OSTEOMYELITIS,MST023,TOE AND MID FOOT AMPUTATION,314,FOOT & TOE PROCEDURES,08,DISEASES AND DISORDERS OF THE MUSCULOSKELETAL SYSTEM AND CONNECTIVE TISSUE,2,Moderate,Major,Surgical,Medicare,Medicare,Private Health Insurance,,,true,69479.95,13233.69
Long Island,Nassau,2908000,000511,NYU Langone Hospital-Long Island,70 or Older,115,M,White,Not Span/Hispanic,7,Emergency,Home or Self Care,2019,END003,DIABETES MELLITUS WITH COMPLICATION,MST023,TOE AND MID FOOT AMPUTATION,314,FOOT & TOE PROCEDURES,08,DISEASES AND DISORDERS OF THE MUSCULOSKELETAL SYSTEM AND CONNECTIVE TISSUE,4,Extreme,Major,Surgical,Medicare,Medicare,Blue Cross/Blue Shield,,,true,87912.02,17124.53
Long Island,Nassau,2908000,000511,NYU Langone Hospital-Long Island,30 to 49,114,M,White,Not Span/Hispanic,2,Emergency,Home or Self Care,2019,END003,DIABETES MELLITUS WITH COMPLICATION,MST023,TOE AND MID FOOT AMPUTATION,314,FOOT & TOE PROCEDURES,08,DISEASES AND DISORDERS OF THE MUSCULOSKELETAL SYSTEM AND CONNECTIVE TISSUE,2,Moderate,Minor,Surgical,Medicare,Medicare,Medicaid,,,true,39644.93,6489.73
Long Island,Nassau,2908000,000511,NYU Langone Hospital-Long Island,70 or Older,115,M,White,Spanish/Hispanic,10,Emergency,Inpatient Rehabilitation Facility,2019,MUS002,OSTEOMYELITIS,MST018,BONE EXCISION,314,FOOT & TOE PROCEDURES,08,DISEASES AND DISORDERS OF THE MUSCULOSKELETAL SYSTEM AND CONNECTIVE TISSUE,2,Moderate,Moderate,Surgical,Medicare,Medicare,Private Health Insurance,,,true,135066.99,28488.74
Long Island,Nassau,2908000,000511,NYU Langone Hospital-Long Island,50 to 69,118,M,White,Not Span/Hispanic,7,Emergency,Home or Self Care,2019,END003,DIABETES MELLITUS WITH COMPLICATION,MST018,BONE EXCISION,314,FOOT & TOE PROCEDURES,08,DISEASES AND DISORDERS OF THE MUSCULOSKELETAL SYSTEM AND CONNECTIVE TISSUE,2,Moderate,Moderate,Surgical,Private Health Insurance,,,,,true,145044.92,24696.31
Long Island,Nassau,2908000,000511,NYU Langone Hospital-Long Island,30 to 49,117,F,Black/African American,Not Span/Hispanic,9,Emergency,Home or Self Care,2019,END003,DIABETES MELLITUS WITH COMPLICATION,MST018,BONE EXCISION,314,FOOT & TOE PROCEDURES,08,DISEASES AND DISORDERS OF THE MUSCULOSKELETAL SYSTEM AND CONNECTIVE TISSUE,3,Major,Major,Surgical,Medicare,Medicare,Medicaid,,,true,133948.2,23926.18
Long Island,Nassau,2908000,000511,NYU Langone Hospital-Long Island,70 or Older,115,M,White,Not Span/Hispanic,12,Emergency,Skilled Nursing Home,2019,MUS002,OSTEOMYELITIS,MST018,BONE EXCISION,314,FOOT & TOE PROCEDURES,08,DISEASES AND DISORDERS OF THE MUSCULOSKELETAL SYSTEM AND CONNECTIVE TISSUE,3,Major,Major,Surgical,Medicare,Medicare,Private Health Insurance,,,true,257154.89,39273.05
Long Island,Nassau,2908000,000511,NYU Langone Hospital-Long Island,50 to 69,115,M,White,Not Span/Hispanic,6,Emergency,Home w/ Home Health Services,2019,END003,DIABETES MELLITUS WITH COMPLICATION,MST023,TOE AND MID FOOT AMPUTATION,314,FOOT & TOE PROCEDURES,08,DISEASES AND DISORDERS OF THE MUSCULOSKELETAL SYSTEM AND CONNECTIVE TISSUE,3,Major,Minor,Surgical,Medicare,Medicare,Blue Cross/Blue Shield,,,true,97987.2,16476.16
Long Island,Nassau,2908000,000511,NYU Langone Hospital-Long Island,70 or Older,115,M,Black/African American,Not Span/Hispanic,8,Emergency,Skilled Nursing Home,2019,END003,DIABETES MELLITUS WITH COMPLICATION,MST023,TOE AND MID FOOT AMPUTATION,314,FOOT & TOE PROCEDURES,08,DISEASES AND DISORDERS OF THE MUSCULOSKELETAL SYSTEM AND CONNECTIVE TISSUE,3,Major,Moderate,Surgical,Medicare,Medicare,,,,true,98451.12,22013.38
Long Island,Nassau,2908000,000511,NYU Langone Hospital-Long Island,30 to 49,117,M,White,Not Span/Hispanic,8,Emergency,Inpatient Rehabilitation Facility,2019,INJ024,"SPRAINS AND STRAINS, INITIAL ENCOUNTER",MST022,"TENDON, MUSCLE, BURSA, AND LIGAMENT REPAIR (EXCLUDING PERINEAL)",314,FOOT & TOE PROCEDURES,08,DISEASES AND DISORDERS OF THE MUSCULOSKELETAL SYSTEM AND CONNECTIVE TISSUE,2,Moderate,Minor,Surgical,Miscellaneous/Other,Blue Cross/Blue Shield,,,,true,145005.18,28242.09
Long Island,Nassau,2908000,000511,NYU Langone Hospital-Long Island,30 to 49,115,M,White,Not Span/Hispanic,1,Emergency,Home w/ Home Health Services,2019,INJ005,"FRACTURE OF THE LOWER LIMB (EXCEPT HIP), INITIAL ENCOUNTER",MST011,FIXATION OF LEG AND FOOT BONES,314,FOOT & TOE PROCEDURES,08,DISEASES AND DISORDERS OF THE MUSCULOSKELETAL SYSTEM AND CONNECTIVE TISSUE,3,Major,Minor,Surgical,Medicaid,Medicaid,,,,true,58250.94,9163.89
Long Island,Nassau,2908000,000511,NYU Langone Hospital-Long Island,30 to 49,110,F,White,Not Span/Hispanic,2,Emergency,Home w/ Home Health Services,2019,INJ005,"FRACTURE OF THE LOWER LIMB (EXCEPT HIP), INITIAL ENCOUNTER",MST011,FIXATION OF LEG AND FOOT BONES,314,FOOT & TOE PROCEDURES,08,DISEASES AND DISORDERS OF THE MUSCULOSKELETAL SYSTEM AND CONNECTIVE TISSUE,2,Moderate,Minor,Surgical,Private Health Insurance,,,,,true,144069.98,23674.84
Long Island,Nassau,2908000,000511,NYU Langone Hospital-Long Island,50 to 69,117,F,White,Not Span/Hispanic,7,Emergency,Home w/ Home Health Services,2019,MUS002,OSTEOMYELITIS,MST018,BONE EXCISION,314,FOOT & TOE PROCEDURES,08,DISEASES AND DISORDERS OF THE MUSCULOSKELETAL SYSTEM AND CONNECTIVE TISSUE,3,Major,Minor,Surgical,Blue Cross/Blue Shield,,,,,true,117658.1,21194.54
Long Island,Nassau,2908000,000511,NYU Langone Hospital-Long Island,50 to 69,115,M,White,Not Span/Hispanic,8,Emergency,Home w/ Home Health Services,2019,END003,DIABETES MELLITUS WITH COMPLICATION,MST018,BONE EXCISION,314,FOOT & TOE PROCEDURES,08,DISEASES AND DISORDERS OF THE MUSCULOSKELETAL SYSTEM AND CONNECTIVE TISSUE,2,Moderate,Moderate,Surgical,Private Health Insurance,,,,,true,94951.77,22641.73
Long Island,Nassau,2908000,000511,NYU Langone Hospital-Long Island,70 or Older,115,M,White,Not Span/Hispanic,3,Emergency,Home w/ Home Health Services,2019,END003,DIABETES MELLITUS WITH COMPLICATION,MST023,TOE AND MID FOOT AMPUTATION,314,FOOT & TOE PROCEDURES,08,DISEASES AND DISORDERS OF THE MUSCULOSKELETAL SYSTEM AND CONNECTIVE TISSUE,3,Major,Major,Surgical,Medicare,Medicare,Blue Cross/Blue Shield,,,true,59045.09,9211.63
Long Island,Nassau,2908000,000511,NYU Langone Hospital-Long Island,70 or Older,115,M,White,Not Span/Hispanic,3,Emergency,Home or Self Care,2019,END003,DIABETES MELLITUS WITH COMPLICATION,MST023,TOE AND MID FOOT AMPUTATION,314,FOOT & TOE PROCEDURES,08,DISEASES AND DISORDERS OF THE MUSCULOSKELETAL SYSTEM AND CONNECTIVE TISSUE,3,Major,Major,Surgical,Medicare,Medicare,Private Health Insurance,,,true,80916.63,12053.73
Long Island,Nassau,2908000,000511,NYU Langone Hospital-Long Island,50 to 69,113,M,White,Spanish/Hispanic,7,Emergency,Home w/ Home Health Services,2019,END003,DIABETES MELLITUS WITH COMPLICATION,MST023,TOE AND MID FOOT AMPUTATION,314,FOOT & TOE PROCEDURES,08,DISEASES AND DISORDERS OF THE MUSCULOSKELETAL SYSTEM AND CONNECTIVE TISSUE,3,Major,Moderate,Surgical,Private Health Insurance,,,,,true,111906.71,19617.34
Long Island,Nassau,2908000,000511,NYU Langone Hospital-Long Island,50 to 69,110,M,White,Not Span/Hispanic,7,Emergency,Home w/ Home Health Services,2019,END003,DIABETES MELLITUS WITH COMPLICATION,MST018,BONE EXCISION,314,FOOT & TOE PROCEDURES,08,DISEASES AND DISORDERS OF THE MUSCULOSKELETAL SYSTEM AND CONNECTIVE TISSUE,2,Moderate,Moderate,Surgical,Private Health Insurance,,,,,true,108979.19,20199.6
Long Island,Nassau,2908000,000511,NYU Langone Hospital-Long Island,70 or Older,116,M,Black/African American,Not Span/Hispanic,4,Emergency,Home w/ Home Health Services,2019,MUS002,OSTEOMYELITIS,MST023,TOE AND MID FOOT AMPUTATION,314,FOOT & TOE PROCEDURES,08,DISEASES AND DISORDERS OF THE MUSCULOSKELETAL SYSTEM AND CONNECTIVE TISSUE,1,Minor,Minor,Surgical,Medicare,Medicare,Blue Cross/Blue Shield,,,true,68456.37,12337.43
Long Island,Nassau,2908000,000511,NYU Langone Hospital-Long Island,50 to 69,115,M,Other Race,Not Span/Hispanic,8,Emergency,Home or Self Care,2019,END003,DIABETES MELLITUS WITH COMPLICATION,MST023,TOE AND MID FOOT AMPUTATION,314,FOOT & TOE PROCEDURES,08,DISEASES AND DISORDERS OF THE MUSCULOSKELETAL SYSTEM AND CONNECTIVE TISSUE,3,Major,Moderate,Surgical,Private Health Insurance,,,,,true,97276.82,18278.43
Long Island,Nassau,2908000,000511,NYU Langone Hospital-Long Island,30 to 49,114,M,Black/African American,Not Span/Hispanic,7,Emergency,Home or Self Care,2019,END003,DIABETES MELLITUS WITH COMPLICATION,MST023,TOE AND MID FOOT AMPUTATION,314,FOOT & TOE PROCEDURES,08,DISEASES AND DISORDERS OF THE MUSCULOSKELETAL SYSTEM AND CONNECTIVE TISSUE,3,Major,Minor,Surgical,Medicare,Medicare,Private Health Insurance,,,true,89924.1,16950.08
Long Island,Nassau,2908000,000511,NYU Langone Hospital-Long Island,70 or Older,OOS,M,Black/African American,Not Span/Hispanic,20,Emergency,Skilled Nursing Home,2019,END003,DIABETES MELLITUS WITH COMPLICATION,MST023,TOE AND MID FOOT AMPUTATION,314,FOOT & TOE PROCEDURES,08,DISEASES AND DISORDERS OF THE MUSCULOSKELETAL SYSTEM AND CONNECTIVE TISSUE,4,Extreme,Major,Surgical,Medicare,Medicare,,,,true,329185.04,59830.11
Long Island,Nassau,2908000,000511,NYU Langone Hospital-Long Island,70 or Older,115,M,White,Not Span/Hispanic,7,Emergency,Skilled Nursing Home,2019,END003,DIABETES MELLITUS WITH COMPLICATION,MST023,TOE AND MID FOOT AMPUTATION,314,FOOT & TOE PROCEDURES,08,DISEASES AND DISORDERS OF THE MUSCULOSKELETAL SYSTEM AND CONNECTIVE TISSUE,4,Extreme,Major,Surgical,Medicare,Medicare,,,,true,130352.44,22246.46
Long Island,Nassau,2908000,000511,NYU Langone Hospital-Long Island,50 to 69,115,M,White,Not Span/Hispanic,6,Emergency,Home w/ Home Health Services,2019,END003,DIABETES MELLITUS WITH COMPLICATION,MST023,TOE AND MID FOOT AMPUTATION,314,FOOT & TOE PROCEDURES,08,DISEASES AND DISORDERS OF THE MUSCULOSKELETAL SYSTEM AND CONNECTIVE TISSUE,4,Extreme,Extreme,Surgical,Medicare,Private Health Insurance,,,,true,105719.15,19031.59
Long Island,Nassau,2908000,000511,NYU Langone Hospital-Long Island,50 to 69,117,F,White,Unknown,7,Emergency,Home or Self Care,2019,END003,DIABETES MELLITUS WITH COMPLICATION,MST023,TOE AND MID FOOT AMPUTATION,314,FOOT & TOE PROCEDURES,08,DISEASES AND DISORDERS OF THE MUSCULOSKELETAL SYSTEM AND CONNECTIVE TISSUE,3,Major,Minor,Surgical,Private Health Insurance,,,,,true,93969.09,20356.51
Long Island,Nassau,2908000,000511,NYU Langone Hospital-Long Island,50 to 69,115,F,White,Not Span/Hispanic,12,Emergency,Home w/ Home Health Services,2019,END003,DIABETES MELLITUS WITH COMPLICATION,MST018,BONE EXCISION,314,FOOT & TOE PROCEDURES,08,DISEASES AND DISORDERS OF THE MUSCULOSKELETAL SYSTEM AND CONNECTIVE TISSUE,3,Major,Major,Surgical,Medicare,Medicare,Private Health Insurance,,,true,151657.76,29061.41
Long Island,Nassau,2908000,000511,NYU Langone Hospital-Long Island,70 or Older,115,F,Other Race,Spanish/Hispanic,4,Emergency,Home w/ Home Health Services,2019,END003,DIABETES MELLITUS WITH COMPLICATION,MST023,TOE AND MID FOOT AMPUTATION,314,FOOT & TOE PROCEDURES,08,DISEASES AND DISORDERS OF THE MUSCULOSKELETAL SYSTEM AND CONNECTIVE TISSUE,2,Moderate,Minor,Surgical,Medicare,Medicare,,,,true,56811.86,10273.04
Long Island,Nassau,2908000,000511,NYU Langone Hospital-Long Island,30 to 49,114,M,Black/African American,Not Span/Hispanic,2,Emergency,Home or Self Care,2019,END003,DIABETES MELLITUS WITH COMPLICATION,MST023,TOE AND MID FOOT AMPUTATION,314,FOOT & TOE PROCEDURES,08,DISEASES AND DISORDERS OF THE MUSCULOSKELETAL SYSTEM AND CONNECTIVE TISSUE,3,Major,Moderate,Surgical,Medicare,Medicare,,,,true,50605.59,7203.96
Long Island,Nassau,2908000,000511,NYU Langone Hospital-Long Island,50 to 69,115,M,White,Not Span/Hispanic,6,Emergency,Skilled Nursing Home,2019,END003,DIABETES MELLITUS WITH COMPLICATION,MST018,BONE EXCISION,314,FOOT & TOE PROCEDURES,08,DISEASES AND DISORDERS OF THE MUSCULOSKELETAL SYSTEM AND CONNECTIVE TISSUE,4,Extreme,Moderate,Surgical,Medicare,Medicare,Private Health Insurance,,,true,212167.93,31776.64
Long Island,Nassau,2908000,000511,NYU Langone Hospital-Long Island,50 to 69,OOS,F,White,Not Span/Hispanic,5,Elective,Skilled Nursing Home,2019,MUS009,TENDON AND SYNOVIAL DISORDERS,MST030,"MUSCULOSKELETAL PROCEDURES, NEC",314,FOOT & TOE PROCEDURES,08,DISEASES AND DISORDERS OF THE MUSCULOSKELETAL SYSTEM AND CONNECTIVE TISSUE,2,Moderate,Minor,Surgical,Private Health Insurance,,,,,false,178746.73,31133.87
Long Island,Nassau,2908000,000511,NYU Langone Hospital-Long Island,70 or Older,110,M,White,Not Span/Hispanic,18,Emergency,Home w/ Home Health Services,2019,MUS002,OSTEOMYELITIS,MST023,TOE AND MID FOOT AMPUTATION,314,FOOT & TOE PROCEDURES,08,DISEASES AND DISORDERS OF THE MUSCULOSKELETAL SYSTEM AND CONNECTIVE TISSUE,3,Major,Major,Surgical,Medicare,Medicare,Blue Cross/Blue Shield,,,true,233965.74,44782.23
Long Island,Nassau,2908000,000511,NYU Langone Hospital-Long Island,70 or Older,113,M,White,Not Span/Hispanic,9,Emergency,Home or Self Care,2019,END003,DIABETES MELLITUS WITH COMPLICATION,MST023,TOE AND MID FOOT AMPUTATION,314,FOOT & TOE PROCEDURES,08,DISEASES AND DISORDERS OF THE MUSCULOSKELETAL SYSTEM AND CONNECTIVE TISSUE,2,Moderate,Moderate,Surgical,Medicare,Medicare,Private Health Insurance,,,true,114110.04,21649.69
Long Island,Nassau,2908000,000511,NYU Langone Hospital-Long Island,30 to 49,114,M,White,Not Span/Hispanic,6,Emergency,Home or Self Care,2019,MUS002,OSTEOMYELITIS,MST020,SUBCUTANEOUS TISSUE AND FASCIA EXCISION,314,FOOT & TOE PROCEDURES,08,DISEASES AND DISORDERS OF THE MUSCULOSKELETAL SYSTEM AND CONNECTIVE TISSUE,2,Moderate,Minor,Surgical,Medicare,Medicare,Medicaid,,,true,94355.66,16295.12
Long Island,Nassau,2908000,000511,NYU Langone Hospital-Long Island,50 to 69,117,M,White,Not Span/Hispanic,14,Emergency,Home w/ Home Health Services,2019,END003,DIABETES MELLITUS WITH COMPLICATION,MST018,BONE EXCISION,314,FOOT & TOE PROCEDURES,08,DISEASES AND DISORDERS OF THE MUSCULOSKELETAL SYSTEM AND CONNECTIVE TISSUE,3,Major,Moderate,Surgical,Private Health Insurance,,,,,true,245705.7,42359.5
Long Island,Nassau,2908000,000511,NYU Langone Hospital-Long Island,50 to 69,117,F,White,Not Span/Hispanic,2,Emergency,Home or Self Care,2019,INJ005,"FRACTURE OF THE LOWER LIMB (EXCEPT HIP), INITIAL ENCOUNTER",MST019,"MUSCLE, TENDON, BURSA, AND LIGAMENT EXCISION",314,FOOT & TOE PROCEDURES,08,DISEASES AND DISORDERS OF THE MUSCULOSKELETAL SYSTEM AND CONNECTIVE TISSUE,2,Moderate,Minor,Surgical,Private Health Insurance,,,,,true,115382.42,17511.95
Long Island,Nassau,2908000,000511,NYU Langone Hospital-Long Island,30 to 49,110,M,White,Not Span/Hispanic,3,Emergency,Home or Self Care,2019,END003,DIABETES MELLITUS WITH COMPLICATION,MST023,TOE AND MID FOOT AMPUTATION,314,FOOT & TOE PROCEDURES,08,DISEASES AND DISORDERS OF THE MUSCULOSKELETAL SYSTEM AND CONNECTIVE TISSUE,3,Major,Moderate,Surgical,Private Health Insurance,,,,,true,51504.56,8550.04
Long Island,Nassau,2908000,000511,NYU Langone Hospital-Long Island,70 or Older,115,M,White,Not Span/Hispanic,16,Elective,Skilled Nursing Home,2019,END003,DIABETES MELLITUS WITH COMPLICATION,MST018,BONE EXCISION,314,FOOT & TOE PROCEDURES,08,DISEASES AND DISORDERS OF THE MUSCULOSKELETAL SYSTEM AND CONNECTIVE TISSUE,3,Major,Major,Surgical,Medicare,Blue Cross/Blue Shield,,,,false,290412.15,55897.42
Long Island,Nassau,2908000,000511,NYU Langone Hospital-Long Island,50 to 69,115,F,White,Not Span/Hispanic,2,Elective,Home w/ Home Health Services,2019,MUS021,ACQUIRED FOOT DEFORMITIES,MST030,"MUSCULOSKELETAL PROCEDURES, NEC",314,FOOT & TOE PROCEDURES,08,DISEASES AND DISORDERS OF THE MUSCULOSKELETAL SYSTEM AND CONNECTIVE TISSUE,2,Moderate,Minor,Surgical,Medicare,Medicare,,,,false,173746.57,27869.45
Long Island,Nassau,2908000,000511,NYU Langone Hospital-Long Island,70 or Older,114,F,White,Not Span/Hispanic,6,Elective,Home or Self Care,2019,END003,DIABETES MELLITUS WITH COMPLICATION,MST023,TOE AND MID FOOT AMPUTATION,314,FOOT & TOE PROCEDURES,08,DISEASES AND DISORDERS OF THE MUSCULOSKELETAL SYSTEM AND CONNECTIVE TISSUE,3,Major,Moderate,Surgical,Medicare,,,,,true,103222.32,17685.53
Long Island,Nassau,2908000,000511,NYU Langone Hospital-Long Island,50 to 69,115,M,Black/African American,Not Span/Hispanic,6,Emergency,Home w/ Home Health Services,2019,MUS002,OSTEOMYELITIS,MST023,TOE AND MID FOOT AMPUTATION,314,FOOT & TOE PROCEDURES,08,DISEASES AND DISORDERS OF THE MUSCULOSKELETAL SYSTEM AND CONNECTIVE TISSUE,3,Major,Major,Surgical,Medicare,Medicaid,,,,true,86200.51,16163.82
Long Island,Nassau,2908000,000511,NYU Langone Hospital-Long Island,50 to 69,117,M,White,Not Span/Hispanic,5,Emergency,Home w/ Home Health Services,2019,MUS002,OSTEOMYELITIS,MST002,BONE AND JOINT BIOPSY,314,FOOT & TOE PROCEDURES,08,DISEASES AND DISORDERS OF THE MUSCULOSKELETAL SYSTEM AND CONNECTIVE TISSUE,2,Moderate,Minor,Surgical,Medicare,,,,,true,75255.87,13419.37
Long Island,Nassau,2908000,000511,NYU Langone Hospital-Long Island,50 to 69,117,F,Black/African American,Not Span/Hispanic,9,Emergency,Home w/ Home Health Services,2019,END003,DIABETES MELLITUS WITH COMPLICATION,MST023,TOE AND MID FOOT AMPUTATION,314,FOOT & TOE PROCEDURES,08,DISEASES AND DISORDERS OF THE MUSCULOSKELETAL SYSTEM AND CONNECTIVE TISSUE,3,Major,Major,Surgical,Private Health Insurance,,,,,true,193858.44,31342.03
Long Island,Nassau,2908000,000511,NYU Langone Hospital-Long Island,70 or Older,115,F,White,Not Span/Hispanic,7,Emergency,Home or Self Care,2019,END003,DIABETES MELLITUS WITH COMPLICATION,ADM013,PERITONEAL DIALYSIS,314,FOOT & TOE PROCEDURES,08,DISEASES AND DISORDERS OF THE MUSCULOSKELETAL SYSTEM AND CONNECTIVE TISSUE,2,Moderate,Moderate,Surgical,Medicare,Blue Cross/Blue Shield,,,,true,112248.83,19231.9
Long Island,Nassau,2908000,000511,NYU Langone Hospital-Long Island,70 or Older,115,M,White,Not Span/Hispanic,14,Emergency,Inpatient Rehabilitation Facility,2019,MUS002,OSTEOMYELITIS,MST018,BONE EXCISION,314,FOOT & TOE PROCEDURES,08,DISEASES AND DISORDERS OF THE MUSCULOSKELETAL SYSTEM AND CONNECTIVE TISSUE,3,Major,Major,Surgical,Medicare,Blue Cross/Blue Shield,,,,true,209136.85,38846.94
Long Island,Nassau,2908000,000511,NYU Langone Hospital-Long Island,70 or Older,117,M,White,Not Span/Hispanic,9,Emergency,Skilled Nursing Home,2019,END003,DIABETES MELLITUS WITH COMPLICATION,MST023,TOE AND MID FOOT AMPUTATION,314,FOOT & TOE PROCEDURES,08,DISEASES AND DISORDERS OF THE MUSCULOSKELETAL SYSTEM AND CONNECTIVE TISSUE,3,Major,Major,Surgical,Medicare,Medicare,,,,true,108860.14,21755.4