Hospital Service Area,Hospital County,Operating Certificate Number,Permanent Facility Id,Facility Name,Age Group,Zip Code - 3 digits,Gender,Race,Ethnicity,Length of Stay,Type of Admission,Patient Disposition,Discharge Year,CCS Diagnosis Code,CCS Diagnosis Description,CCS Procedure Code,CCS Procedure Description,APR DRG Code,APR DRG Description,APR MDC Code,APR MDC Description,APR Severity of Illness Code,APR Severity of Illness Description,APR Risk of Mortality,APR Medical Surgical Description,Payment Typology 1,Payment Typology 2,Payment Typology 3,Birth Weight,Abortion Edit Indicator,Emergency Department Indicator,Total Charges,Total Costs
Hudson Valley,Westchester,5904001,001072,Montefiore New Rochelle Hospital,50 to 69,104,F,Black/African American,Unknown,4,Emergency,Home or Self Care,2017,229,Fracture of upper limb,148,OT FRACTURE/DISLOC PRC,315,"Shoulder, upper arm & forearm procedures except joint replacement",08,Diseases and Disorders of the Musculoskeletal System and Conn Tissue,2,Moderate,Minor,Surgical,Blue Cross/Blue Shield,Self-Pay,,,N,N,75065.00,34194.58
,,,,Redacted for Confidentiality,0 to 17,,F,White,Not Span/Hispanic,2,Emergency,Home or Self Care,2017,229,Fracture of upper limb,148,OT FRACTURE/DISLOC PRC,315,"Shoulder, upper arm & forearm procedures except joint replacement",08,Diseases and Disorders of the Musculoskeletal System and Conn Tissue,2,Moderate,Minor,Surgical,Blue Cross/Blue Shield,Self-Pay,,,N,N,39565.96,15953.31
New York City,Manhattan,7002032,001466,Mount Sinai West,70 or Older,100,F,White,Not Span/Hispanic,1,Elective,Home or Self Care,2017,229,Fracture of upper limb,145,"TRTMNT,FRAC RADIUS/ULNA",315,"Shoulder, upper arm & forearm procedures except joint replacement",08,Diseases and Disorders of the Musculoskeletal System and Conn Tissue,1,Minor,Minor,Surgical,Medicare,Self-Pay,,,N,N,20601.27,8406.34
New York City,Manhattan,7002032,001466,Mount Sinai West,70 or Older,100,F,White,Not Span/Hispanic,1,Elective,Home w/ Home Health Services,2017,229,Fracture of upper limb,145,"TRTMNT,FRAC RADIUS/ULNA",315,"Shoulder, upper arm & forearm procedures except joint replacement",08,Diseases and Disorders of the Musculoskeletal System and Conn Tissue,1,Minor,Minor,Surgical,Medicare,Medicare,Self-Pay,,N,N,26269.00,10509.17
New York City,Manhattan,7002032,001469,Mount Sinai St. Luke's,50 to 69,109,F,White,Not Span/Hispanic,2,Emergency,Home or Self Care,2017,229,Fracture of upper limb,145,"TRTMNT,FRAC RADIUS/ULNA",315,"Shoulder, upper arm & forearm procedures except joint replacement",08,Diseases and Disorders of the Musculoskeletal System and Conn Tissue,1,Minor,Minor,Surgical,Miscellaneous/Other,Private Health Insurance,Self-Pay,,N,Y,49929.15,17131.51
New York City,Bronx,7000006,001168,Montefiore Medical Center-Wakefield Hospital,50 to 69,104,F,White,Not Span/Hispanic,1,Elective,Home or Self Care,2017,211,Other connective tissue disease,154,ARTHROPLASTY-NOT HIP/KN,315,"Shoulder, upper arm & forearm procedures except joint replacement",08,Diseases and Disorders of the Musculoskeletal System and Conn Tissue,2,Moderate,Minor,Surgical,Medicare,Private Health Insurance,,,N,N,76824.62,24955.69
New York City,Bronx,7000006,001168,Montefiore Medical Center-Wakefield Hospital,50 to 69,104,F,Other Race,Not Span/Hispanic,1,Emergency,Home w/ Home Health Services,2017,229,Fracture of upper limb,148,OT FRACTURE/DISLOC PRC,315,"Shoulder, upper arm & forearm procedures except joint replacement",08,Diseases and Disorders of the Musculoskeletal System and Conn Tissue,2,Moderate,Minor,Surgical,Private Health Insurance,,,,N,N,40349.98,10202.69
New York City,Bronx,7000006,001169,Montefiore Medical Center - Henry & Lucy Moses Div,70 or Older,104,F,White,Not Span/Hispanic,6,Emergency,Skilled Nursing Home,2017,229,Fracture of upper limb,148,OT FRACTURE/DISLOC PRC,315,"Shoulder, upper arm & forearm procedures except joint replacement",08,Diseases and Disorders of the Musculoskeletal System and Conn Tissue,2,Moderate,Moderate,Surgical,Medicare,Private Health Insurance,,,N,Y,81066.54,18105.49
New York City,Bronx,7000006,001169,Montefiore Medical Center - Henry & Lucy Moses Div,0 to 17,104,M,Other Race,Not Span/Hispanic,10,Emergency,Home or Self Care,2017,244,Other injuries and conditions due to external causes,145,"TRTMNT,FRAC RADIUS/ULNA",315,"Shoulder, upper arm & forearm procedures except joint replacement",08,Diseases and Disorders of the Musculoskeletal System and Conn Tissue,3,Major,Minor,Surgical,Medicaid,,,,N,N,123179.50,35423.81
New York City,Manhattan,7002024,001456,Mount Sinai Hospital,70 or Older,100,M,White,Not Span/Hispanic,5,Emergency,Home w/ Home Health Services,2017,201,Infective arthritis and osteomyelitis (except that caused by tuberculosis or sexually transmitted disease),162,OT OR THER PRC ON JOINT,315,"Shoulder, upper arm & forearm procedures except joint replacement",08,Diseases and Disorders of the Musculoskeletal System and Conn Tissue,2,Moderate,Moderate,Surgical,Medicare,Medicare,Self-Pay,,N,Y,52524.98,18262.43
New York City,Manhattan,7002032,001466,Mount Sinai West,50 to 69,OOS,F,Other Race,Not Span/Hispanic,1,Elective,Home or Self Care,2017,237,Complication of device; implant or graft,145,"TRTMNT,FRAC RADIUS/ULNA",315,"Shoulder, upper arm & forearm procedures except joint replacement",08,Diseases and Disorders of the Musculoskeletal System and Conn Tissue,1,Minor,Minor,Surgical,Miscellaneous/Other,Self-Pay,,,N,N,22251.74,9679.24
New York City,Manhattan,7002032,001466,Mount Sinai West,30 to 49,112,M,Black/African American,Spanish/Hispanic,2,Emergency,Home or Self Care,2017,229,Fracture of upper limb,145,"TRTMNT,FRAC RADIUS/ULNA",315,"Shoulder, upper arm & forearm procedures except joint replacement",08,Diseases and Disorders of the Musculoskeletal System and Conn Tissue,1,Minor,Minor,Surgical,Miscellaneous/Other,Self-Pay,,,N,Y,33026.20,11904.94
Finger Lakes,Livingston,2527000,000393,Nicholas H Noyes Memorial Hospital,70 or Older,148,F,White,Not Span/Hispanic,2,Elective,Home or Self Care,2017,203,Osteoarthritis,154,ARTHROPLASTY-NOT HIP/KN,315,"Shoulder, upper arm & forearm procedures except joint replacement",08,Diseases and Disorders of the Musculoskeletal System and Conn Tissue,2,Moderate,Minor,Surgical,Medicare,Blue Cross/Blue Shield,,,N,N,48573.89,14641.79
Hudson Valley,Orange,3523000,000699,Orange Regional Medical Center,50 to 69,,F,White,Not Span/Hispanic,1,Elective,Home or Self Care,2017,229,Fracture of upper limb,145,"TRTMNT,FRAC RADIUS/ULNA",315,"Shoulder, upper arm & forearm procedures except joint replacement",08,Diseases and Disorders of the Musculoskeletal System and Conn Tissue,2,Moderate,Minor,Surgical,Medicare,,,,N,N,47783.58,17750.59
Hudson Valley,Orange,3523000,000699,Orange Regional Medical Center,70 or Older,109,F,White,Not Span/Hispanic,6,Emergency,Skilled Nursing Home,2017,229,Fracture of upper limb,148,OT FRACTURE/DISLOC PRC,315,"Shoulder, upper arm & forearm procedures except joint replacement",08,Diseases and Disorders of the Musculoskeletal System and Conn Tissue,3,Major,Minor,Surgical,Medicare,Private Health Insurance,,,N,Y,75863.06,23732.81
New York City,Bronx,7000006,001168,Montefiore Medical Center-Wakefield Hospital,50 to 69,104,F,White,Not Span/Hispanic,3,Emergency,Home w/ Home Health Services,2017,229,Fracture of upper limb,148,OT FRACTURE/DISLOC PRC,315,"Shoulder, upper arm & forearm procedures except joint replacement",08,Diseases and Disorders of the Musculoskeletal System and Conn Tissue,2,Moderate,Minor,Surgical,Medicaid,,,,N,N,70284.90,20464.94
New York City,Manhattan,7002002,001439,Mount Sinai Beth Israel,50 to 69,100,M,White,Not Span/Hispanic,1,Elective,Home or Self Care,2017,211,Other connective tissue disease,154,ARTHROPLASTY-NOT HIP/KN,315,"Shoulder, upper arm & forearm procedures except joint replacement",08,Diseases and Disorders of the Musculoskeletal System and Conn Tissue,2,Moderate,Minor,Surgical,Blue Cross/Blue Shield,Self-Pay,,,N,N,80293.58,22668.50
New York City,Manhattan,7002024,001456,Mount Sinai Hospital,50 to 69,OOS,F,White,Not Span/Hispanic,2,Emergency,Home or Self Care,2017,229,Fracture of upper limb,145,"TRTMNT,FRAC RADIUS/ULNA",315,"Shoulder, upper arm & forearm procedures except joint replacement",08,Diseases and Disorders of the Musculoskeletal System and Conn Tissue,1,Minor,Minor,Surgical,Self-Pay,Self-Pay,,,N,Y,31728.73,13462.37
New York City,Manhattan,7002032,001466,Mount Sinai West,70 or Older,113,F,Other Race,Not Span/Hispanic,8,Urgent,Skilled Nursing Home,2017,229,Fracture of upper limb,148,OT FRACTURE/DISLOC PRC,315,"Shoulder, upper arm & forearm procedures except joint replacement",08,Diseases and Disorders of the Musculoskeletal System and Conn Tissue,2,Moderate,Minor,Surgical,Medicare,Self-Pay,,,N,N,87675.99,30277.57
New York City,Manhattan,7002032,001466,Mount Sinai West,18 to 29,100,M,White,Unknown,4,Elective,Home or Self Care,2017,225,Joint disorders and dislocations; trauma-related,150,DIV OF JOINT CAPSULE,315,"Shoulder, upper arm & forearm procedures except joint replacement",08,Diseases and Disorders of the Musculoskeletal System and Conn Tissue,1,Minor,Minor,Surgical,Private Health Insurance,Medicaid,Self-Pay,,N,N,41791.98,16483.38
New York City,Manhattan,7002032,001466,Mount Sinai West,70 or Older,105,F,White,Not Span/Hispanic,2,Elective,Home or Self Care,2017,203,Osteoarthritis,154,ARTHROPLASTY-NOT HIP/KN,315,"Shoulder, upper arm & forearm procedures except joint replacement",08,Diseases and Disorders of the Musculoskeletal System and Conn Tissue,2,Moderate,Minor,Surgical,Blue Cross/Blue Shield,Medicare,Self-Pay,,N,N,63915.16,25884.02
New York City,Manhattan,7002032,001466,Mount Sinai West,50 to 69,124,F,White,Not Span/Hispanic,1,Elective,Home or Self Care,2017,212,Other bone disease and musculoskeletal deformities,162,OT OR THER PRC ON JOINT,315,"Shoulder, upper arm & forearm procedures except joint replacement",08,Diseases and Disorders of the Musculoskeletal System and Conn Tissue,1,Minor,Minor,Surgical,Medicare,Private Health Insurance,Self-Pay,,N,N,24364.92,10608.38
New York City,Manhattan,7002032,001466,Mount Sinai West,50 to 69,100,F,Other Race,Not Span/Hispanic,2,Emergency,Home or Self Care,2017,229,Fracture of upper limb,145,"TRTMNT,FRAC RADIUS/ULNA",315,"Shoulder, upper arm & forearm procedures except joint replacement",08,Diseases and Disorders of the Musculoskeletal System and Conn Tissue,1,Minor,Minor,Surgical,Self-Pay,Self-Pay,,,N,Y,33298.35,12013.98
New York City,Manhattan,7002032,001466,Mount Sinai West,50 to 69,OOS,F,Other Race,Not Span/Hispanic,2,Elective,Home w/ Home Health Services,2017,229,Fracture of upper limb,154,ARTHROPLASTY-NOT HIP/KN,315,"Shoulder, upper arm & forearm procedures except joint replacement",08,Diseases and Disorders of the Musculoskeletal System and Conn Tissue,2,Moderate,Minor,Surgical,Medicare,Private Health Insurance,Self-Pay,,N,N,86171.75,33101.48
New York City,Manhattan,7002032,001466,Mount Sinai West,50 to 69,100,M,White,Not Span/Hispanic,2,Urgent,Home or Self Care,2017,229,Fracture of upper limb,145,"TRTMNT,FRAC RADIUS/ULNA",315,"Shoulder, upper arm & forearm procedures except joint replacement",08,Diseases and Disorders of the Musculoskeletal System and Conn Tissue,1,Minor,Minor,Surgical,Private Health Insurance,Self-Pay,,,N,N,46181.33,19099.40
New York City,Manhattan,7002032,001469,Mount Sinai St. Luke's,30 to 49,100,F,White,Not Span/Hispanic,2,Trauma,Home or Self Care,2017,229,Fracture of upper limb,145,"TRTMNT,FRAC RADIUS/ULNA",315,"Shoulder, upper arm & forearm procedures except joint replacement",08,Diseases and Disorders of the Musculoskeletal System and Conn Tissue,1,Minor,Minor,Surgical,Miscellaneous/Other,Self-Pay,,,N,Y,43990.03,14832.98
New York City,Manhattan,7002032,001469,Mount Sinai St. Luke's,0 to 17,112,M,Other Race,Not Span/Hispanic,1,Urgent,Home or Self Care,2017,229,Fracture of upper limb,145,"TRTMNT,FRAC RADIUS/ULNA",315,"Shoulder, upper arm & forearm procedures except joint replacement",08,Diseases and Disorders of the Musculoskeletal System and Conn Tissue,1,Minor,Minor,Surgical,Blue Cross/Blue Shield,Self-Pay,,,N,N,39145.16,16873.50
Capital/Adirond,Columbia,1001000,000146,Columbia Memorial Hospital,50 to 69,125,F,White,Not Span/Hispanic,1,Elective,Home or Self Care,2017,203,Osteoarthritis,154,ARTHROPLASTY-NOT HIP/KN,315,"Shoulder, upper arm & forearm procedures except joint replacement",08,Diseases and Disorders of the Musculoskeletal System and Conn Tissue,2,Moderate,Minor,Surgical,Medicare,Federal/State/Local/VA,,,N,N,40928.97,13867.08
Capital/Adirond,Columbia,1001000,000146,Columbia Memorial Hospital,70 or Older,120,F,White,Not Span/Hispanic,3,Elective,Inpatient Rehabilitation Facility,2017,203,Osteoarthritis,154,ARTHROPLASTY-NOT HIP/KN,315,"Shoulder, upper arm & forearm procedures except joint replacement",08,Diseases and Disorders of the Musculoskeletal System and Conn Tissue,2,Moderate,Minor,Surgical,Medicare,Blue Cross/Blue Shield,,,N,N,46529.06,16643.34
Capital/Adirond,Columbia,1001000,000146,Columbia Memorial Hospital,70 or Older,125,F,White,Not Span/Hispanic,11,Emergency,Inpatient Rehabilitation Facility,2017,229,Fracture of upper limb,148,OT FRACTURE/DISLOC PRC,315,"Shoulder, upper arm & forearm procedures except joint replacement",08,Diseases and Disorders of the Musculoskeletal System and Conn Tissue,2,Moderate,Minor,Surgical,Medicare,Private Health Insurance,,,N,Y,42247.86,17849.75
Capital/Adirond,Columbia,1001000,000146,Columbia Memorial Hospital,70 or Older,125,M,White,Not Span/Hispanic,1,Emergency,Home or Self Care,2017,203,Osteoarthritis,154,ARTHROPLASTY-NOT HIP/KN,315,"Shoulder, upper arm & forearm procedures except joint replacement",08,Diseases and Disorders of the Musculoskeletal System and Conn Tissue,2,Moderate,Moderate,Surgical,Medicare,Private Health Insurance,,,N,N,40714.54,13803.63
Hudson Valley,Westchester,5904001,001072,Montefiore New Rochelle Hospital,70 or Older,106,M,White,Not Span/Hispanic,5,Elective,Home or Self Care,2017,203,Osteoarthritis,154,ARTHROPLASTY-NOT HIP/KN,315,"Shoulder, upper arm & forearm procedures except joint replacement",08,Diseases and Disorders of the Musculoskeletal System and Conn Tissue,2,Moderate,Minor,Surgical,Medicare,Blue Cross/Blue Shield,Self-Pay,,N,N,30533.00,16822.71
Hudson Valley,Westchester,5904001,001072,Montefiore New Rochelle Hospital,50 to 69,108,F,Other Race,Not Span/Hispanic,8,Emergency,Home or Self Care,2017,229,Fracture of upper limb,148,OT FRACTURE/DISLOC PRC,315,"Shoulder, upper arm & forearm procedures except joint replacement",08,Diseases and Disorders of the Musculoskeletal System and Conn Tissue,3,Major,Moderate,Surgical,Miscellaneous/Other,Private Health Insurance,Self-Pay,,N,N,72158.04,31844.51
New York City,Bronx,7000006,001169,Montefiore Medical Center - Henry & Lucy Moses Div,70 or Older,OOS,F,Other Race,Not Span/Hispanic,10,Emergency,Inpatient Rehabilitation Facility,2017,207,Pathological fracture,142,PARTIAL EXCISION BONE,315,"Shoulder, upper arm & forearm procedures except joint replacement",08,Diseases and Disorders of the Musculoskeletal System and Conn Tissue,2,Moderate,Major,Surgical,Medicare,Medicaid,,,N,N,200655.20,48104.26
New York City,Kings,7001003,001288,Brooklyn Hospital Center - Downtown Campus,50 to 69,112,F,Black/African American,Not Span/Hispanic,2,Emergency,Home or Self Care,2017,229,Fracture of upper limb,148,OT FRACTURE/DISLOC PRC,315,"Shoulder, upper arm & forearm procedures except joint replacement",08,Diseases and Disorders of the Musculoskeletal System and Conn Tissue,2,Moderate,Minor,Surgical,Private Health Insurance,Self-Pay,,,N,Y,63420.48,17129.59
New York City,Kings,7001003,001288,Brooklyn Hospital Center - Downtown Campus,70 or Older,112,M,Black/African American,Not Span/Hispanic,1,Urgent,Home or Self Care,2017,211,Other connective tissue disease,154,ARTHROPLASTY-NOT HIP/KN,315,"Shoulder, upper arm & forearm procedures except joint replacement",08,Diseases and Disorders of the Musculoskeletal System and Conn Tissue,2,Moderate,Minor,Surgical,Medicare,Medicare,Medicaid,,N,N,59046.30,18374.03
New York City,Manhattan,7002002,001439,Mount Sinai Beth Israel,50 to 69,104,M,Black/African American,Spanish/Hispanic,1,Elective,Home w/ Home Health Services,2017,203,Osteoarthritis,154,ARTHROPLASTY-NOT HIP/KN,315,"Shoulder, upper arm & forearm procedures except joint replacement",08,Diseases and Disorders of the Musculoskeletal System and Conn Tissue,2,Moderate,Minor,Surgical,Medicare,Medicaid,Self-Pay,,N,N,89199.88,24752.64
New York City,Manhattan,7002002,001439,Mount Sinai Beth Israel,70 or Older,100,F,White,Not Span/Hispanic,1,Elective,Home or Self Care,2017,211,Other connective tissue disease,154,ARTHROPLASTY-NOT HIP/KN,315,"Shoulder, upper arm & forearm procedures except joint replacement",08,Diseases and Disorders of the Musculoskeletal System and Conn Tissue,2,Moderate,Moderate,Surgical,Medicare,Private Health Insurance,Self-Pay,,N,N,82166.38,23017.97
New York City,Manhattan,7002024,001456,Mount Sinai Hospital,70 or Older,101,F,White,Not Span/Hispanic,3,Emergency,Skilled Nursing Home,2017,229,Fracture of upper limb,154,ARTHROPLASTY-NOT HIP/KN,315,"Shoulder, upper arm & forearm procedures except joint replacement",08,Diseases and Disorders of the Musculoskeletal System and Conn Tissue,2,Moderate,Minor,Surgical,Medicare,Medicare,Self-Pay,,N,Y,61269.50,27494.43
New York City,Manhattan,7002032,001466,Mount Sinai West,70 or Older,100,F,White,Not Span/Hispanic,3,Elective,Inpatient Rehabilitation Facility,2017,203,Osteoarthritis,154,ARTHROPLASTY-NOT HIP/KN,315,"Shoulder, upper arm & forearm procedures except joint replacement",08,Diseases and Disorders of the Musculoskeletal System and Conn Tissue,2,Moderate,Minor,Surgical,Medicare,Blue Cross/Blue Shield,Self-Pay,,N,N,101581.89,37225.81
New York City,Manhattan,7002032,001466,Mount Sinai West,70 or Older,101,F,White,Not Span/Hispanic,1,Elective,Home w/ Home Health Services,2017,229,Fracture of upper limb,145,"TRTMNT,FRAC RADIUS/ULNA",315,"Shoulder, upper arm & forearm procedures except joint replacement",08,Diseases and Disorders of the Musculoskeletal System and Conn Tissue,2,Moderate,Minor,Surgical,Medicare,Private Health Insurance,Self-Pay,,N,N,22473.39,9638.26
New York City,Manhattan,7002032,001466,Mount Sinai West,50 to 69,100,M,Black/African American,Not Span/Hispanic,7,Emergency,Skilled Nursing Home,2017,201,Infective arthritis and osteomyelitis (except that caused by tuberculosis or sexually transmitted disease),164,OT OR THER PRC MUSC/SKL,315,"Shoulder, upper arm & forearm procedures except joint replacement",08,Diseases and Disorders of the Musculoskeletal System and Conn Tissue,2,Moderate,Minor,Surgical,Medicare,Medicare,Self-Pay,,N,Y,66596.60,23313.79
New York City,Manhattan,7002032,001466,Mount Sinai West,50 to 69,100,M,White,Spanish/Hispanic,3,Emergency,Home or Self Care,2017,229,Fracture of upper limb,145,"TRTMNT,FRAC RADIUS/ULNA",315,"Shoulder, upper arm & forearm procedures except joint replacement",08,Diseases and Disorders of the Musculoskeletal System and Conn Tissue,1,Minor,Minor,Surgical,Miscellaneous/Other,Self-Pay,,,N,Y,43903.04,15787.55
New York City,Manhattan,7002032,001469,Mount Sinai St. Luke's,70 or Older,100,M,Black/African American,Spanish/Hispanic,6,Emergency,Home w/ Home Health Services,2017,229,Fracture of upper limb,148,OT FRACTURE/DISLOC PRC,315,"Shoulder, upper arm & forearm procedures except joint replacement",08,Diseases and Disorders of the Musculoskeletal System and Conn Tissue,2,Moderate,Minor,Surgical,Miscellaneous/Other,Medicare,Self-Pay,,N,Y,78800.93,26932.13
Long Island,Nassau,2950002,000528,Nassau University Medical Center,50 to 69,117,F,White,Not Span/Hispanic,3,Emergency,Home or Self Care,2017,229,Fracture of upper limb,145,"TRTMNT,FRAC RADIUS/ULNA",315,"Shoulder, upper arm & forearm procedures except joint replacement",08,Diseases and Disorders of the Musculoskeletal System and Conn Tissue,2,Moderate,Minor,Surgical,Private Health Insurance,Self-Pay,,,N,N,32362.53,16062.01
Long Island,Nassau,2950002,000528,Nassau University Medical Center,18 to 29,115,M,Other Race,Spanish/Hispanic,1,Emergency,Home or Self Care,2017,229,Fracture of upper limb,145,"TRTMNT,FRAC RADIUS/ULNA",315,"Shoulder, upper arm & forearm procedures except joint replacement",08,Diseases and Disorders of the Musculoskeletal System and Conn Tissue,1,Minor,Minor,Surgical,Medicaid,Self-Pay,,,N,N,8459.96,2965.57
New York City,Kings,7001021,001306,New York - Presbyterian Brooklyn Methodist Hospital,0 to 17,112,M,White,Not Span/Hispanic,1,Emergency,Home or Self Care,2017,229,Fracture of upper limb,148,OT FRACTURE/DISLOC PRC,315,"Shoulder, upper arm & forearm procedures except joint replacement",08,Diseases and Disorders of the Musculoskeletal System and Conn Tissue,1,Minor,Minor,Surgical,Private Health Insurance,Self-Pay,,,N,Y,17496.08,10231.62
New York City,Kings,7001021,001306,New York - Presbyterian Brooklyn Methodist Hospital,30 to 49,112,M,White,Not Span/Hispanic,2,Emergency,Home or Self Care,2017,229,Fracture of upper limb,145,"TRTMNT,FRAC RADIUS/ULNA",315,"Shoulder, upper arm & forearm procedures except joint replacement",08,Diseases and Disorders of the Musculoskeletal System and Conn Tissue,1,Minor,Minor,Surgical,Miscellaneous/Other,Self-Pay,,,N,Y,25134.48,11094.16
New York City,Kings,7001021,001306,New York - Presbyterian Brooklyn Methodist Hospital,50 to 69,112,F,Other Race,Spanish/Hispanic,1,Emergency,Home or Self Care,2017,229,Fracture of upper limb,145,"TRTMNT,FRAC RADIUS/ULNA",315,"Shoulder, upper arm & forearm procedures except joint replacement",08,Diseases and Disorders of the Musculoskeletal System and Conn Tissue,1,Minor,Minor,Surgical,Miscellaneous/Other,Self-Pay,,,N,Y,16573.78,8352.09
New York City,Kings,7002002,001324,Mount Sinai Brooklyn,50 to 69,112,F,White,Not Span/Hispanic,1,Emergency,Home or Self Care,2017,229,Fracture of upper limb,145,"TRTMNT,FRAC RADIUS/ULNA",315,"Shoulder, upper arm & forearm procedures except joint replacement",08,Diseases and Disorders of the Musculoskeletal System and Conn Tissue,1,Minor,Minor,Surgical,Private Health Insurance,Self-Pay,,,N,Y,25318.04,7314.80
New York City,Manhattan,7002054,001437,New York-Presbyterian/Lower Manhattan Hospital,50 to 69,105,M,Black/African American,Not Span/Hispanic,3,Elective,Home or Self Care,2017,237,Complication of device; implant or graft,154,ARTHROPLASTY-NOT HIP/KN,315,"Shoulder, upper arm & forearm procedures except joint replacement",08,Diseases and Disorders of the Musculoskeletal System and Conn Tissue,2,Moderate,Minor,Surgical,Medicare,Medicare,Self-Pay,,N,N,64418.57,21382.76
New York City,Manhattan,7002002,001439,Mount Sinai Beth Israel,70 or Older,117,M,White,Not Span/Hispanic,1,Elective,Home or Self Care,2017,203,Osteoarthritis,154,ARTHROPLASTY-NOT HIP/KN,315,"Shoulder, upper arm & forearm procedures except joint replacement",08,Diseases and Disorders of the Musculoskeletal System and Conn Tissue,2,Moderate,Moderate,Surgical,Medicare,Private Health Insurance,Self-Pay,,N,N,81378.94,22783.11
New York City,Manhattan,7002054,001458,New York Presbyterian Hospital - New York Weill Cornell Center,50 to 69,OOS,F,White,Not Span/Hispanic,8,Emergency,Skilled Nursing Home,2017,229,Fracture of upper limb,145,"TRTMNT,FRAC RADIUS/ULNA",315,"Shoulder, upper arm & forearm procedures except joint replacement",08,Diseases and Disorders of the Musculoskeletal System and Conn Tissue,1,Minor,Minor,Surgical,Blue Cross/Blue Shield,Self-Pay,,,N,Y,98977.87,27733.22