Hospital Service Area,Hospital County,Operating Certificate Number,Permanent Facility Id,Facility Name,Age Group,Zip Code - 3 digits,Gender,Race,Ethnicity,Length of Stay,Type of Admission,Patient Disposition,Discharge Year,CCS Diagnosis Code,CCS Diagnosis Description,CCS Procedure Code,CCS Procedure Description,APR DRG Code,APR DRG Description,APR MDC Code,APR MDC Description,APR Severity of Illness Code,APR Severity of Illness Description,APR Risk of Mortality,APR Medical Surgical Description,Payment Typology 1,Payment Typology 2,Payment Typology 3,Birth Weight,Abortion Edit Indicator,Emergency Department Indicator,Total Charges,Total Costs
New York City,Manhattan,7002001,001438,Bellevue Hospital Center,30 to 49,113,M,Other Race,Not Span/Hispanic,5,Emergency,Home or Self Care,2017,229,Fracture of upper limb,214,"TRACTN, SPLNT, OT WOUND",315,"Shoulder, upper arm & forearm procedures except joint replacement",08,Diseases and Disorders of the Musculoskeletal System and Conn Tissue,2,Moderate,Minor,Surgical,Medicaid,,,,N,Y,30974.73,19970.90
New York City,Manhattan,7002001,001438,Bellevue Hospital Center,0 to 17,100,M,Black/African American,Not Span/Hispanic,21,Emergency,Home or Self Care,2017,237,Complication of device; implant or graft,148,OT FRACTURE/DISLOC PRC,315,"Shoulder, upper arm & forearm procedures except joint replacement",08,Diseases and Disorders of the Musculoskeletal System and Conn Tissue,2,Moderate,Minor,Surgical,Medicaid,,,,N,Y,109104.93,70345.19
New York City,Manhattan,7002001,001438,Bellevue Hospital Center,50 to 69,OOS,M,White,Not Span/Hispanic,1,Elective,Skilled Nursing Home,2017,237,Complication of device; implant or graft,160,OT THER PRCS ON MUSCLES,315,"Shoulder, upper arm & forearm procedures except joint replacement",08,Diseases and Disorders of the Musculoskeletal System and Conn Tissue,2,Moderate,Minor,Surgical,Miscellaneous/Other,Blue Cross/Blue Shield,,,N,N,6960.04,4487.47
New York City,Manhattan,7002001,001438,Bellevue Hospital Center,0 to 17,112,F,Other Race,Spanish/Hispanic,1,Emergency,Home or Self Care,2017,229,Fracture of upper limb,148,OT FRACTURE/DISLOC PRC,315,"Shoulder, upper arm & forearm procedures except joint replacement",08,Diseases and Disorders of the Musculoskeletal System and Conn Tissue,1,Minor,Minor,Surgical,Medicaid,Medicaid,,,N,Y,7729.45,4983.55
New York City,Manhattan,7002001,001438,Bellevue Hospital Center,0 to 17,112,M,Other Race,Not Span/Hispanic,1,Emergency,Home or Self Care,2017,229,Fracture of upper limb,148,OT FRACTURE/DISLOC PRC,315,"Shoulder, upper arm & forearm procedures except joint replacement",08,Diseases and Disorders of the Musculoskeletal System and Conn Tissue,2,Moderate,Minor,Surgical,Medicaid,Medicaid,,,N,Y,8444.41,5444.52
New York City,Manhattan,7002001,001438,Bellevue Hospital Center,30 to 49,104,F,Other Race,Not Span/Hispanic,2,Elective,Home or Self Care,2017,229,Fracture of upper limb,148,OT FRACTURE/DISLOC PRC,315,"Shoulder, upper arm & forearm procedures except joint replacement",08,Diseases and Disorders of the Musculoskeletal System and Conn Tissue,2,Moderate,Minor,Surgical,Miscellaneous/Other,,,,N,N,14059.57,9064.88
New York City,Manhattan,7002001,001438,Bellevue Hospital Center,30 to 49,113,M,Other Race,Not Span/Hispanic,3,Emergency,Home or Self Care,2017,229,Fracture of upper limb,161,OT OR THER PRCS ON BONE,315,"Shoulder, upper arm & forearm procedures except joint replacement",08,Diseases and Disorders of the Musculoskeletal System and Conn Tissue,2,Moderate,Minor,Surgical,Medicaid,,,,N,N,17104.12,11027.85
New York City,Manhattan,7002001,001438,Bellevue Hospital Center,18 to 29,103,M,White,Not Span/Hispanic,2,Emergency,Home or Self Care,2017,229,Fracture of upper limb,145,"TRTMNT,FRAC RADIUS/ULNA",315,"Shoulder, upper arm & forearm procedures except joint replacement",08,Diseases and Disorders of the Musculoskeletal System and Conn Tissue,1,Minor,Minor,Surgical,Medicaid,,,,N,Y,14978.82,9657.56
New York City,Manhattan,7002001,001438,Bellevue Hospital Center,0 to 17,113,F,Other Race,Spanish/Hispanic,1,Emergency,Home or Self Care,2017,229,Fracture of upper limb,145,"TRTMNT,FRAC RADIUS/ULNA",315,"Shoulder, upper arm & forearm procedures except joint replacement",08,Diseases and Disorders of the Musculoskeletal System and Conn Tissue,1,Minor,Minor,Surgical,Medicaid,Medicaid,,,N,Y,7625.19,4916.33
New York City,Manhattan,7002001,001438,Bellevue Hospital Center,30 to 49,113,M,Other Race,Spanish/Hispanic,2,Emergency,Home or Self Care,2017,229,Fracture of upper limb,145,"TRTMNT,FRAC RADIUS/ULNA",315,"Shoulder, upper arm & forearm procedures except joint replacement",08,Diseases and Disorders of the Musculoskeletal System and Conn Tissue,2,Moderate,Minor,Surgical,Miscellaneous/Other,,,,N,Y,14783.47,9531.61
New York City,Manhattan,7002001,001438,Bellevue Hospital Center,50 to 69,112,F,White,Not Span/Hispanic,3,Emergency,Home or Self Care,2017,229,Fracture of upper limb,145,"TRTMNT,FRAC RADIUS/ULNA",315,"Shoulder, upper arm & forearm procedures except joint replacement",08,Diseases and Disorders of the Musculoskeletal System and Conn Tissue,2,Moderate,Minor,Surgical,Private Health Insurance,Private Health Insurance,,,N,Y,22234.89,14335.90
New York City,Manhattan,7002001,001438,Bellevue Hospital Center,18 to 29,104,M,Other Race,Spanish/Hispanic,2,Emergency,Home or Self Care,2017,229,Fracture of upper limb,145,"TRTMNT,FRAC RADIUS/ULNA",315,"Shoulder, upper arm & forearm procedures except joint replacement",08,Diseases and Disorders of the Musculoskeletal System and Conn Tissue,2,Moderate,Minor,Surgical,Medicaid,Medicaid,,,N,Y,11358.29,7323.23
New York City,Manhattan,7002001,001438,Bellevue Hospital Center,50 to 69,100,F,Other Race,Not Span/Hispanic,7,Emergency,Skilled Nursing Home,2017,229,Fracture of upper limb,145,"TRTMNT,FRAC RADIUS/ULNA",315,"Shoulder, upper arm & forearm procedures except joint replacement",08,Diseases and Disorders of the Musculoskeletal System and Conn Tissue,3,Major,Minor,Surgical,Miscellaneous/Other,,,,N,Y,41080.50,26486.57
New York City,Manhattan,7002001,001438,Bellevue Hospital Center,30 to 49,112,M,Other Race,Not Span/Hispanic,1,Emergency,Home or Self Care,2017,236,Open wounds of extremities,164,OT OR THER PRC MUSC/SKL,315,"Shoulder, upper arm & forearm procedures except joint replacement",08,Diseases and Disorders of the Musculoskeletal System and Conn Tissue,2,Moderate,Minor,Surgical,Private Health Insurance,,,,N,Y,7412.97,4779.50
New York City,Manhattan,7002001,001438,Bellevue Hospital Center,30 to 49,103,M,White,Not Span/Hispanic,2,Emergency,Home or Self Care,2017,229,Fracture of upper limb,145,"TRTMNT,FRAC RADIUS/ULNA",315,"Shoulder, upper arm & forearm procedures except joint replacement",08,Diseases and Disorders of the Musculoskeletal System and Conn Tissue,2,Moderate,Minor,Surgical,Medicaid,Medicaid,,,N,Y,15941.53,10278.27
New York City,Manhattan,7002001,001438,Bellevue Hospital Center,0 to 17,113,M,Other Race,Not Span/Hispanic,2,Emergency,Home or Self Care,2017,229,Fracture of upper limb,145,"TRTMNT,FRAC RADIUS/ULNA",315,"Shoulder, upper arm & forearm procedures except joint replacement",08,Diseases and Disorders of the Musculoskeletal System and Conn Tissue,1,Minor,Minor,Surgical,Medicaid,Medicaid,,,N,Y,13207.34,8515.41
New York City,Manhattan,7002001,001438,Bellevue Hospital Center,30 to 49,100,M,Black/African American,Not Span/Hispanic,3,Emergency,Home or Self Care,2017,229,Fracture of upper limb,148,OT FRACTURE/DISLOC PRC,315,"Shoulder, upper arm & forearm procedures except joint replacement",08,Diseases and Disorders of the Musculoskeletal System and Conn Tissue,2,Moderate,Minor,Surgical,Medicaid,Medicaid,,,N,Y,23255.36,14993.85
New York City,Manhattan,7002001,001438,Bellevue Hospital Center,18 to 29,104,M,Black/African American,Not Span/Hispanic,10,Emergency,Home or Self Care,2017,229,Fracture of upper limb,160,OT THER PRCS ON MUSCLES,315,"Shoulder, upper arm & forearm procedures except joint replacement",08,Diseases and Disorders of the Musculoskeletal System and Conn Tissue,2,Moderate,Minor,Surgical,Miscellaneous/Other,Private Health Insurance,,,N,Y,56412.31,36371.72
New York City,Manhattan,7002001,001438,Bellevue Hospital Center,0 to 17,104,M,Black/African American,Not Span/Hispanic,1,Emergency,Home or Self Care,2017,229,Fracture of upper limb,148,OT FRACTURE/DISLOC PRC,315,"Shoulder, upper arm & forearm procedures except joint replacement",08,Diseases and Disorders of the Musculoskeletal System and Conn Tissue,2,Moderate,Minor,Surgical,Medicaid,Medicaid,,,N,Y,8003.35,5160.14
New York City,Manhattan,7002001,001438,Bellevue Hospital Center,0 to 17,112,M,Other Race,Spanish/Hispanic,1,Emergency,Home or Self Care,2017,229,Fracture of upper limb,148,OT FRACTURE/DISLOC PRC,315,"Shoulder, upper arm & forearm procedures except joint replacement",08,Diseases and Disorders of the Musculoskeletal System and Conn Tissue,1,Minor,Minor,Surgical,Medicaid,Medicaid,,,N,Y,8445.00,5444.90
New York City,Manhattan,7002001,001438,Bellevue Hospital Center,30 to 49,111,M,White,Not Span/Hispanic,1,Emergency,Home or Self Care,2017,229,Fracture of upper limb,145,"TRTMNT,FRAC RADIUS/ULNA",315,"Shoulder, upper arm & forearm procedures except joint replacement",08,Diseases and Disorders of the Musculoskeletal System and Conn Tissue,1,Minor,Minor,Surgical,Private Health Insurance,,,,N,Y,7205.75,4645.89
New York City,Manhattan,7002001,001438,Bellevue Hospital Center,30 to 49,100,M,Other Race,Not Span/Hispanic,2,Elective,Home or Self Care,2017,229,Fracture of upper limb,145,"TRTMNT,FRAC RADIUS/ULNA",315,"Shoulder, upper arm & forearm procedures except joint replacement",08,Diseases and Disorders of the Musculoskeletal System and Conn Tissue,1,Minor,Minor,Surgical,Self-Pay,,,,N,N,13673.39,8815.89
New York City,Manhattan,7002001,001438,Bellevue Hospital Center,50 to 69,OOS,F,White,Not Span/Hispanic,4,Emergency,Home or Self Care,2017,229,Fracture of upper limb,145,"TRTMNT,FRAC RADIUS/ULNA",315,"Shoulder, upper arm & forearm procedures except joint replacement",08,Diseases and Disorders of the Musculoskeletal System and Conn Tissue,2,Moderate,Minor,Surgical,Medicare,Blue Cross/Blue Shield,,,N,Y,23312.92,15030.96
New York City,Manhattan,7002001,001438,Bellevue Hospital Center,30 to 49,113,M,Other Race,Not Span/Hispanic,3,Emergency,Home or Self Care,2017,229,Fracture of upper limb,145,"TRTMNT,FRAC RADIUS/ULNA",315,"Shoulder, upper arm & forearm procedures except joint replacement",08,Diseases and Disorders of the Musculoskeletal System and Conn Tissue,1,Minor,Minor,Surgical,Medicaid,,,,N,N,18327.55,11816.65
New York City,Manhattan,7002001,001438,Bellevue Hospital Center,18 to 29,112,M,Other Race,Not Span/Hispanic,1,Emergency,Home or Self Care,2017,229,Fracture of upper limb,148,OT FRACTURE/DISLOC PRC,315,"Shoulder, upper arm & forearm procedures except joint replacement",08,Diseases and Disorders of the Musculoskeletal System and Conn Tissue,2,Moderate,Minor,Surgical,Miscellaneous/Other,Medicaid,,,N,Y,10476.83,6754.92
New York City,Manhattan,7002001,001438,Bellevue Hospital Center,0 to 17,113,M,Other Race,Not Span/Hispanic,2,Emergency,Home or Self Care,2017,229,Fracture of upper limb,148,OT FRACTURE/DISLOC PRC,315,"Shoulder, upper arm & forearm procedures except joint replacement",08,Diseases and Disorders of the Musculoskeletal System and Conn Tissue,1,Minor,Minor,Surgical,Medicaid,Medicaid,,,N,Y,13180.76,8498.27
New York City,Manhattan,7002001,001438,Bellevue Hospital Center,50 to 69,111,M,Other Race,Spanish/Hispanic,2,Emergency,Home or Self Care,2017,229,Fracture of upper limb,145,"TRTMNT,FRAC RADIUS/ULNA",315,"Shoulder, upper arm & forearm procedures except joint replacement",08,Diseases and Disorders of the Musculoskeletal System and Conn Tissue,1,Minor,Minor,Surgical,Medicaid,,,,N,Y,13970.38,9007.37
New York City,Manhattan,7002001,001438,Bellevue Hospital Center,50 to 69,OOS,F,Other Race,Spanish/Hispanic,1,Emergency,Home or Self Care,2017,229,Fracture of upper limb,148,OT FRACTURE/DISLOC PRC,315,"Shoulder, upper arm & forearm procedures except joint replacement",08,Diseases and Disorders of the Musculoskeletal System and Conn Tissue,2,Moderate,Minor,Surgical,Miscellaneous/Other,Blue Cross/Blue Shield,,,N,Y,12886.31,8308.42
New York City,Manhattan,7002001,001438,Bellevue Hospital Center,0 to 17,112,F,Other Race,Spanish/Hispanic,1,Emergency,Home or Self Care,2017,229,Fracture of upper limb,148,OT FRACTURE/DISLOC PRC,315,"Shoulder, upper arm & forearm procedures except joint replacement",08,Diseases and Disorders of the Musculoskeletal System and Conn Tissue,1,Minor,Minor,Surgical,Blue Cross/Blue Shield,,,,N,Y,7614.80,4909.63
New York City,Manhattan,7002001,001438,Bellevue Hospital Center,30 to 49,113,M,Other Race,Not Span/Hispanic,2,Emergency,Home or Self Care,2017,229,Fracture of upper limb,145,"TRTMNT,FRAC RADIUS/ULNA",315,"Shoulder, upper arm & forearm procedures except joint replacement",08,Diseases and Disorders of the Musculoskeletal System and Conn Tissue,1,Minor,Minor,Surgical,Department of Corrections,,,,N,N,13021.41,8395.53
New York City,Manhattan,7002001,001438,Bellevue Hospital Center,30 to 49,111,F,White,Not Span/Hispanic,5,Emergency,Home or Self Care,2017,229,Fracture of upper limb,148,OT FRACTURE/DISLOC PRC,315,"Shoulder, upper arm & forearm procedures except joint replacement",08,Diseases and Disorders of the Musculoskeletal System and Conn Tissue,3,Major,Major,Surgical,Miscellaneous/Other,Miscellaneous/Other,Private Health Insurance,,N,Y,47751.46,30787.66
New York City,Manhattan,7002001,001438,Bellevue Hospital Center,50 to 69,100,M,White,Not Span/Hispanic,2,Emergency,Home or Self Care,2017,238,Complications of surgical procedures or medical care,145,"TRTMNT,FRAC RADIUS/ULNA",315,"Shoulder, upper arm & forearm procedures except joint replacement",08,Diseases and Disorders of the Musculoskeletal System and Conn Tissue,2,Moderate,Minor,Surgical,Medicaid,Medicaid,,,N,Y,15564.57,10035.23
New York City,Manhattan,7002001,001438,Bellevue Hospital Center,0 to 17,112,M,Black/African American,Not Span/Hispanic,2,Emergency,Home or Self Care,2017,229,Fracture of upper limb,145,"TRTMNT,FRAC RADIUS/ULNA",315,"Shoulder, upper arm & forearm procedures except joint replacement",08,Diseases and Disorders of the Musculoskeletal System and Conn Tissue,1,Minor,Minor,Surgical,Medicaid,Medicaid,,,N,Y,14077.15,9076.21
New York City,Manhattan,7002001,001438,Bellevue Hospital Center,0 to 17,112,M,Other Race,Not Span/Hispanic,1,Emergency,Home or Self Care,2017,229,Fracture of upper limb,148,OT FRACTURE/DISLOC PRC,315,"Shoulder, upper arm & forearm procedures except joint replacement",08,Diseases and Disorders of the Musculoskeletal System and Conn Tissue,1,Minor,Minor,Surgical,Medicaid,Medicaid,,,N,N,7213.59,4650.95
New York City,Manhattan,7002001,001438,Bellevue Hospital Center,70 or Older,100,F,Other Race,Spanish/Hispanic,2,Emergency,Home w/ Home Health Services,2017,229,Fracture of upper limb,145,"TRTMNT,FRAC RADIUS/ULNA",315,"Shoulder, upper arm & forearm procedures except joint replacement",08,Diseases and Disorders of the Musculoskeletal System and Conn Tissue,1,Minor,Minor,Surgical,Medicare,Medicare,Medicaid,,N,Y,14542.83,9376.46
New York City,Manhattan,7002001,001438,Bellevue Hospital Center,50 to 69,OOS,M,White,Not Span/Hispanic,3,Emergency,Home or Self Care,2017,229,Fracture of upper limb,145,"TRTMNT,FRAC RADIUS/ULNA",315,"Shoulder, upper arm & forearm procedures except joint replacement",08,Diseases and Disorders of the Musculoskeletal System and Conn Tissue,2,Moderate,Minor,Surgical,Blue Cross/Blue Shield,,,,N,Y,27592.94,17790.49
New York City,Manhattan,7002001,001438,Bellevue Hospital Center,50 to 69,100,F,Other Race,Not Span/Hispanic,1,Emergency,Home or Self Care,2017,229,Fracture of upper limb,145,"TRTMNT,FRAC RADIUS/ULNA",315,"Shoulder, upper arm & forearm procedures except joint replacement",08,Diseases and Disorders of the Musculoskeletal System and Conn Tissue,1,Minor,Minor,Surgical,Self-Pay,,,,N,Y,9101.29,5868.04
New York City,Manhattan,7002001,001438,Bellevue Hospital Center,0 to 17,112,F,Other Race,Spanish/Hispanic,1,Emergency,Home or Self Care,2017,229,Fracture of upper limb,148,OT FRACTURE/DISLOC PRC,315,"Shoulder, upper arm & forearm procedures except joint replacement",08,Diseases and Disorders of the Musculoskeletal System and Conn Tissue,1,Minor,Minor,Surgical,Medicaid,Medicaid,,,N,Y,8254.37,5321.99
New York City,Manhattan,7002001,001438,Bellevue Hospital Center,0 to 17,112,F,Other Race,Spanish/Hispanic,1,Emergency,Home or Self Care,2017,229,Fracture of upper limb,148,OT FRACTURE/DISLOC PRC,315,"Shoulder, upper arm & forearm procedures except joint replacement",08,Diseases and Disorders of the Musculoskeletal System and Conn Tissue,1,Minor,Minor,Surgical,Medicaid,Medicaid,,,N,Y,7455.43,4806.87
New York City,Manhattan,7002001,001438,Bellevue Hospital Center,0 to 17,OOS,F,Other Race,Not Span/Hispanic,1,Emergency,Home or Self Care,2017,229,Fracture of upper limb,148,OT FRACTURE/DISLOC PRC,315,"Shoulder, upper arm & forearm procedures except joint replacement",08,Diseases and Disorders of the Musculoskeletal System and Conn Tissue,1,Minor,Minor,Surgical,Blue Cross/Blue Shield,,,,N,Y,7477.26,4820.95
New York City,Manhattan,7002001,001438,Bellevue Hospital Center,50 to 69,113,F,Other Race,Spanish/Hispanic,1,Emergency,Home or Self Care,2017,229,Fracture of upper limb,145,"TRTMNT,FRAC RADIUS/ULNA",315,"Shoulder, upper arm & forearm procedures except joint replacement",08,Diseases and Disorders of the Musculoskeletal System and Conn Tissue,2,Moderate,Minor,Surgical,Private Health Insurance,,,,N,Y,8273.38,5334.25
New York City,Manhattan,7002001,001438,Bellevue Hospital Center,0 to 17,113,F,Other Race,Not Span/Hispanic,1,Emergency,Home or Self Care,2017,229,Fracture of upper limb,145,"TRTMNT,FRAC RADIUS/ULNA",315,"Shoulder, upper arm & forearm procedures except joint replacement",08,Diseases and Disorders of the Musculoskeletal System and Conn Tissue,1,Minor,Minor,Surgical,Medicaid,Medicaid,,,N,Y,7625.19,4916.33
New York City,Manhattan,7002001,001438,Bellevue Hospital Center,30 to 49,100,M,White,Not Span/Hispanic,2,Emergency,Home or Self Care,2017,229,Fracture of upper limb,145,"TRTMNT,FRAC RADIUS/ULNA",315,"Shoulder, upper arm & forearm procedures except joint replacement",08,Diseases and Disorders of the Musculoskeletal System and Conn Tissue,1,Minor,Minor,Surgical,Private Health Insurance,,,,N,Y,16115.67,10390.55
New York City,Manhattan,7002001,001438,Bellevue Hospital Center,18 to 29,112,M,Black/African American,Not Span/Hispanic,12,Emergency,Another Type Not Listed,2017,229,Fracture of upper limb,148,OT FRACTURE/DISLOC PRC,315,"Shoulder, upper arm & forearm procedures except joint replacement",08,Diseases and Disorders of the Musculoskeletal System and Conn Tissue,2,Moderate,Moderate,Surgical,Medicaid,,,,N,Y,81723.43,52691.02
New York City,Manhattan,7002001,001438,Bellevue Hospital Center,70 or Older,104,F,Other Race,Not Span/Hispanic,5,Emergency,Home or Self Care,2017,229,Fracture of upper limb,148,OT FRACTURE/DISLOC PRC,315,"Shoulder, upper arm & forearm procedures except joint replacement",08,Diseases and Disorders of the Musculoskeletal System and Conn Tissue,2,Moderate,Minor,Surgical,Medicare,,,,N,N,27425.09,17682.27
New York City,Manhattan,7002001,001438,Bellevue Hospital Center,50 to 69,104,M,Other Race,Spanish/Hispanic,9,Emergency,Skilled Nursing Home,2017,231,Other fractures,148,OT FRACTURE/DISLOC PRC,315,"Shoulder, upper arm & forearm procedures except joint replacement",08,Diseases and Disorders of the Musculoskeletal System and Conn Tissue,2,Moderate,Minor,Surgical,Miscellaneous/Other,,,,N,N,57339.31,36969.41
New York City,Manhattan,7002001,001438,Bellevue Hospital Center,0 to 17,112,M,Black/African American,Not Span/Hispanic,1,Emergency,Home or Self Care,2017,229,Fracture of upper limb,148,OT FRACTURE/DISLOC PRC,315,"Shoulder, upper arm & forearm procedures except joint replacement",08,Diseases and Disorders of the Musculoskeletal System and Conn Tissue,2,Moderate,Minor,Surgical,Medicaid,Medicaid,,,N,Y,7236.15,4665.49
New York City,Manhattan,7002001,001438,Bellevue Hospital Center,0 to 17,107,M,Black/African American,Not Span/Hispanic,2,Emergency,Home or Self Care,2017,229,Fracture of upper limb,145,"TRTMNT,FRAC RADIUS/ULNA",315,"Shoulder, upper arm & forearm procedures except joint replacement",08,Diseases and Disorders of the Musculoskeletal System and Conn Tissue,2,Moderate,Minor,Surgical,Medicaid,,,,N,Y,13053.50,8416.22
New York City,Manhattan,7002001,001438,Bellevue Hospital Center,30 to 49,111,M,Other Race,Not Span/Hispanic,2,Emergency,Home or Self Care,2017,229,Fracture of upper limb,145,"TRTMNT,FRAC RADIUS/ULNA",315,"Shoulder, upper arm & forearm procedures except joint replacement",08,Diseases and Disorders of the Musculoskeletal System and Conn Tissue,2,Moderate,Minor,Surgical,Miscellaneous/Other,Private Health Insurance,,,N,Y,15952.77,10285.52
New York City,Manhattan,7002001,001438,Bellevue Hospital Center,50 to 69,115,M,White,Not Span/Hispanic,6,Emergency,Home or Self Care,2017,229,Fracture of upper limb,145,"TRTMNT,FRAC RADIUS/ULNA",315,"Shoulder, upper arm & forearm procedures except joint replacement",08,Diseases and Disorders of the Musculoskeletal System and Conn Tissue,2,Moderate,Minor,Surgical,Medicaid,Medicaid,,,N,Y,32822.42,21162.19
New York City,Manhattan,7002001,001438,Bellevue Hospital Center,30 to 49,OOS,M,Black/African American,Not Span/Hispanic,5,Emergency,Home or Self Care,2017,229,Fracture of upper limb,142,PARTIAL EXCISION BONE,315,"Shoulder, upper arm & forearm procedures except joint replacement",08,Diseases and Disorders of the Musculoskeletal System and Conn Tissue,2,Moderate,Minor,Surgical,Self-Pay,,,,N,Y,41254.41,26598.70
New York City,Manhattan,7002001,001438,Bellevue Hospital Center,0 to 17,113,F,Other Race,Not Span/Hispanic,2,Elective,Home or Self Care,2017,217,Other congenital anomalies,162,OT OR THER PRC ON JOINT,315,"Shoulder, upper arm & forearm procedures except joint replacement",08,Diseases and Disorders of the Musculoskeletal System and Conn Tissue,1,Minor,Minor,Surgical,Medicaid,Medicaid,,,N,N,11718.56,7555.52
New York City,Manhattan,7002001,001438,Bellevue Hospital Center,0 to 17,113,M,Other Race,Not Span/Hispanic,1,Emergency,Home or Self Care,2017,229,Fracture of upper limb,148,OT FRACTURE/DISLOC PRC,315,"Shoulder, upper arm & forearm procedures except joint replacement",08,Diseases and Disorders of the Musculoskeletal System and Conn Tissue,1,Minor,Minor,Surgical,Medicaid,,,,N,Y,8131.74,5242.92
New York City,Manhattan,7002001,001438,Bellevue Hospital Center,30 to 49,100,F,Other Race,Not Span/Hispanic,43,Emergency,Another Type Not Listed,2017,201,Infective arthritis and osteomyelitis (except that caused by tuberculosis or sexually transmitted disease),162,OT OR THER PRC ON JOINT,315,"Shoulder, upper arm & forearm procedures except joint replacement",08,Diseases and Disorders of the Musculoskeletal System and Conn Tissue,3,Major,Major,Surgical,Medicaid,Medicaid,,,N,Y,219591.33,141581.07
New York City,Manhattan,7002001,001438,Bellevue Hospital Center,0 to 17,114,M,Other Race,Not Span/Hispanic,2,Emergency,Home or Self Care,2017,229,Fracture of upper limb,148,OT FRACTURE/DISLOC PRC,315,"Shoulder, upper arm & forearm procedures except joint replacement",08,Diseases and Disorders of the Musculoskeletal System and Conn Tissue,2,Moderate,Minor,Surgical,Medicaid,Medicaid,,,N,Y,12165.20,7843.49
New York City,Manhattan,7002001,001438,Bellevue Hospital Center,0 to 17,113,M,Other Race,Not Span/Hispanic,1,Emergency,Home or Self Care,2017,229,Fracture of upper limb,148,OT FRACTURE/DISLOC PRC,315,"Shoulder, upper arm & forearm procedures except joint replacement",08,Diseases and Disorders of the Musculoskeletal System and Conn Tissue,2,Moderate,Minor,Surgical,Medicaid,Medicaid,,,N,Y,7226.72,4659.41