Hospital Service Area,Hospital County,Operating Certificate Number,Permanent Facility Id,Facility Name,Age Group,Zip Code - 3 digits,Gender,Race,Ethnicity,Length of Stay,Type of Admission,Patient Disposition,Discharge Year,CCS Diagnosis Code,CCS Diagnosis Description,CCS Procedure Code,CCS Procedure Description,APR DRG Code,APR DRG Description,APR MDC Code,APR MDC Description,APR Severity of Illness Code,APR Severity of Illness Description,APR Risk of Mortality,APR Medical Surgical Description,Payment Typology 1,Payment Typology 2,Payment Typology 3,Birth Weight,Abortion Edit Indicator,Emergency Department Indicator,Total Charges,Total Costs
Long Island,Nassau,2908000,000511,NYU Winthrop Hospital,70 or Older,115,M,White,Not Span/Hispanic,8,Emergency,Skilled Nursing Home,2017,229,Fracture of upper limb,145,"TRTMNT,FRAC RADIUS/ULNA",315,"Shoulder, upper arm & forearm procedures except joint replacement",08,Diseases and Disorders of the Musculoskeletal System and Conn Tissue,3,Major,Moderate,Surgical,Medicare,Medicare,Private Health Insurance,,N,Y,131558.30,26740.65
Long Island,Nassau,2908000,000511,NYU Winthrop Hospital,70 or Older,115,F,White,Not Span/Hispanic,2,Elective,Home w/ Home Health Services,2017,229,Fracture of upper limb,148,OT FRACTURE/DISLOC PRC,315,"Shoulder, upper arm & forearm procedures except joint replacement",08,Diseases and Disorders of the Musculoskeletal System and Conn Tissue,2,Moderate,Minor,Surgical,Medicare,Medicare,Private Health Insurance,,N,N,75583.65,22044.45
Long Island,Nassau,2908000,000511,NYU Winthrop Hospital,0 to 17,117,F,White,Spanish/Hispanic,2,Emergency,Home or Self Care,2017,229,Fracture of upper limb,148,OT FRACTURE/DISLOC PRC,315,"Shoulder, upper arm & forearm procedures except joint replacement",08,Diseases and Disorders of the Musculoskeletal System and Conn Tissue,1,Minor,Minor,Surgical,Medicaid,Medicaid,,,N,Y,28268.05,8516.12
Long Island,Nassau,2908000,000511,NYU Winthrop Hospital,50 to 69,115,M,White,Spanish/Hispanic,8,Emergency,Expired,2017,201,Infective arthritis and osteomyelitis (except that caused by tuberculosis or sexually transmitted disease),159,OT DX PRCS ON MUSC/SKEL,315,"Shoulder, upper arm & forearm procedures except joint replacement",08,Diseases and Disorders of the Musculoskeletal System and Conn Tissue,2,Moderate,Moderate,Surgical,Medicaid,,,,N,Y,94418.30,23024.16
Long Island,Nassau,2908000,000511,NYU Winthrop Hospital,30 to 49,117,M,White,Spanish/Hispanic,1,Emergency,Home or Self Care,2017,237,Complication of device; implant or graft,162,OT OR THER PRC ON JOINT,315,"Shoulder, upper arm & forearm procedures except joint replacement",08,Diseases and Disorders of the Musculoskeletal System and Conn Tissue,2,Moderate,Minor,Surgical,Miscellaneous/Other,,,,N,Y,29288.21,8969.97
Long Island,Nassau,2908000,000511,NYU Winthrop Hospital,50 to 69,115,M,White,Not Span/Hispanic,4,Elective,Skilled Nursing Home,2017,229,Fracture of upper limb,148,OT FRACTURE/DISLOC PRC,315,"Shoulder, upper arm & forearm procedures except joint replacement",08,Diseases and Disorders of the Musculoskeletal System and Conn Tissue,2,Moderate,Moderate,Surgical,Medicare,Medicare,Medicaid,,N,N,139552.47,33957.44
Long Island,Nassau,2908000,000511,NYU Winthrop Hospital,30 to 49,117,F,White,Not Span/Hispanic,3,Emergency,Home or Self Care,2017,229,Fracture of upper limb,148,OT FRACTURE/DISLOC PRC,315,"Shoulder, upper arm & forearm procedures except joint replacement",08,Diseases and Disorders of the Musculoskeletal System and Conn Tissue,2,Moderate,Minor,Surgical,Blue Cross/Blue Shield,Self-Pay,,,N,Y,89475.63,24697.26
Long Island,Nassau,2908000,000511,NYU Winthrop Hospital,30 to 49,110,F,Other Race,Not Span/Hispanic,2,Elective,Home or Self Care,2017,229,Fracture of upper limb,148,OT FRACTURE/DISLOC PRC,315,"Shoulder, upper arm & forearm procedures except joint replacement",08,Diseases and Disorders of the Musculoskeletal System and Conn Tissue,2,Moderate,Minor,Surgical,Private Health Insurance,,,,N,N,117518.79,33648.65
Long Island,Nassau,2908000,000511,NYU Winthrop Hospital,0 to 17,115,M,White,Not Span/Hispanic,1,Emergency,Home or Self Care,2017,229,Fracture of upper limb,148,OT FRACTURE/DISLOC PRC,315,"Shoulder, upper arm & forearm procedures except joint replacement",08,Diseases and Disorders of the Musculoskeletal System and Conn Tissue,2,Moderate,Minor,Surgical,Blue Cross/Blue Shield,,,,N,Y,34396.29,9409.00
Long Island,Nassau,2908000,000511,NYU Winthrop Hospital,0 to 17,117,F,White,Spanish/Hispanic,1,Elective,Home or Self Care,2017,229,Fracture of upper limb,148,OT FRACTURE/DISLOC PRC,315,"Shoulder, upper arm & forearm procedures except joint replacement",08,Diseases and Disorders of the Musculoskeletal System and Conn Tissue,2,Moderate,Minor,Surgical,Private Health Insurance,,,,N,N,17071.41,6083.04
Long Island,Nassau,2908000,000511,NYU Winthrop Hospital,50 to 69,117,M,White,Not Span/Hispanic,10,Emergency,Home or Self Care,2017,201,Infective arthritis and osteomyelitis (except that caused by tuberculosis or sexually transmitted disease),159,OT DX PRCS ON MUSC/SKEL,315,"Shoulder, upper arm & forearm procedures except joint replacement",08,Diseases and Disorders of the Musculoskeletal System and Conn Tissue,3,Major,Moderate,Surgical,Medicaid,Medicaid,,,N,Y,132727.28,33840.31
Long Island,Nassau,2908000,000511,NYU Winthrop Hospital,50 to 69,110,F,White,Not Span/Hispanic,3,Emergency,Skilled Nursing Home,2017,229,Fracture of upper limb,145,"TRTMNT,FRAC RADIUS/ULNA",315,"Shoulder, upper arm & forearm procedures except joint replacement",08,Diseases and Disorders of the Musculoskeletal System and Conn Tissue,2,Moderate,Minor,Surgical,Medicare,Medicare,Blue Cross/Blue Shield,,N,Y,119389.24,29606.90
Long Island,Nassau,2908000,000511,NYU Winthrop Hospital,70 or Older,117,F,White,Not Span/Hispanic,9,Emergency,Home w/ Home Health Services,2017,229,Fracture of upper limb,154,ARTHROPLASTY-NOT HIP/KN,315,"Shoulder, upper arm & forearm procedures except joint replacement",08,Diseases and Disorders of the Musculoskeletal System and Conn Tissue,2,Moderate,Minor,Surgical,Medicare,Medicare,Private Health Insurance,,N,Y,212253.76,53722.09
Long Island,Nassau,2908000,000511,NYU Winthrop Hospital,50 to 69,115,F,White,Not Span/Hispanic,2,Emergency,Home w/ Home Health Services,2017,229,Fracture of upper limb,148,OT FRACTURE/DISLOC PRC,315,"Shoulder, upper arm & forearm procedures except joint replacement",08,Diseases and Disorders of the Musculoskeletal System and Conn Tissue,2,Moderate,Minor,Surgical,Private Health Insurance,,,,N,Y,96837.71,21443.79
Long Island,Nassau,2908000,000511,NYU Winthrop Hospital,70 or Older,115,F,White,Not Span/Hispanic,1,Elective,Home or Self Care,2017,229,Fracture of upper limb,148,OT FRACTURE/DISLOC PRC,315,"Shoulder, upper arm & forearm procedures except joint replacement",08,Diseases and Disorders of the Musculoskeletal System and Conn Tissue,2,Moderate,Minor,Surgical,Medicare,Medicare,,,N,N,70145.36,20321.29
Long Island,Nassau,2908000,000511,NYU Winthrop Hospital,50 to 69,115,F,White,Not Span/Hispanic,9,Emergency,Home w/ Home Health Services,2017,042,Secondary malignancies,148,OT FRACTURE/DISLOC PRC,315,"Shoulder, upper arm & forearm procedures except joint replacement",08,Diseases and Disorders of the Musculoskeletal System and Conn Tissue,3,Major,Major,Surgical,Medicare,Medicare,Medicaid,,N,Y,121248.77,25864.00
Long Island,Nassau,2908000,000511,NYU Winthrop Hospital,0 to 17,117,M,White,Not Span/Hispanic,1,Emergency,Home or Self Care,2017,229,Fracture of upper limb,145,"TRTMNT,FRAC RADIUS/ULNA",315,"Shoulder, upper arm & forearm procedures except joint replacement",08,Diseases and Disorders of the Musculoskeletal System and Conn Tissue,1,Minor,Minor,Surgical,Private Health Insurance,,,,N,Y,34437.37,10412.15
Long Island,Nassau,2908000,000511,NYU Winthrop Hospital,30 to 49,111,M,White,Not Span/Hispanic,1,Elective,Home or Self Care,2017,229,Fracture of upper limb,148,OT FRACTURE/DISLOC PRC,315,"Shoulder, upper arm & forearm procedures except joint replacement",08,Diseases and Disorders of the Musculoskeletal System and Conn Tissue,2,Moderate,Minor,Surgical,Federal/State/Local/VA,,,,N,N,103031.64,29351.07
Long Island,Nassau,2908000,000511,NYU Winthrop Hospital,0 to 17,115,M,White,Spanish/Hispanic,2,Emergency,Home w/ Home Health Services,2017,229,Fracture of upper limb,148,OT FRACTURE/DISLOC PRC,315,"Shoulder, upper arm & forearm procedures except joint replacement",08,Diseases and Disorders of the Musculoskeletal System and Conn Tissue,1,Minor,Minor,Surgical,Private Health Insurance,,,,N,Y,39373.05,13137.78
Long Island,Nassau,2908000,000511,NYU Winthrop Hospital,30 to 49,113,M,White,Spanish/Hispanic,1,Elective,Home w/ Home Health Services,2017,209,Other acquired deformities,162,OT OR THER PRC ON JOINT,315,"Shoulder, upper arm & forearm procedures except joint replacement",08,Diseases and Disorders of the Musculoskeletal System and Conn Tissue,1,Minor,Minor,Surgical,Medicaid,Medicaid,,,N,N,19453.36,6623.66
Long Island,Nassau,2908000,000511,NYU Winthrop Hospital,30 to 49,115,M,White,Not Span/Hispanic,7,Emergency,Home or Self Care,2017,229,Fracture of upper limb,144,"TRTMNT,FACE FRACT/DISLC",315,"Shoulder, upper arm & forearm procedures except joint replacement",08,Diseases and Disorders of the Musculoskeletal System and Conn Tissue,4,Extreme,Major,Surgical,Private Health Insurance,,,,N,Y,259623.37,50524.57
Long Island,Nassau,2908000,000511,NYU Winthrop Hospital,0 to 17,114,M,White,Not Span/Hispanic,3,Emergency,Home or Self Care,2017,229,Fracture of upper limb,145,"TRTMNT,FRAC RADIUS/ULNA",315,"Shoulder, upper arm & forearm procedures except joint replacement",08,Diseases and Disorders of the Musculoskeletal System and Conn Tissue,2,Moderate,Minor,Surgical,Blue Cross/Blue Shield,,,,N,Y,49361.09,14528.63
Long Island,Nassau,2908000,000511,NYU Winthrop Hospital,0 to 17,115,F,White,Spanish/Hispanic,2,Emergency,Home or Self Care,2017,229,Fracture of upper limb,148,OT FRACTURE/DISLOC PRC,315,"Shoulder, upper arm & forearm procedures except joint replacement",08,Diseases and Disorders of the Musculoskeletal System and Conn Tissue,1,Minor,Minor,Surgical,Medicaid,Medicaid,,,N,Y,30975.31,9210.05
Long Island,Nassau,2908000,000511,NYU Winthrop Hospital,0 to 17,115,F,White,Not Span/Hispanic,1,Elective,Home or Self Care,2017,229,Fracture of upper limb,145,"TRTMNT,FRAC RADIUS/ULNA",315,"Shoulder, upper arm & forearm procedures except joint replacement",08,Diseases and Disorders of the Musculoskeletal System and Conn Tissue,1,Minor,Minor,Surgical,Blue Cross/Blue Shield,,,,N,N,20963.01,7533.98
Long Island,Nassau,2908000,000511,NYU Winthrop Hospital,0 to 17,115,M,White,Not Span/Hispanic,1,Emergency,Home or Self Care,2017,229,Fracture of upper limb,148,OT FRACTURE/DISLOC PRC,315,"Shoulder, upper arm & forearm procedures except joint replacement",08,Diseases and Disorders of the Musculoskeletal System and Conn Tissue,1,Minor,Minor,Surgical,Private Health Insurance,,,,N,Y,31825.97,8125.41
Long Island,Nassau,2908000,000511,NYU Winthrop Hospital,70 or Older,117,F,White,Not Span/Hispanic,3,Elective,Skilled Nursing Home,2017,203,Osteoarthritis,154,ARTHROPLASTY-NOT HIP/KN,315,"Shoulder, upper arm & forearm procedures except joint replacement",08,Diseases and Disorders of the Musculoskeletal System and Conn Tissue,2,Moderate,Minor,Surgical,Medicare,Medicare,Private Health Insurance,,N,N,247748.75,70130.26
Long Island,Nassau,2908000,000511,NYU Winthrop Hospital,70 or Older,118,F,White,Not Span/Hispanic,3,Elective,Skilled Nursing Home,2017,229,Fracture of upper limb,154,ARTHROPLASTY-NOT HIP/KN,315,"Shoulder, upper arm & forearm procedures except joint replacement",08,Diseases and Disorders of the Musculoskeletal System and Conn Tissue,2,Moderate,Minor,Surgical,Medicare,Medicare,Blue Cross/Blue Shield,,N,N,199012.10,53272.93
Long Island,Nassau,2908000,000511,NYU Winthrop Hospital,50 to 69,117,M,White,Not Span/Hispanic,3,Emergency,Inpatient Rehabilitation Facility,2017,229,Fracture of upper limb,145,"TRTMNT,FRAC RADIUS/ULNA",315,"Shoulder, upper arm & forearm procedures except joint replacement",08,Diseases and Disorders of the Musculoskeletal System and Conn Tissue,2,Moderate,Minor,Surgical,Blue Cross/Blue Shield,,,,N,Y,131998.01,38128.27
Long Island,Nassau,2908000,000511,NYU Winthrop Hospital,70 or Older,114,F,White,Not Span/Hispanic,2,Elective,Home w/ Home Health Services,2017,225,Joint disorders and dislocations; trauma-related,154,ARTHROPLASTY-NOT HIP/KN,315,"Shoulder, upper arm & forearm procedures except joint replacement",08,Diseases and Disorders of the Musculoskeletal System and Conn Tissue,2,Moderate,Minor,Surgical,Medicare,Medicare,,,N,N,192426.99,55190.12
Long Island,Nassau,2908000,000511,NYU Winthrop Hospital,0 to 17,110,F,White,Spanish/Hispanic,2,Emergency,Home or Self Care,2017,229,Fracture of upper limb,148,OT FRACTURE/DISLOC PRC,315,"Shoulder, upper arm & forearm procedures except joint replacement",08,Diseases and Disorders of the Musculoskeletal System and Conn Tissue,1,Minor,Minor,Surgical,Medicaid,Medicaid,,,N,Y,55984.16,16738.87
Long Island,Nassau,2908000,000511,NYU Winthrop Hospital,0 to 17,114,M,White,Not Span/Hispanic,1,Emergency,Home or Self Care,2017,229,Fracture of upper limb,148,OT FRACTURE/DISLOC PRC,315,"Shoulder, upper arm & forearm procedures except joint replacement",08,Diseases and Disorders of the Musculoskeletal System and Conn Tissue,1,Minor,Minor,Surgical,Blue Cross/Blue Shield,,,,N,Y,28037.78,8738.89
Long Island,Nassau,2908000,000511,NYU Winthrop Hospital,0 to 17,117,F,White,Not Span/Hispanic,1,Emergency,Home or Self Care,2017,229,Fracture of upper limb,148,OT FRACTURE/DISLOC PRC,315,"Shoulder, upper arm & forearm procedures except joint replacement",08,Diseases and Disorders of the Musculoskeletal System and Conn Tissue,1,Minor,Minor,Surgical,Private Health Insurance,,,,N,Y,41445.51,11219.33
Long Island,Nassau,2908000,000511,NYU Winthrop Hospital,0 to 17,114,F,White,Not Span/Hispanic,7,Emergency,Home w/ Home Health Services,2017,229,Fracture of upper limb,145,"TRTMNT,FRAC RADIUS/ULNA",315,"Shoulder, upper arm & forearm procedures except joint replacement",08,Diseases and Disorders of the Musculoskeletal System and Conn Tissue,1,Minor,Minor,Surgical,Private Health Insurance,,,,N,Y,157284.43,47191.05
Long Island,Nassau,2908000,000511,NYU Winthrop Hospital,0 to 17,110,M,Black/African American,Not Span/Hispanic,1,Emergency,Home or Self Care,2017,229,Fracture of upper limb,148,OT FRACTURE/DISLOC PRC,315,"Shoulder, upper arm & forearm procedures except joint replacement",08,Diseases and Disorders of the Musculoskeletal System and Conn Tissue,1,Minor,Minor,Surgical,Medicaid,,,,N,Y,35858.64,10933.16
Long Island,Nassau,2908000,000511,NYU Winthrop Hospital,0 to 17,115,M,White,Spanish/Hispanic,2,Emergency,Home or Self Care,2017,229,Fracture of upper limb,148,OT FRACTURE/DISLOC PRC,315,"Shoulder, upper arm & forearm procedures except joint replacement",08,Diseases and Disorders of the Musculoskeletal System and Conn Tissue,1,Minor,Minor,Surgical,Private Health Insurance,,,,N,Y,47817.74,13496.47
Long Island,Nassau,2908000,000511,NYU Winthrop Hospital,70 or Older,115,F,White,Not Span/Hispanic,5,Elective,Home w/ Home Health Services,2017,229,Fracture of upper limb,148,OT FRACTURE/DISLOC PRC,315,"Shoulder, upper arm & forearm procedures except joint replacement",08,Diseases and Disorders of the Musculoskeletal System and Conn Tissue,3,Major,Major,Surgical,Medicare,Medicare,,,N,N,288916.97,80957.31
Long Island,Nassau,2908000,000511,NYU Winthrop Hospital,50 to 69,117,F,White,Not Span/Hispanic,2,Elective,Home w/ Home Health Services,2017,229,Fracture of upper limb,154,ARTHROPLASTY-NOT HIP/KN,315,"Shoulder, upper arm & forearm procedures except joint replacement",08,Diseases and Disorders of the Musculoskeletal System and Conn Tissue,2,Moderate,Minor,Surgical,Blue Cross/Blue Shield,,,,N,N,247787.56,68996.03
Long Island,Nassau,2908000,000511,NYU Winthrop Hospital,0 to 17,110,F,White,Not Span/Hispanic,1,Urgent,Home or Self Care,2017,229,Fracture of upper limb,145,"TRTMNT,FRAC RADIUS/ULNA",315,"Shoulder, upper arm & forearm procedures except joint replacement",08,Diseases and Disorders of the Musculoskeletal System and Conn Tissue,2,Moderate,Minor,Surgical,Medicaid,Medicaid,,,N,Y,51618.48,16183.37
Long Island,Nassau,2908000,000511,NYU Winthrop Hospital,70 or Older,114,M,White,Not Span/Hispanic,8,Emergency,Skilled Nursing Home,2017,229,Fracture of upper limb,145,"TRTMNT,FRAC RADIUS/ULNA",315,"Shoulder, upper arm & forearm procedures except joint replacement",08,Diseases and Disorders of the Musculoskeletal System and Conn Tissue,3,Major,Moderate,Surgical,Medicare,Medicare,Private Health Insurance,,N,Y,279585.41,68280.50
Long Island,Nassau,2908000,000511,NYU Winthrop Hospital,0 to 17,115,F,Other Race,Spanish/Hispanic,2,Emergency,Home or Self Care,2017,229,Fracture of upper limb,148,OT FRACTURE/DISLOC PRC,315,"Shoulder, upper arm & forearm procedures except joint replacement",08,Diseases and Disorders of the Musculoskeletal System and Conn Tissue,2,Moderate,Minor,Surgical,Medicaid,Medicaid,,,N,Y,47653.82,14686.66
Long Island,Nassau,2908000,000511,NYU Winthrop Hospital,0 to 17,115,F,White,Not Span/Hispanic,1,Emergency,Home or Self Care,2017,229,Fracture of upper limb,148,OT FRACTURE/DISLOC PRC,315,"Shoulder, upper arm & forearm procedures except joint replacement",08,Diseases and Disorders of the Musculoskeletal System and Conn Tissue,1,Minor,Minor,Surgical,Medicaid,,,,N,Y,46992.93,14746.31
Long Island,Nassau,2908000,000511,NYU Winthrop Hospital,18 to 29,115,M,White,Spanish/Hispanic,5,Emergency,Home or Self Care,2017,229,Fracture of upper limb,145,"TRTMNT,FRAC RADIUS/ULNA",315,"Shoulder, upper arm & forearm procedures except joint replacement",08,Diseases and Disorders of the Musculoskeletal System and Conn Tissue,1,Minor,Minor,Surgical,Medicaid,,,,N,Y,145268.38,41019.83
Long Island,Nassau,2908000,000511,NYU Winthrop Hospital,0 to 17,110,F,White,Not Span/Hispanic,2,Emergency,Home or Self Care,2017,229,Fracture of upper limb,148,OT FRACTURE/DISLOC PRC,315,"Shoulder, upper arm & forearm procedures except joint replacement",08,Diseases and Disorders of the Musculoskeletal System and Conn Tissue,1,Minor,Minor,Surgical,Blue Cross/Blue Shield,,,,N,Y,41711.28,12502.23
Long Island,Nassau,2908000,000511,NYU Winthrop Hospital,0 to 17,115,F,White,Not Span/Hispanic,2,Emergency,Home or Self Care,2017,229,Fracture of upper limb,148,OT FRACTURE/DISLOC PRC,315,"Shoulder, upper arm & forearm procedures except joint replacement",08,Diseases and Disorders of the Musculoskeletal System and Conn Tissue,2,Moderate,Minor,Surgical,Private Health Insurance,,,,N,Y,67049.68,20673.13
Long Island,Nassau,2908000,000511,NYU Winthrop Hospital,0 to 17,117,F,White,Not Span/Hispanic,1,Emergency,Home or Self Care,2017,229,Fracture of upper limb,145,"TRTMNT,FRAC RADIUS/ULNA",315,"Shoulder, upper arm & forearm procedures except joint replacement",08,Diseases and Disorders of the Musculoskeletal System and Conn Tissue,1,Minor,Minor,Surgical,Private Health Insurance,,,,N,Y,57224.99,15664.85
Long Island,Nassau,2908000,000511,NYU Winthrop Hospital,0 to 17,114,F,Other Race,Not Span/Hispanic,1,Emergency,Home or Self Care,2017,229,Fracture of upper limb,148,OT FRACTURE/DISLOC PRC,315,"Shoulder, upper arm & forearm procedures except joint replacement",08,Diseases and Disorders of the Musculoskeletal System and Conn Tissue,1,Minor,Minor,Surgical,Blue Cross/Blue Shield,,,,N,Y,48274.68,15397.28
Long Island,Nassau,2908000,000511,NYU Winthrop Hospital,50 to 69,115,M,Black/African American,Not Span/Hispanic,21,Emergency,Home w/ Home Health Services,2017,207,Pathological fracture,159,OT DX PRCS ON MUSC/SKEL,315,"Shoulder, upper arm & forearm procedures except joint replacement",08,Diseases and Disorders of the Musculoskeletal System and Conn Tissue,3,Major,Major,Surgical,Medicaid,,,,N,Y,466637.67,118150.86
Long Island,Nassau,2908000,000511,NYU Winthrop Hospital,50 to 69,110,M,White,Not Span/Hispanic,6,Emergency,Home or Self Care,2017,211,Other connective tissue disease,164,OT OR THER PRC MUSC/SKL,315,"Shoulder, upper arm & forearm procedures except joint replacement",08,Diseases and Disorders of the Musculoskeletal System and Conn Tissue,1,Minor,Minor,Surgical,Private Health Insurance,,,,N,Y,72721.23,19409.36
Long Island,Nassau,2908000,000511,NYU Winthrop Hospital,0 to 17,117,M,White,Not Span/Hispanic,2,Emergency,Home or Self Care,2017,229,Fracture of upper limb,145,"TRTMNT,FRAC RADIUS/ULNA",315,"Shoulder, upper arm & forearm procedures except joint replacement",08,Diseases and Disorders of the Musculoskeletal System and Conn Tissue,2,Moderate,Minor,Surgical,Blue Cross/Blue Shield,,,,N,Y,48619.96,14817.37
Long Island,Nassau,2908000,000511,NYU Winthrop Hospital,70 or Older,115,F,White,Not Span/Hispanic,2,Emergency,Home w/ Home Health Services,2017,229,Fracture of upper limb,145,"TRTMNT,FRAC RADIUS/ULNA",315,"Shoulder, upper arm & forearm procedures except joint replacement",08,Diseases and Disorders of the Musculoskeletal System and Conn Tissue,2,Moderate,Moderate,Surgical,Medicare,Medicare,,,N,Y,101033.70,29275.58
Long Island,Nassau,2908000,000511,NYU Winthrop Hospital,0 to 17,115,F,Other Race,Not Span/Hispanic,2,Emergency,Home or Self Care,2017,229,Fracture of upper limb,148,OT FRACTURE/DISLOC PRC,315,"Shoulder, upper arm & forearm procedures except joint replacement",08,Diseases and Disorders of the Musculoskeletal System and Conn Tissue,2,Moderate,Minor,Surgical,Medicaid,,,,N,Y,48483.42,13984.78
Long Island,Nassau,2908000,000511,NYU Winthrop Hospital,0 to 17,115,F,White,Not Span/Hispanic,1,Emergency,Home or Self Care,2017,229,Fracture of upper limb,148,OT FRACTURE/DISLOC PRC,315,"Shoulder, upper arm & forearm procedures except joint replacement",08,Diseases and Disorders of the Musculoskeletal System and Conn Tissue,1,Minor,Minor,Surgical,Blue Cross/Blue Shield,,,,N,Y,37177.28,11549.01
Long Island,Nassau,2908000,000511,NYU Winthrop Hospital,50 to 69,115,F,White,Not Span/Hispanic,3,Emergency,Home or Self Care,2017,229,Fracture of upper limb,145,"TRTMNT,FRAC RADIUS/ULNA",315,"Shoulder, upper arm & forearm procedures except joint replacement",08,Diseases and Disorders of the Musculoskeletal System and Conn Tissue,2,Moderate,Minor,Surgical,Medicaid,,,,N,Y,97749.64,27451.36
Long Island,Nassau,2908000,000511,NYU Winthrop Hospital,30 to 49,115,M,White,Not Span/Hispanic,3,Emergency,Home or Self Care,2017,229,Fracture of upper limb,145,"TRTMNT,FRAC RADIUS/ULNA",315,"Shoulder, upper arm & forearm procedures except joint replacement",08,Diseases and Disorders of the Musculoskeletal System and Conn Tissue,2,Moderate,Minor,Surgical,Private Health Insurance,,,,N,Y,182443.80,41961.22
Long Island,Nassau,2908000,000511,NYU Winthrop Hospital,0 to 17,110,F,Other Race,Not Span/Hispanic,2,Emergency,Home or Self Care,2017,229,Fracture of upper limb,148,OT FRACTURE/DISLOC PRC,315,"Shoulder, upper arm & forearm procedures except joint replacement",08,Diseases and Disorders of the Musculoskeletal System and Conn Tissue,1,Minor,Minor,Surgical,Medicaid,Medicaid,,,N,Y,46208.42,12951.44
Long Island,Nassau,2908000,000511,NYU Winthrop Hospital,0 to 17,117,F,White,Not Span/Hispanic,1,Emergency,Home or Self Care,2017,229,Fracture of upper limb,148,OT FRACTURE/DISLOC PRC,315,"Shoulder, upper arm & forearm procedures except joint replacement",08,Diseases and Disorders of the Musculoskeletal System and Conn Tissue,1,Minor,Minor,Surgical,Blue Cross/Blue Shield,,,,N,Y,42098.06,11688.18