Hospital Service Area,Hospital County,Operating Certificate Number,Permanent Facility Id,Facility Name,Age Group,Zip Code - 3 digits,Gender,Race,Ethnicity,Length of Stay,Type of Admission,Patient Disposition,Discharge Year,CCS Diagnosis Code,CCS Diagnosis Description,CCS Procedure Code,CCS Procedure Description,APR DRG Code,APR DRG Description,APR MDC Code,APR MDC Description,APR Severity of Illness Code,APR Severity of Illness Description,APR Risk of Mortality,APR Medical Surgical Description,Payment Typology 1,Payment Typology 2,Payment Typology 3,Birth Weight,Abortion Edit Indicator,Emergency Department Indicator,Total Charges,Total Costs
New York City,Manhattan,7002053,001463,NYU Langone Hospitals,0 to 17,112,F,Other Race,Not Span/Hispanic,1,Emergency,Home or Self Care,2020,INJ004,"FRACTURE OF THE UPPER LIMB, INITIAL ENCOUNTER",MST009,FIXATION OF UPPER EXTREMITY BONES,315,"SHOULDER, UPPER ARM & FOREARM PROCEDURES EXCEPT JOINT REPLACEMENT",08,DISEASES AND DISORDERS OF THE MUSCULOSKELETAL SYSTEM AND CONNECTIVE TISSUE,1,Minor,Minor,Surgical,Medicaid,,,,,Y,39092.45,7762.27
New York City,Manhattan,7002053,001463,NYU Langone Hospitals,0 to 17,112,M,Other Race,Unknown,1,Emergency,Home or Self Care,2020,INJ004,"FRACTURE OF THE UPPER LIMB, INITIAL ENCOUNTER",MST009,FIXATION OF UPPER EXTREMITY BONES,315,"SHOULDER, UPPER ARM & FOREARM PROCEDURES EXCEPT JOINT REPLACEMENT",08,DISEASES AND DISORDERS OF THE MUSCULOSKELETAL SYSTEM AND CONNECTIVE TISSUE,1,Minor,Minor,Surgical,Medicaid,,,,,Y,42621.54,8062.97
New York City,Manhattan,7002053,001463,NYU Langone Hospitals,0 to 17,112,F,Other Race,Not Span/Hispanic,2,Elective,Home or Self Care,2020,INJ004,"FRACTURE OF THE UPPER LIMB, INITIAL ENCOUNTER",MST009,FIXATION OF UPPER EXTREMITY BONES,315,"SHOULDER, UPPER ARM & FOREARM PROCEDURES EXCEPT JOINT REPLACEMENT",08,DISEASES AND DISORDERS OF THE MUSCULOSKELETAL SYSTEM AND CONNECTIVE TISSUE,1,Minor,Minor,Surgical,Medicaid,,,,,N,62638.01,13086.89
New York City,Manhattan,7002053,001463,NYU Langone Hospitals,0 to 17,112,F,White,Not Span/Hispanic,2,Elective,Home or Self Care,2020,INJ004,"FRACTURE OF THE UPPER LIMB, INITIAL ENCOUNTER",MST009,FIXATION OF UPPER EXTREMITY BONES,315,"SHOULDER, UPPER ARM & FOREARM PROCEDURES EXCEPT JOINT REPLACEMENT",08,DISEASES AND DISORDERS OF THE MUSCULOSKELETAL SYSTEM AND CONNECTIVE TISSUE,1,Minor,Minor,Surgical,Medicaid,,,,,N,41988.4,10373.85
New York City,Manhattan,7002053,001463,NYU Langone Hospitals,18 to 29,112,M,Other Race,Not Span/Hispanic,7,Emergency,Skilled Nursing Home,2020,MUS001,INFECTIVE ARTHRITIS,MST004,INCISION AND DRAINAGE OF MUSCULOSKELETAL TISSUE AND JOINTS,315,"SHOULDER, UPPER ARM & FOREARM PROCEDURES EXCEPT JOINT REPLACEMENT",08,DISEASES AND DISORDERS OF THE MUSCULOSKELETAL SYSTEM AND CONNECTIVE TISSUE,4,Extreme,Moderate,Surgical,Medicaid,,,,,N,120188.44,31231.57
New York City,Manhattan,7002053,001463,NYU Langone Hospitals,50 to 69,101,M,White,Not Span/Hispanic,2,Emergency,Home or Self Care,2020,MUS027,MUSCULOSKELETAL ABSCESS,MST004,INCISION AND DRAINAGE OF MUSCULOSKELETAL TISSUE AND JOINTS,315,"SHOULDER, UPPER ARM & FOREARM PROCEDURES EXCEPT JOINT REPLACEMENT",08,DISEASES AND DISORDERS OF THE MUSCULOSKELETAL SYSTEM AND CONNECTIVE TISSUE,2,Moderate,Major,Surgical,Medicare,Medicare,,,,Y,61968.82,15881.7
New York City,Manhattan,7002053,001463,NYU Langone Hospitals,0 to 17,111,M,White,Not Span/Hispanic,2,Elective,Home or Self Care,2020,MUS002,OSTEOMYELITIS,MST001,ARTHROCENTESIS,315,"SHOULDER, UPPER ARM & FOREARM PROCEDURES EXCEPT JOINT REPLACEMENT",08,DISEASES AND DISORDERS OF THE MUSCULOSKELETAL SYSTEM AND CONNECTIVE TISSUE,2,Moderate,Minor,Surgical,Blue Cross/Blue Shield,,,,,Y,54808.22,9127.45
New York City,Manhattan,7002053,001463,NYU Langone Hospitals,0 to 17,112,F,White,Not Span/Hispanic,1,Emergency,Home or Self Care,2020,INJ004,"FRACTURE OF THE UPPER LIMB, INITIAL ENCOUNTER",MST009,FIXATION OF UPPER EXTREMITY BONES,315,"SHOULDER, UPPER ARM & FOREARM PROCEDURES EXCEPT JOINT REPLACEMENT",08,DISEASES AND DISORDERS OF THE MUSCULOSKELETAL SYSTEM AND CONNECTIVE TISSUE,2,Moderate,Minor,Surgical,Medicaid,,,,,Y,53166.23,9566.95
New York City,Manhattan,7002053,001463,NYU Langone Hospitals,0 to 17,113,M,White,Not Span/Hispanic,1,Emergency,Home or Self Care,2020,INJ004,"FRACTURE OF THE UPPER LIMB, INITIAL ENCOUNTER",MST009,FIXATION OF UPPER EXTREMITY BONES,315,"SHOULDER, UPPER ARM & FOREARM PROCEDURES EXCEPT JOINT REPLACEMENT",08,DISEASES AND DISORDERS OF THE MUSCULOSKELETAL SYSTEM AND CONNECTIVE TISSUE,1,Minor,Minor,Surgical,Blue Cross/Blue Shield,,,,,Y,49095.81,9131.63
New York City,Manhattan,7002053,001463,NYU Langone Hospitals,0 to 17,113,M,Other Race,Spanish/Hispanic,1,Emergency,Home or Self Care,2020,INJ004,"FRACTURE OF THE UPPER LIMB, INITIAL ENCOUNTER",MST009,FIXATION OF UPPER EXTREMITY BONES,315,"SHOULDER, UPPER ARM & FOREARM PROCEDURES EXCEPT JOINT REPLACEMENT",08,DISEASES AND DISORDERS OF THE MUSCULOSKELETAL SYSTEM AND CONNECTIVE TISSUE,2,Moderate,Minor,Surgical,Medicaid,,,,,Y,64293.31,11182.37
New York City,Manhattan,7002053,001463,NYU Langone Hospitals,0 to 17,100,M,Other Race,Spanish/Hispanic,1,Emergency,Home or Self Care,2020,INJ004,"FRACTURE OF THE UPPER LIMB, INITIAL ENCOUNTER",MST009,FIXATION OF UPPER EXTREMITY BONES,315,"SHOULDER, UPPER ARM & FOREARM PROCEDURES EXCEPT JOINT REPLACEMENT",08,DISEASES AND DISORDERS OF THE MUSCULOSKELETAL SYSTEM AND CONNECTIVE TISSUE,1,Minor,Minor,Surgical,Medicaid,,,,,Y,41702.43,7996.96
New York City,Manhattan,7002053,001463,NYU Langone Hospitals,0 to 17,100,F,Other Race,Not Span/Hispanic,1,Emergency,Home or Self Care,2020,INJ004,"FRACTURE OF THE UPPER LIMB, INITIAL ENCOUNTER",MST009,FIXATION OF UPPER EXTREMITY BONES,315,"SHOULDER, UPPER ARM & FOREARM PROCEDURES EXCEPT JOINT REPLACEMENT",08,DISEASES AND DISORDERS OF THE MUSCULOSKELETAL SYSTEM AND CONNECTIVE TISSUE,1,Minor,Minor,Surgical,Blue Cross/Blue Shield,,,,,Y,47657.06,9553.04
New York City,Manhattan,7002053,001463,NYU Langone Hospitals,70 or Older,100,F,Other Race,Not Span/Hispanic,19,Emergency,Skilled Nursing Home,2020,INJ004,"FRACTURE OF THE UPPER LIMB, INITIAL ENCOUNTER",MST009,FIXATION OF UPPER EXTREMITY BONES,315,"SHOULDER, UPPER ARM & FOREARM PROCEDURES EXCEPT JOINT REPLACEMENT",08,DISEASES AND DISORDERS OF THE MUSCULOSKELETAL SYSTEM AND CONNECTIVE TISSUE,3,Major,Major,Surgical,Private Health Insurance,Medicare,,,,Y,320442.01,101115.92
New York City,Manhattan,7002053,001463,NYU Langone Hospitals,0 to 17,100,F,White,Not Span/Hispanic,1,Elective,Home or Self Care,2020,INJ004,"FRACTURE OF THE UPPER LIMB, INITIAL ENCOUNTER",MST009,FIXATION OF UPPER EXTREMITY BONES,315,"SHOULDER, UPPER ARM & FOREARM PROCEDURES EXCEPT JOINT REPLACEMENT",08,DISEASES AND DISORDERS OF THE MUSCULOSKELETAL SYSTEM AND CONNECTIVE TISSUE,1,Minor,Minor,Surgical,Blue Cross/Blue Shield,,,,,N,42388.81,9172.32
New York City,Manhattan,7002053,001463,NYU Langone Hospitals,0 to 17,112,F,White,Not Span/Hispanic,1,Emergency,Home or Self Care,2020,INJ004,"FRACTURE OF THE UPPER LIMB, INITIAL ENCOUNTER",MST009,FIXATION OF UPPER EXTREMITY BONES,315,"SHOULDER, UPPER ARM & FOREARM PROCEDURES EXCEPT JOINT REPLACEMENT",08,DISEASES AND DISORDERS OF THE MUSCULOSKELETAL SYSTEM AND CONNECTIVE TISSUE,1,Minor,Minor,Surgical,Blue Cross/Blue Shield,,,,,Y,44845.65,9243.44
New York City,Manhattan,7002053,001463,NYU Langone Hospitals,0 to 17,112,F,White,Not Span/Hispanic,1,Emergency,Home or Self Care,2020,INJ004,"FRACTURE OF THE UPPER LIMB, INITIAL ENCOUNTER",MST009,FIXATION OF UPPER EXTREMITY BONES,315,"SHOULDER, UPPER ARM & FOREARM PROCEDURES EXCEPT JOINT REPLACEMENT",08,DISEASES AND DISORDERS OF THE MUSCULOSKELETAL SYSTEM AND CONNECTIVE TISSUE,1,Minor,Minor,Surgical,Private Health Insurance,,,,,Y,43172.03,9169.72
New York City,Manhattan,7002053,001463,NYU Langone Hospitals,0 to 17,100,M,Other Race,Not Span/Hispanic,2,Emergency,Home or Self Care,2020,INJ004,"FRACTURE OF THE UPPER LIMB, INITIAL ENCOUNTER",MST009,FIXATION OF UPPER EXTREMITY BONES,315,"SHOULDER, UPPER ARM & FOREARM PROCEDURES EXCEPT JOINT REPLACEMENT",08,DISEASES AND DISORDERS OF THE MUSCULOSKELETAL SYSTEM AND CONNECTIVE TISSUE,2,Moderate,Minor,Surgical,Blue Cross/Blue Shield,,,,,Y,72092.21,16667.4
New York City,Manhattan,7002053,001463,NYU Langone Hospitals,0 to 17,109,F,Other Race,Not Span/Hispanic,1,Emergency,Home or Self Care,2020,INJ004,"FRACTURE OF THE UPPER LIMB, INITIAL ENCOUNTER",MST009,FIXATION OF UPPER EXTREMITY BONES,315,"SHOULDER, UPPER ARM & FOREARM PROCEDURES EXCEPT JOINT REPLACEMENT",08,DISEASES AND DISORDERS OF THE MUSCULOSKELETAL SYSTEM AND CONNECTIVE TISSUE,1,Minor,Minor,Surgical,Blue Cross/Blue Shield,,,,,Y,61476.98,11816.91
New York City,Manhattan,7002053,001463,NYU Langone Hospitals,0 to 17,112,M,White,Not Span/Hispanic,1,Emergency,Home or Self Care,2020,INJ004,"FRACTURE OF THE UPPER LIMB, INITIAL ENCOUNTER",MST009,FIXATION OF UPPER EXTREMITY BONES,315,"SHOULDER, UPPER ARM & FOREARM PROCEDURES EXCEPT JOINT REPLACEMENT",08,DISEASES AND DISORDERS OF THE MUSCULOSKELETAL SYSTEM AND CONNECTIVE TISSUE,1,Minor,Minor,Surgical,Medicaid,,,,,Y,40283.22,7295.91
New York City,Manhattan,7002053,001463,NYU Langone Hospitals,30 to 49,104,M,Other Race,Not Span/Hispanic,7,Elective,Home or Self Care,2020,MUS006,OSTEOARTHRITIS,MST014,JOINT FUSION (EXCLUDING SPINE),315,"SHOULDER, UPPER ARM & FOREARM PROCEDURES EXCEPT JOINT REPLACEMENT",08,DISEASES AND DISORDERS OF THE MUSCULOSKELETAL SYSTEM AND CONNECTIVE TISSUE,2,Moderate,Minor,Surgical,Miscellaneous/Other,,,,,N,247577.76,56837.43
New York City,Manhattan,7002053,001463,NYU Langone Hospitals,0 to 17,112,M,White,Unknown,2,Emergency,Home or Self Care,2020,INJ004,"FRACTURE OF THE UPPER LIMB, INITIAL ENCOUNTER",MST009,FIXATION OF UPPER EXTREMITY BONES,315,"SHOULDER, UPPER ARM & FOREARM PROCEDURES EXCEPT JOINT REPLACEMENT",08,DISEASES AND DISORDERS OF THE MUSCULOSKELETAL SYSTEM AND CONNECTIVE TISSUE,1,Minor,Minor,Surgical,Medicaid,,,,,N,53721.15,11274.62
New York City,Manhattan,7002053,001463,NYU Langone Hospitals,0 to 17,100,M,Black/African American,Not Span/Hispanic,1,Emergency,Home or Self Care,2020,INJ004,"FRACTURE OF THE UPPER LIMB, INITIAL ENCOUNTER",MST009,FIXATION OF UPPER EXTREMITY BONES,315,"SHOULDER, UPPER ARM & FOREARM PROCEDURES EXCEPT JOINT REPLACEMENT",08,DISEASES AND DISORDERS OF THE MUSCULOSKELETAL SYSTEM AND CONNECTIVE TISSUE,1,Minor,Minor,Surgical,Medicaid,,,,,Y,41528.29,7454.84
New York City,Manhattan,7002053,001463,NYU Langone Hospitals,70 or Older,115,F,White,Not Span/Hispanic,2,Elective,Home w/ Home Health Services,2020,NEO070,SECONDARY MALIGNANCIES,MST018,BONE EXCISION,315,"SHOULDER, UPPER ARM & FOREARM PROCEDURES EXCEPT JOINT REPLACEMENT",08,DISEASES AND DISORDERS OF THE MUSCULOSKELETAL SYSTEM AND CONNECTIVE TISSUE,3,Major,Moderate,Surgical,Medicare,Blue Cross/Blue Shield,,,,N,280306.69,45118.78
New York City,Manhattan,7002053,001463,NYU Langone Hospitals,0 to 17,112,M,White,Not Span/Hispanic,1,Emergency,Home or Self Care,2020,INJ004,"FRACTURE OF THE UPPER LIMB, INITIAL ENCOUNTER",MST009,FIXATION OF UPPER EXTREMITY BONES,315,"SHOULDER, UPPER ARM & FOREARM PROCEDURES EXCEPT JOINT REPLACEMENT",08,DISEASES AND DISORDERS OF THE MUSCULOSKELETAL SYSTEM AND CONNECTIVE TISSUE,1,Minor,Minor,Surgical,Private Health Insurance,,,,,N,36514.5,8255.91
