Hospital Service Area,Hospital County,Operating Certificate Number,Permanent Facility Id,Facility Name,Age Group,Zip Code - 3 digits,Gender,Race,Ethnicity,Length of Stay,Type of Admission,Patient Disposition,Discharge Year,CCS Diagnosis Code,CCS Diagnosis Description,CCS Procedure Code,CCS Procedure Description,APR DRG Code,APR DRG Description,APR MDC Code,APR MDC Description,APR Severity of Illness Code,APR Severity of Illness Description,APR Risk of Mortality,APR Medical Surgical Description,Payment Typology 1,Payment Typology 2,Payment Typology 3,Birth Weight,Abortion Edit Indicator,Emergency Department Indicator,Total Charges,Total Costs
New York City,Bronx,7000006,001169,Montefiore Medical Center - Henry & Lucy Moses Div,50 to 69,104,F,Black/African American,Not Span/Hispanic,4,Emergency,Left Against Medical Advice,2020,MUS009,TENDON AND SYNOVIAL DISORDERS,MST005,INCISION AND DRAINAGE OF SUBCUTANEOUS TISSUE AND FASCIA,316,HAND & WRIST PROCEDURES,08,DISEASES AND DISORDERS OF THE MUSCULOSKELETAL SYSTEM AND CONNECTIVE TISSUE,3,Major,Moderate,Surgical,Medicaid,,,,,Y,89467.22,15547.48
New York City,Manhattan,7002012,001447,Hospital for Special Surgery,50 to 69,OOS,M,White,Not Span/Hispanic,1,Elective,Home or Self Care,2020,MUS006,OSTEOARTHRITIS,MST014,JOINT FUSION (EXCLUDING SPINE),316,HAND & WRIST PROCEDURES,08,DISEASES AND DISORDERS OF THE MUSCULOSKELETAL SYSTEM AND CONNECTIVE TISSUE,1,Minor,Minor,Surgical,Blue Cross/Blue Shield,,,,,N,47227,17108.67
New York City,Manhattan,7002053,001463,NYU Langone Hospitals,50 to 69,OOS,M,White,Not Span/Hispanic,1,Emergency,Home or Self Care,2020,INJ004,"FRACTURE OF THE UPPER LIMB, INITIAL ENCOUNTER",MST009,FIXATION OF UPPER EXTREMITY BONES,316,HAND & WRIST PROCEDURES,08,DISEASES AND DISORDERS OF THE MUSCULOSKELETAL SYSTEM AND CONNECTIVE TISSUE,1,Minor,Minor,Surgical,Blue Cross/Blue Shield,,,,,Y,42046.03,7887.66
New York City,Manhattan,7002054,001458,New York-Presbyterian Hospital - New York Weill Cornell Center,30 to 49,114,F,Other Race,Spanish/Hispanic,4,Emergency,Home w/ Home Health Services,2020,MUS009,TENDON AND SYNOVIAL DISORDERS,MST019,"MUSCLE, TENDON, BURSA, AND LIGAMENT EXCISION",316,HAND & WRIST PROCEDURES,08,DISEASES AND DISORDERS OF THE MUSCULOSKELETAL SYSTEM AND CONNECTIVE TISSUE,3,Major,Moderate,Surgical,Medicare,Medicaid,Self-Pay,,,Y,74086.31,18810.47
New York City,Kings,7001021,001306,New York - Presbyterian Brooklyn Methodist Hospital,30 to 49,112,M,Black/African American,Not Span/Hispanic,2,Emergency,Home or Self Care,2020,INJ007,"DISLOCATIONS, INITIAL ENCOUNTER",MST030,"MUSCULOSKELETAL PROCEDURES, NEC",316,HAND & WRIST PROCEDURES,08,DISEASES AND DISORDERS OF THE MUSCULOSKELETAL SYSTEM AND CONNECTIVE TISSUE,1,Minor,Minor,Surgical,"Managed Care, Unspecified",Medicaid,Self-Pay,,,Y,42730.48,16477.17
New York City,Kings,7001021,001306,New York - Presbyterian Brooklyn Methodist Hospital,30 to 49,112,M,White,Not Span/Hispanic,1,Emergency,Home or Self Care,2020,INJ004,"FRACTURE OF THE UPPER LIMB, INITIAL ENCOUNTER",MST009,FIXATION OF UPPER EXTREMITY BONES,316,HAND & WRIST PROCEDURES,08,DISEASES AND DISORDERS OF THE MUSCULOSKELETAL SYSTEM AND CONNECTIVE TISSUE,1,Minor,Minor,Surgical,Blue Cross/Blue Shield,Self-Pay,,,,Y,23104.97,11140.17
New York City,Kings,7001021,001306,New York - Presbyterian Brooklyn Methodist Hospital,18 to 29,,F,Black/African American,Not Span/Hispanic,1,Emergency,Home or Self Care,2020,INJ004,"FRACTURE OF THE UPPER LIMB, INITIAL ENCOUNTER",MST009,FIXATION OF UPPER EXTREMITY BONES,316,HAND & WRIST PROCEDURES,08,DISEASES AND DISORDERS OF THE MUSCULOSKELETAL SYSTEM AND CONNECTIVE TISSUE,1,Minor,Minor,Surgical,Private Health Insurance,,,,,Y,21480.44,10504.18
Long Island,Nassau,2950002,000528,Nassau University Medical Center,18 to 29,117,M,White,Not Span/Hispanic,1,Emergency,Home or Self Care,2020,INJ004,"FRACTURE OF THE UPPER LIMB, INITIAL ENCOUNTER",MST009,FIXATION OF UPPER EXTREMITY BONES,316,HAND & WRIST PROCEDURES,08,DISEASES AND DISORDERS OF THE MUSCULOSKELETAL SYSTEM AND CONNECTIVE TISSUE,1,Minor,Minor,Surgical,Blue Cross/Blue Shield,Self-Pay,,,,N,16655.26,10408.23
Western NY,Erie,1401005,000210,Erie County Medical Center,30 to 49,143,M,White,Not Span/Hispanic,62,Emergency,Skilled Nursing Home,2020,INJ037,"COMPLICATION OF OTHER SURGICAL OR MEDICAL CARE, INJURY, INITIAL ENCOUNTER",MST020,SUBCUTANEOUS TISSUE AND FASCIA EXCISION,316,HAND & WRIST PROCEDURES,08,DISEASES AND DISORDERS OF THE MUSCULOSKELETAL SYSTEM AND CONNECTIVE TISSUE,4,Extreme,Extreme,Surgical,Medicaid,Medicaid,,,,Y,143380.4,100653.74
Western NY,Erie,1401005,000210,Erie County Medical Center,50 to 69,142,M,White,Not Span/Hispanic,5,Emergency,Home or Self Care,2020,MUS002,OSTEOMYELITIS,MST026,FINGER AND OTHER UPPER EXTREMITY AMPUTATION,316,HAND & WRIST PROCEDURES,08,DISEASES AND DISORDERS OF THE MUSCULOSKELETAL SYSTEM AND CONNECTIVE TISSUE,2,Moderate,Minor,Surgical,Medicaid,Medicaid,,,,Y,18259.59,11745.45
Western NY,Erie,1401005,000210,Erie County Medical Center,70 or Older,142,F,White,Not Span/Hispanic,10,Emergency,Home or Self Care,2020,MUS009,TENDON AND SYNOVIAL DISORDERS,MST004,INCISION AND DRAINAGE OF MUSCULOSKELETAL TISSUE AND JOINTS,316,HAND & WRIST PROCEDURES,08,DISEASES AND DISORDERS OF THE MUSCULOSKELETAL SYSTEM AND CONNECTIVE TISSUE,3,Major,Major,Surgical,Medicare,,,,,Y,32175.39,18530.44
New York City,Manhattan,7002032,001466,Mount Sinai West,50 to 69,104,F,White,Not Span/Hispanic,1,Urgent,Home or Self Care,2020,MUS006,OSTEOARTHRITIS,MST008,ARTHROPLASTY OF OTHER JOINT (EXCLUDING KNEE AND HIP),316,HAND & WRIST PROCEDURES,08,DISEASES AND DISORDERS OF THE MUSCULOSKELETAL SYSTEM AND CONNECTIVE TISSUE,1,Minor,Minor,Surgical,Private Health Insurance,Self-Pay,,,,N,31151.6,7678.42
New York City,Manhattan,7002032,001466,Mount Sinai West,30 to 49,100,M,White,Not Span/Hispanic,2,Emergency,Home or Self Care,2020,INJ035,"COMPLICATION OF INTERNAL ORTHOPEDIC DEVICE OR IMPLANT, INITIAL ENCOUNTER",MST020,SUBCUTANEOUS TISSUE AND FASCIA EXCISION,316,HAND & WRIST PROCEDURES,08,DISEASES AND DISORDERS OF THE MUSCULOSKELETAL SYSTEM AND CONNECTIVE TISSUE,2,Moderate,Minor,Surgical,Miscellaneous/Other,Self-Pay,,,,Y,43340.96,10624.32
Hudson Valley,Orange,3529000,000704,St Anthony Community Hospital,50 to 69,OOS,M,White,Not Span/Hispanic,3,Emergency,Home or Self Care,2020,MUS001,INFECTIVE ARTHRITIS,MST004,INCISION AND DRAINAGE OF MUSCULOSKELETAL TISSUE AND JOINTS,316,HAND & WRIST PROCEDURES,08,DISEASES AND DISORDERS OF THE MUSCULOSKELETAL SYSTEM AND CONNECTIVE TISSUE,2,Moderate,Minor,Surgical,Blue Cross/Blue Shield,,,,,Y,82814.18,11368.06
Finger Lakes,Monroe,2701005,000413,Strong Memorial Hospital,50 to 69,146,M,White,Not Span/Hispanic,7,Emergency,Home w/ Home Health Services,2020,MUS009,TENDON AND SYNOVIAL DISORDERS,MST026,FINGER AND OTHER UPPER EXTREMITY AMPUTATION,316,HAND & WRIST PROCEDURES,08,DISEASES AND DISORDERS OF THE MUSCULOSKELETAL SYSTEM AND CONNECTIVE TISSUE,2,Moderate,Moderate,Surgical,Medicaid,,,,,Y,32572.77,14381.93
New York City,Bronx,7000001,001178,BronxCare Hospital Center,18 to 29,104,M,Other Race,Spanish/Hispanic,2,Emergency,Home or Self Care,2020,INJ004,"FRACTURE OF THE UPPER LIMB, INITIAL ENCOUNTER",MST009,FIXATION OF UPPER EXTREMITY BONES,316,HAND & WRIST PROCEDURES,08,DISEASES AND DISORDERS OF THE MUSCULOSKELETAL SYSTEM AND CONNECTIVE TISSUE,1,Minor,Minor,Surgical,Medicaid,,,,,Y,16065.18,24146.12
New York City,Bronx,7000001,001178,BronxCare Hospital Center,30 to 49,104,M,Other Race,Spanish/Hispanic,10,Emergency,Home or Self Care,2020,MUS009,TENDON AND SYNOVIAL DISORDERS,MST005,INCISION AND DRAINAGE OF SUBCUTANEOUS TISSUE AND FASCIA,316,HAND & WRIST PROCEDURES,08,DISEASES AND DISORDERS OF THE MUSCULOSKELETAL SYSTEM AND CONNECTIVE TISSUE,2,Moderate,Minor,Surgical,Medicaid,Medicaid,,,,Y,39965.57,57521.27
Finger Lakes,Monroe,2701005,000413,Strong Memorial Hospital,30 to 49,146,F,White,Not Span/Hispanic,4,Emergency,Home or Self Care,2020,MUS009,TENDON AND SYNOVIAL DISORDERS,MST004,INCISION AND DRAINAGE OF MUSCULOSKELETAL TISSUE AND JOINTS,316,HAND & WRIST PROCEDURES,08,DISEASES AND DISORDERS OF THE MUSCULOSKELETAL SYSTEM AND CONNECTIVE TISSUE,2,Moderate,Minor,Surgical,Medicaid,,,,,Y,18249.1,8858.26
New York City,Kings,7002053,001304,NYU Langone Hospital-Brooklyn,50 to 69,112,M,Other Race,Unknown,1,Emergency,Home or Self Care,2020,INJ014,"AMPUTATION OF A LIMB, INITIAL ENCOUNTER",MST026,FINGER AND OTHER UPPER EXTREMITY AMPUTATION,316,HAND & WRIST PROCEDURES,08,DISEASES AND DISORDERS OF THE MUSCULOSKELETAL SYSTEM AND CONNECTIVE TISSUE,1,Minor,Minor,Surgical,Medicare,Medicaid,,,,Y,42916.25,7659.2
New York City,Kings,7002053,001304,NYU Langone Hospital-Brooklyn,30 to 49,112,F,White,Not Span/Hispanic,8,Emergency,Home w/ Home Health Services,2020,MUS002,OSTEOMYELITIS,CAR024,VENOUS AND ARTERIAL CATHETER PLACEMENT,316,HAND & WRIST PROCEDURES,08,DISEASES AND DISORDERS OF THE MUSCULOSKELETAL SYSTEM AND CONNECTIVE TISSUE,2,Moderate,Minor,Surgical,Medicare,,,,,Y,94699.19,28173.4
New York City,Manhattan,7002054,001437,New York-Presbyterian/Lower Manhattan Hospital,30 to 49,,M,Black/African American,Not Span/Hispanic,10,Emergency,Home w/ Home Health Services,2020,INJ018,"CRUSHING INJURY, INITIAL ENCOUNTER",MST022,"TENDON, MUSCLE, BURSA, AND LIGAMENT REPAIR (EXCLUDING PERINEAL)",316,HAND & WRIST PROCEDURES,08,DISEASES AND DISORDERS OF THE MUSCULOSKELETAL SYSTEM AND CONNECTIVE TISSUE,2,Moderate,Minor,Surgical,Miscellaneous/Other,Self-Pay,,,,Y,124228.18,29046.73
New York City,Queens,7003010,001637,New York - Presbyterian/Queens,50 to 69,113,M,Other Race,Not Span/Hispanic,1,Emergency,Home or Self Care,2020,INJ004,"FRACTURE OF THE UPPER LIMB, INITIAL ENCOUNTER",MST009,FIXATION OF UPPER EXTREMITY BONES,316,HAND & WRIST PROCEDURES,08,DISEASES AND DISORDERS OF THE MUSCULOSKELETAL SYSTEM AND CONNECTIVE TISSUE,1,Minor,Minor,Surgical,"Managed Care, Unspecified",Medicaid,Self-Pay,,,Y,10998.77,2730.9
New York City,Manhattan,7002054,001458,New York-Presbyterian Hospital - New York Weill Cornell Center,50 to 69,100,M,White,Spanish/Hispanic,20,Emergency,Home or Self Care,2020,MUS001,INFECTIVE ARTHRITIS,MST004,INCISION AND DRAINAGE OF MUSCULOSKELETAL TISSUE AND JOINTS,316,HAND & WRIST PROCEDURES,08,DISEASES AND DISORDERS OF THE MUSCULOSKELETAL SYSTEM AND CONNECTIVE TISSUE,3,Major,Major,Surgical,"Managed Care, Unspecified",Medicaid,Self-Pay,,,Y,324944.45,75020.99
New York City,Manhattan,7002053,001446,NYU Langone Orthopedic Hospital,50 to 69,100,F,Other Race,Spanish/Hispanic,4,Emergency,Home w/ Home Health Services,2020,MUS002,OSTEOMYELITIS,MST026,FINGER AND OTHER UPPER EXTREMITY AMPUTATION,316,HAND & WRIST PROCEDURES,08,DISEASES AND DISORDERS OF THE MUSCULOSKELETAL SYSTEM AND CONNECTIVE TISSUE,2,Moderate,Minor,Surgical,Medicare,Medicaid,,,,Y,89941.06,19252.85
New York City,Manhattan,7002024,001456,Mount Sinai Hospital,50 to 69,104,M,Other Race,Unknown,2,Emergency,Home or Self Care,2020,INJ018,"CRUSHING INJURY, INITIAL ENCOUNTER",MST022,"TENDON, MUSCLE, BURSA, AND LIGAMENT REPAIR (EXCLUDING PERINEAL)",316,HAND & WRIST PROCEDURES,08,DISEASES AND DISORDERS OF THE MUSCULOSKELETAL SYSTEM AND CONNECTIVE TISSUE,1,Minor,Minor,Surgical,Medicare,Medicare,Self-Pay,,,Y,40478.68,10518.65
New York City,Kings,7001021,001306,New York - Presbyterian Brooklyn Methodist Hospital,30 to 49,112,M,White,Not Span/Hispanic,2,Emergency,Home or Self Care,2020,INJ004,"FRACTURE OF THE UPPER LIMB, INITIAL ENCOUNTER",MST009,FIXATION OF UPPER EXTREMITY BONES,316,HAND & WRIST PROCEDURES,08,DISEASES AND DISORDERS OF THE MUSCULOSKELETAL SYSTEM AND CONNECTIVE TISSUE,1,Minor,Minor,Surgical,Medicaid,Self-Pay,,,,Y,27397.63,11728.58
New York City,Kings,7002053,001304,NYU Langone Hospital-Brooklyn,30 to 49,112,F,Other Race,Spanish/Hispanic,1,Emergency,Home w/ Home Health Services,2020,INJ024,"SPRAINS AND STRAINS, INITIAL ENCOUNTER",MST004,INCISION AND DRAINAGE OF MUSCULOSKELETAL TISSUE AND JOINTS,316,HAND & WRIST PROCEDURES,08,DISEASES AND DISORDERS OF THE MUSCULOSKELETAL SYSTEM AND CONNECTIVE TISSUE,1,Minor,Minor,Surgical,Blue Cross/Blue Shield,,,,,Y,44560.98,7632.35
New York City,Manhattan,7002032,001466,Mount Sinai West,50 to 69,OOS,M,White,Not Span/Hispanic,1,Urgent,Home or Self Care,2020,INJ041,"FRACTURE OF THE UPPER LIMB, SUBSEQUENT ENCOUNTER",MST008,ARTHROPLASTY OF OTHER JOINT (EXCLUDING KNEE AND HIP),316,HAND & WRIST PROCEDURES,08,DISEASES AND DISORDERS OF THE MUSCULOSKELETAL SYSTEM AND CONNECTIVE TISSUE,1,Minor,Minor,Surgical,Private Health Insurance,Self-Pay,,,,N,27078.47,6585.13
New York City,Manhattan,7002032,001469,Mount Sinai Morningside,18 to 29,100,F,Black/African American,Spanish/Hispanic,2,Emergency,Home or Self Care,2020,INJ018,"CRUSHING INJURY, INITIAL ENCOUNTER",MST009,FIXATION OF UPPER EXTREMITY BONES,316,HAND & WRIST PROCEDURES,08,DISEASES AND DISORDERS OF THE MUSCULOSKELETAL SYSTEM AND CONNECTIVE TISSUE,1,Minor,Minor,Surgical,Medicaid,Medicaid,Self-Pay,,,Y,47655.55,12074.11
Capital/Adirond,Albany,0101000,000001,Albany Medical Center Hospital,30 to 49,121,F,Black/African American,Not Span/Hispanic,12,Emergency,Home or Self Care,2020,MUS001,INFECTIVE ARTHRITIS,MST004,INCISION AND DRAINAGE OF MUSCULOSKELETAL TISSUE AND JOINTS,316,HAND & WRIST PROCEDURES,08,DISEASES AND DISORDERS OF THE MUSCULOSKELETAL SYSTEM AND CONNECTIVE TISSUE,2,Moderate,Minor,Surgical,Blue Cross/Blue Shield,,,,,Y,91969.67,24326.21
Capital/Adirond,Albany,0101000,000001,Albany Medical Center Hospital,30 to 49,123,M,White,Not Span/Hispanic,5,Emergency,Home or Self Care,2020,MUS009,TENDON AND SYNOVIAL DISORDERS,MST004,INCISION AND DRAINAGE OF MUSCULOSKELETAL TISSUE AND JOINTS,316,HAND & WRIST PROCEDURES,08,DISEASES AND DISORDERS OF THE MUSCULOSKELETAL SYSTEM AND CONNECTIVE TISSUE,1,Minor,Minor,Surgical,"Managed Care, Unspecified",,,,,Y,32471.57,10650.46
Capital/Adirond,Albany,0101000,000001,Albany Medical Center Hospital,70 or Older,120,M,White,Not Span/Hispanic,4,Urgent,Home or Self Care,2020,MUS001,INFECTIVE ARTHRITIS,MST004,INCISION AND DRAINAGE OF MUSCULOSKELETAL TISSUE AND JOINTS,316,HAND & WRIST PROCEDURES,08,DISEASES AND DISORDERS OF THE MUSCULOSKELETAL SYSTEM AND CONNECTIVE TISSUE,2,Moderate,Minor,Surgical,Medicare,Blue Cross/Blue Shield,,,,N,22825.75,7946.09
Capital/Adirond,Albany,0101000,000001,Albany Medical Center Hospital,18 to 29,121,M,Other Race,Not Span/Hispanic,1,Trauma,Home or Self Care,2020,INJ026,OTHER SPECIFIED INJURY,MST030,"MUSCULOSKELETAL PROCEDURES, NEC",316,HAND & WRIST PROCEDURES,08,DISEASES AND DISORDERS OF THE MUSCULOSKELETAL SYSTEM AND CONNECTIVE TISSUE,1,Minor,Minor,Surgical,Miscellaneous/Other,Medicaid,,,,Y,36573.4,9434.12
Capital/Adirond,Albany,0101000,000001,Albany Medical Center Hospital,50 to 69,121,M,White,Not Span/Hispanic,5,Emergency,Home w/ Home Health Services,2020,MUS001,INFECTIVE ARTHRITIS,MST030,"MUSCULOSKELETAL PROCEDURES, NEC",316,HAND & WRIST PROCEDURES,08,DISEASES AND DISORDERS OF THE MUSCULOSKELETAL SYSTEM AND CONNECTIVE TISSUE,1,Minor,Minor,Surgical,Private Health Insurance,,,,,N,34715.44,11244.48
Central NY,Onondaga,3301003,000630,St. Joseph's Hospital Health Center,30 to 49,132,F,White,Not Span/Hispanic,8,Emergency,Home or Self Care,2020,MUS002,OSTEOMYELITIS,MST005,INCISION AND DRAINAGE OF SUBCUTANEOUS TISSUE AND FASCIA,316,HAND & WRIST PROCEDURES,08,DISEASES AND DISORDERS OF THE MUSCULOSKELETAL SYSTEM AND CONNECTIVE TISSUE,2,Moderate,Minor,Surgical,Medicaid,,,,,Y,36594.34,15141.07
Central NY,Onondaga,3301003,000630,St. Joseph's Hospital Health Center,50 to 69,130,F,White,Not Span/Hispanic,4,Emergency,Home w/ Home Health Services,2020,MUS009,TENDON AND SYNOVIAL DISORDERS,MST019,"MUSCLE, TENDON, BURSA, AND LIGAMENT EXCISION",316,HAND & WRIST PROCEDURES,08,DISEASES AND DISORDERS OF THE MUSCULOSKELETAL SYSTEM AND CONNECTIVE TISSUE,2,Moderate,Minor,Surgical,Blue Cross/Blue Shield,Medicaid,,,,Y,23643.51,10308.56
Hudson Valley,Orange,3529000,000704,St Anthony Community Hospital,30 to 49,109,F,White,Not Span/Hispanic,7,Emergency,Home or Self Care,2020,MUS009,TENDON AND SYNOVIAL DISORDERS,MST019,"MUSCLE, TENDON, BURSA, AND LIGAMENT EXCISION",316,HAND & WRIST PROCEDURES,08,DISEASES AND DISORDERS OF THE MUSCULOSKELETAL SYSTEM AND CONNECTIVE TISSUE,2,Moderate,Minor,Surgical,Medicaid,,,,,Y,129144.53,17943.91
New York City,Richmond,7004003,001737,Staten Island University Hospital Prince's Bay,18 to 29,103,M,Other Race,Spanish/Hispanic,1,Emergency,Home or Self Care,2020,INJ014,"AMPUTATION OF A LIMB, INITIAL ENCOUNTER",MST026,FINGER AND OTHER UPPER EXTREMITY AMPUTATION,316,HAND & WRIST PROCEDURES,08,DISEASES AND DISORDERS OF THE MUSCULOSKELETAL SYSTEM AND CONNECTIVE TISSUE,1,Minor,Minor,Surgical,Miscellaneous/Other,Blue Cross/Blue Shield,,,,Y,17151.59,4955.07
New York City,Richmond,7004003,001740,Staten Island University Hosp-North,50 to 69,103,F,Other Race,Spanish/Hispanic,6,Emergency,Home w/ Home Health Services,2020,MUS009,TENDON AND SYNOVIAL DISORDERS,MST022,"TENDON, MUSCLE, BURSA, AND LIGAMENT REPAIR (EXCLUDING PERINEAL)",316,HAND & WRIST PROCEDURES,08,DISEASES AND DISORDERS OF THE MUSCULOSKELETAL SYSTEM AND CONNECTIVE TISSUE,2,Moderate,Moderate,Surgical,Medicaid,Medicaid,,,,Y,56141.14,14845.79
New York City,Kings,7002053,001304,NYU Langone Hospital-Brooklyn,50 to 69,112,F,White,Not Span/Hispanic,1,Emergency,Home or Self Care,2020,INJ004,"FRACTURE OF THE UPPER LIMB, INITIAL ENCOUNTER",MST009,FIXATION OF UPPER EXTREMITY BONES,316,HAND & WRIST PROCEDURES,08,DISEASES AND DISORDERS OF THE MUSCULOSKELETAL SYSTEM AND CONNECTIVE TISSUE,1,Minor,Minor,Surgical,Private Health Insurance,,,,,Y,42526.78,7770.51
Long Island,Nassau,2953000,000563,St. Francis Hospital & Heart Center,18 to 29,110,M,White,Not Span/Hispanic,4,Emergency,Home w/ Home Health Services,2020,MUS001,INFECTIVE ARTHRITIS,MST018,BONE EXCISION,316,HAND & WRIST PROCEDURES,08,DISEASES AND DISORDERS OF THE MUSCULOSKELETAL SYSTEM AND CONNECTIVE TISSUE,1,Minor,Minor,Surgical,Blue Cross/Blue Shield,Blue Cross/Blue Shield,,,,Y,48889.51,9571.24
Long Island,Nassau,2953000,000563,St. Francis Hospital & Heart Center,30 to 49,115,M,White,Not Span/Hispanic,9,Emergency,Home or Self Care,2020,MUS009,TENDON AND SYNOVIAL DISORDERS,MST005,INCISION AND DRAINAGE OF SUBCUTANEOUS TISSUE AND FASCIA,316,HAND & WRIST PROCEDURES,08,DISEASES AND DISORDERS OF THE MUSCULOSKELETAL SYSTEM AND CONNECTIVE TISSUE,2,Moderate,Minor,Surgical,Medicaid,Medicaid,,,,Y,64947.93,13878.02
Southern Tier,Broome,0301001,000043,Our Lady of Lourdes Memorial Hospital,50 to 69,139,F,White,Not Span/Hispanic,2,Urgent,Home w/ Home Health Services,2020,INJ004,"FRACTURE OF THE UPPER LIMB, INITIAL ENCOUNTER",MST009,FIXATION OF UPPER EXTREMITY BONES,316,HAND & WRIST PROCEDURES,08,DISEASES AND DISORDERS OF THE MUSCULOSKELETAL SYSTEM AND CONNECTIVE TISSUE,3,Major,Major,Surgical,Medicare,Medicare,Self-Pay,,,N,35017.47,11440.54
Southern Tier,Broome,0301001,000043,Our Lady of Lourdes Memorial Hospital,50 to 69,139,F,White,Not Span/Hispanic,8,Emergency,Home or Self Care,2020,MUS002,OSTEOMYELITIS,MST026,FINGER AND OTHER UPPER EXTREMITY AMPUTATION,316,HAND & WRIST PROCEDURES,08,DISEASES AND DISORDERS OF THE MUSCULOSKELETAL SYSTEM AND CONNECTIVE TISSUE,2,Moderate,Minor,Surgical,Medicare,Self-Pay,Self-Pay,,,Y,34769.81,16118.62
New York City,Manhattan,7002032,001466,Mount Sinai West,50 to 69,100,F,Black/African American,Not Span/Hispanic,6,Emergency,Skilled Nursing Home,2020,MUS001,INFECTIVE ARTHRITIS,MST018,BONE EXCISION,316,HAND & WRIST PROCEDURES,08,DISEASES AND DISORDERS OF THE MUSCULOSKELETAL SYSTEM AND CONNECTIVE TISSUE,3,Major,Major,Surgical,Medicare,Medicare,Medicaid,,,Y,94046.11,21250.45
New York City,Manhattan,7002017,001450,Lenox Hill Hospital,70 or Older,104,F,White,Not Span/Hispanic,3,Emergency,Home w/ Home Health Services,2020,MUS025,OTHER SPECIFIED CONNECTIVE TISSUE DISEASE,MST028,"SUBCUTANEOUS TISSUE AND FASCIA PROCEDURES, NEC",316,HAND & WRIST PROCEDURES,08,DISEASES AND DISORDERS OF THE MUSCULOSKELETAL SYSTEM AND CONNECTIVE TISSUE,1,Minor,Minor,Surgical,Medicare,Private Health Insurance,,,,Y,45195.32,10775.95
Long Island,Nassau,2901000,000490,Glen Cove Hospital,30 to 49,115,M,White,Not Span/Hispanic,1,Emergency,Home or Self Care,2020,INJ004,"FRACTURE OF THE UPPER LIMB, INITIAL ENCOUNTER",MST009,FIXATION OF UPPER EXTREMITY BONES,316,HAND & WRIST PROCEDURES,08,DISEASES AND DISORDERS OF THE MUSCULOSKELETAL SYSTEM AND CONNECTIVE TISSUE,1,Minor,Minor,Surgical,Miscellaneous/Other,Private Health Insurance,Self-Pay,,,Y,17340,6254.24
Long Island,Suffolk,5154000,000924,South Shore University Hospital,18 to 29,117,M,White,Not Span/Hispanic,2,Trauma,Home or Self Care,2020,INJ004,"FRACTURE OF THE UPPER LIMB, INITIAL ENCOUNTER",MST009,FIXATION OF UPPER EXTREMITY BONES,316,HAND & WRIST PROCEDURES,08,DISEASES AND DISORDERS OF THE MUSCULOSKELETAL SYSTEM AND CONNECTIVE TISSUE,1,Minor,Minor,Surgical,Private Health Insurance,,,,,Y,58936.16,13995.77
Long Island,Suffolk,5154000,000924,South Shore University Hospital,18 to 29,117,M,Other Race,Unknown,1,Emergency,Home or Self Care,2020,INJ014,"AMPUTATION OF A LIMB, INITIAL ENCOUNTER",MST026,FINGER AND OTHER UPPER EXTREMITY AMPUTATION,316,HAND & WRIST PROCEDURES,08,DISEASES AND DISORDERS OF THE MUSCULOSKELETAL SYSTEM AND CONNECTIVE TISSUE,1,Minor,Minor,Surgical,Self-Pay,,,,,Y,24232.92,5358.76
Finger Lakes,Monroe,2701005,000413,Strong Memorial Hospital,50 to 69,146,F,Multi-racial,Not Span/Hispanic,3,Emergency,Home w/ Home Health Services,2020,MUS009,TENDON AND SYNOVIAL DISORDERS,SKB008,SKIN EXCISION AND DEBRIDEMENT,316,HAND & WRIST PROCEDURES,08,DISEASES AND DISORDERS OF THE MUSCULOSKELETAL SYSTEM AND CONNECTIVE TISSUE,1,Minor,Minor,Surgical,Private Health Insurance,,,,,Y,29257.39,12777.64
Finger Lakes,Monroe,2701005,000413,Strong Memorial Hospital,70 or Older,146,F,White,Not Span/Hispanic,5,Urgent,Home w/ Home Health Services,2020,INJ004,"FRACTURE OF THE UPPER LIMB, INITIAL ENCOUNTER",MST009,FIXATION OF UPPER EXTREMITY BONES,316,HAND & WRIST PROCEDURES,08,DISEASES AND DISORDERS OF THE MUSCULOSKELETAL SYSTEM AND CONNECTIVE TISSUE,1,Minor,Minor,Surgical,Medicare,,,,,N,24918.43,12548.46
New York City,Richmond,7004010,001738,Richmond University Medical Center,50 to 69,103,F,White,Not Span/Hispanic,2,Emergency,Home or Self Care,2020,MUS009,TENDON AND SYNOVIAL DISORDERS,MST004,INCISION AND DRAINAGE OF MUSCULOSKELETAL TISSUE AND JOINTS,316,HAND & WRIST PROCEDURES,08,DISEASES AND DISORDERS OF THE MUSCULOSKELETAL SYSTEM AND CONNECTIVE TISSUE,1,Minor,Minor,Surgical,Private Health Insurance,Self-Pay,Self-Pay,,,Y,22001.51,7451.33
New York City,Richmond,7004010,001738,Richmond University Medical Center,30 to 49,103,M,Other Race,Spanish/Hispanic,2,Emergency,Home or Self Care,2020,MUS009,TENDON AND SYNOVIAL DISORDERS,MST004,INCISION AND DRAINAGE OF MUSCULOSKELETAL TISSUE AND JOINTS,316,HAND & WRIST PROCEDURES,08,DISEASES AND DISORDERS OF THE MUSCULOSKELETAL SYSTEM AND CONNECTIVE TISSUE,1,Minor,Minor,Surgical,Medicaid,Self-Pay,Self-Pay,,,Y,24896.84,8622.37
Central NY,Onondaga,3301007,000635,University Hospital SUNY Health Science Center,70 or Older,133,M,White,Not Span/Hispanic,14,Emergency,Home w/ Home Health Services,2020,MUS002,OSTEOMYELITIS,MST026,FINGER AND OTHER UPPER EXTREMITY AMPUTATION,316,HAND & WRIST PROCEDURES,08,DISEASES AND DISORDERS OF THE MUSCULOSKELETAL SYSTEM AND CONNECTIVE TISSUE,2,Moderate,Minor,Surgical,Federal/State/Local/VA,,,,,Y,142997.82,37036.27
New York City,Richmond,7004010,001738,Richmond University Medical Center,30 to 49,103,F,Black/African American,Not Span/Hispanic,2,Emergency,Cancer Center or Children's Hospital,2020,INJ004,"FRACTURE OF THE UPPER LIMB, INITIAL ENCOUNTER",MST009,FIXATION OF UPPER EXTREMITY BONES,316,HAND & WRIST PROCEDURES,08,DISEASES AND DISORDERS OF THE MUSCULOSKELETAL SYSTEM AND CONNECTIVE TISSUE,3,Major,Minor,Surgical,Medicaid,Medicaid,Self-Pay,,,Y,54214.49,13320.23