Hospital Service Area,Hospital County,Operating Certificate Number,Permanent Facility Id,Facility Name,Age Group,Zip Code - 3 digits,Gender,Race,Ethnicity,Length of Stay,Type of Admission,Patient Disposition,Discharge Year,CCS Diagnosis Code,CCS Diagnosis Description,CCS Procedure Code,CCS Procedure Description,APR DRG Code,APR DRG Description,APR MDC Code,APR MDC Description,APR Severity of Illness Code,APR Severity of Illness Description,APR Risk of Mortality,APR Medical Surgical Description,Payment Typology 1,Payment Typology 2,Payment Typology 3,Birth Weight,Abortion Edit Indicator,Emergency Department Indicator,Total Charges,Total Costs
Long Island,Nassau,2908000,000511,NYU Winthrop Hospital,50 to 69,115,M,White,Not Span/Hispanic,4,Emergency,Home w/ Home Health Services,2017,211,Other connective tissue disease,160,OT THER PRCS ON MUSCLES,317,"Tendon, muscle & other soft tissue procedures",08,Diseases and Disorders of the Musculoskeletal System and Conn Tissue,2,Moderate,Minor,Surgical,Blue Cross/Blue Shield,,,,N,Y,43323.04,11356.10
Long Island,Nassau,2908000,000511,NYU Winthrop Hospital,70 or Older,116,M,White,Not Span/Hispanic,13,Emergency,Skilled Nursing Home,2017,201,Infective arthritis and osteomyelitis (except that caused by tuberculosis or sexually transmitted disease),175,OT OR THER PRC SKN/BRST,317,"Tendon, muscle & other soft tissue procedures",08,Diseases and Disorders of the Musculoskeletal System and Conn Tissue,3,Major,Major,Surgical,Medicare,Medicare,,,N,Y,109710.09,27767.57
Long Island,Nassau,2908000,000511,NYU Winthrop Hospital,70 or Older,115,F,White,Not Span/Hispanic,11,Emergency,Home w/ Home Health Services,2017,201,Infective arthritis and osteomyelitis (except that caused by tuberculosis or sexually transmitted disease),175,OT OR THER PRC SKN/BRST,317,"Tendon, muscle & other soft tissue procedures",08,Diseases and Disorders of the Musculoskeletal System and Conn Tissue,1,Minor,Moderate,Surgical,Medicare,Medicare,Blue Cross/Blue Shield,,N,Y,188700.34,43298.68
Long Island,Nassau,2908000,000511,NYU Winthrop Hospital,0 to 17,116,M,Black/African American,Not Span/Hispanic,4,Urgent,Home or Self Care,2017,211,Other connective tissue disease,159,OT DX PRCS ON MUSC/SKEL,317,"Tendon, muscle & other soft tissue procedures",08,Diseases and Disorders of the Musculoskeletal System and Conn Tissue,1,Minor,Minor,Surgical,Medicaid,,,,N,N,46835.83,10023.93
Long Island,Nassau,2908000,000511,NYU Winthrop Hospital,30 to 49,118,F,Other Race,Not Span/Hispanic,3,Elective,Home or Self Care,2017,021,Cancer of bone and connective tissue,160,OT THER PRCS ON MUSCLES,317,"Tendon, muscle & other soft tissue procedures",08,Diseases and Disorders of the Musculoskeletal System and Conn Tissue,1,Minor,Minor,Surgical,Blue Cross/Blue Shield,,,,N,N,101972.17,30358.38
Long Island,Nassau,2908000,000511,NYU Winthrop Hospital,50 to 69,115,M,White,Not Span/Hispanic,2,Emergency,Home or Self Care,2017,232,Sprains and strains,160,OT THER PRCS ON MUSCLES,317,"Tendon, muscle & other soft tissue procedures",08,Diseases and Disorders of the Musculoskeletal System and Conn Tissue,2,Moderate,Minor,Surgical,Miscellaneous/Other,,,,N,Y,55863.11,14389.61
Long Island,Nassau,2908000,000511,NYU Winthrop Hospital,30 to 49,110,M,White,Not Span/Hispanic,3,Emergency,Home w/ Home Health Services,2017,211,Other connective tissue disease,156,"INJ/ASP MUSC,TENDONS,ST",317,"Tendon, muscle & other soft tissue procedures",08,Diseases and Disorders of the Musculoskeletal System and Conn Tissue,1,Minor,Minor,Surgical,Medicaid,Medicaid,,,N,Y,36579.85,9992.31
Long Island,Nassau,2908000,000511,NYU Winthrop Hospital,70 or Older,115,F,White,Not Span/Hispanic,9,Emergency,Home w/ Home Health Services,2017,237,Complication of device; implant or graft,162,OT OR THER PRC ON JOINT,317,"Tendon, muscle & other soft tissue procedures",08,Diseases and Disorders of the Musculoskeletal System and Conn Tissue,3,Major,Major,Surgical,Private Health Insurance,Medicare,Medicare,,N,Y,112383.75,28682.04
Long Island,Nassau,2908000,000511,NYU Winthrop Hospital,70 or Older,113,M,White,Not Span/Hispanic,4,Emergency,Home w/ Home Health Services,2017,231,Other fractures,170,EXCISION OF SKIN LESION,317,"Tendon, muscle & other soft tissue procedures",08,Diseases and Disorders of the Musculoskeletal System and Conn Tissue,3,Major,Major,Surgical,Medicare,Medicare,Self-Pay,,N,Y,69923.92,11080.64
Long Island,Nassau,2908000,000511,NYU Winthrop Hospital,30 to 49,115,M,Other Race,Spanish/Hispanic,4,Emergency,Home or Self Care,2017,211,Other connective tissue disease,164,OT OR THER PRC MUSC/SKL,317,"Tendon, muscle & other soft tissue procedures",08,Diseases and Disorders of the Musculoskeletal System and Conn Tissue,1,Minor,Minor,Surgical,Medicaid,,,,N,Y,40211.91,10805.28
Long Island,Nassau,2908000,000511,NYU Winthrop Hospital,70 or Older,115,M,White,Not Span/Hispanic,4,Emergency,Skilled Nursing Home,2017,230,Fracture of lower limb,160,OT THER PRCS ON MUSCLES,317,"Tendon, muscle & other soft tissue procedures",08,Diseases and Disorders of the Musculoskeletal System and Conn Tissue,2,Moderate,Moderate,Surgical,Medicare,Medicare,Blue Cross/Blue Shield,,N,Y,61260.57,14749.18
Long Island,Nassau,2908000,000511,NYU Winthrop Hospital,70 or Older,110,M,White,Not Span/Hispanic,5,Elective,Home or Self Care,2017,013,Cancer of stomach,074,GASTRECTOMY; PART/TOTAL,317,"Tendon, muscle & other soft tissue procedures",08,Diseases and Disorders of the Musculoskeletal System and Conn Tissue,1,Minor,Moderate,Surgical,Blue Cross/Blue Shield,Medicare,Medicare,,N,N,83984.37,22387.34
Long Island,Nassau,2908000,000511,NYU Winthrop Hospital,70 or Older,115,M,White,Not Span/Hispanic,3,Elective,Skilled Nursing Home,2017,232,Sprains and strains,160,OT THER PRCS ON MUSCLES,317,"Tendon, muscle & other soft tissue procedures",08,Diseases and Disorders of the Musculoskeletal System and Conn Tissue,1,Minor,Moderate,Surgical,Medicare,Medicare,Blue Cross/Blue Shield,,N,N,71305.60,19996.58
Long Island,Nassau,2908000,000511,NYU Winthrop Hospital,30 to 49,115,M,White,Not Span/Hispanic,5,Emergency,Home or Self Care,2017,229,Fracture of upper limb,160,OT THER PRCS ON MUSCLES,317,"Tendon, muscle & other soft tissue procedures",08,Diseases and Disorders of the Musculoskeletal System and Conn Tissue,4,Extreme,Extreme,Surgical,Medicaid,,,,N,Y,137169.78,32382.11
Long Island,Nassau,2908000,000511,NYU Winthrop Hospital,18 to 29,117,F,White,Not Span/Hispanic,4,Elective,Home w/ Home Health Services,2017,021,Cancer of bone and connective tissue,160,OT THER PRCS ON MUSCLES,317,"Tendon, muscle & other soft tissue procedures",08,Diseases and Disorders of the Musculoskeletal System and Conn Tissue,3,Major,Moderate,Surgical,Blue Cross/Blue Shield,,,,N,N,98078.62,29240.30
Long Island,Nassau,2908000,000511,NYU Winthrop Hospital,70 or Older,115,F,White,Not Span/Hispanic,4,Emergency,Skilled Nursing Home,2017,229,Fracture of upper limb,171,SUTURE SKIN/SUBCUT TISS,317,"Tendon, muscle & other soft tissue procedures",08,Diseases and Disorders of the Musculoskeletal System and Conn Tissue,2,Moderate,Minor,Surgical,Blue Cross/Blue Shield,Medicare,,,N,Y,35801.53,8071.12
Long Island,Nassau,2908000,000511,NYU Winthrop Hospital,50 to 69,115,F,White,Spanish/Hispanic,18,Emergency,Skilled Nursing Home,2017,050,Diabetes mellitus with complications,175,OT OR THER PRC SKN/BRST,317,"Tendon, muscle & other soft tissue procedures",08,Diseases and Disorders of the Musculoskeletal System and Conn Tissue,2,Moderate,Moderate,Surgical,Medicare,Medicare,Medicaid,,N,Y,323865.45,79843.77
Long Island,Nassau,2908000,000511,NYU Winthrop Hospital,70 or Older,115,M,White,Not Span/Hispanic,6,Emergency,Skilled Nursing Home,2017,232,Sprains and strains,160,OT THER PRCS ON MUSCLES,317,"Tendon, muscle & other soft tissue procedures",08,Diseases and Disorders of the Musculoskeletal System and Conn Tissue,1,Minor,Minor,Surgical,Medicare,Medicare,,,N,Y,102593.51,22647.94
Long Island,Nassau,2908000,000511,NYU Winthrop Hospital,70 or Older,115,M,White,Not Span/Hispanic,7,Emergency,Skilled Nursing Home,2017,232,Sprains and strains,160,OT THER PRCS ON MUSCLES,317,"Tendon, muscle & other soft tissue procedures",08,Diseases and Disorders of the Musculoskeletal System and Conn Tissue,1,Minor,Moderate,Surgical,Medicare,Medicare,Private Health Insurance,,N,Y,151485.69,43504.28
Long Island,Nassau,2908000,000511,NYU Winthrop Hospital,50 to 69,115,M,White,Not Span/Hispanic,4,Emergency,Skilled Nursing Home,2017,232,Sprains and strains,160,OT THER PRCS ON MUSCLES,317,"Tendon, muscle & other soft tissue procedures",08,Diseases and Disorders of the Musculoskeletal System and Conn Tissue,1,Minor,Moderate,Surgical,Blue Cross/Blue Shield,,,,N,Y,83923.28,24222.30
Long Island,Nassau,2908000,000511,NYU Winthrop Hospital,30 to 49,114,M,Black/African American,Not Span/Hispanic,2,Emergency,Home or Self Care,2017,232,Sprains and strains,160,OT THER PRCS ON MUSCLES,317,"Tendon, muscle & other soft tissue procedures",08,Diseases and Disorders of the Musculoskeletal System and Conn Tissue,1,Minor,Minor,Surgical,Blue Cross/Blue Shield,,,,N,Y,56703.07,17336.77
Long Island,Nassau,2908000,000511,NYU Winthrop Hospital,50 to 69,115,M,Black/African American,Not Span/Hispanic,18,Emergency,Home or Self Care,2017,237,Complication of device; implant or graft,159,OT DX PRCS ON MUSC/SKEL,317,"Tendon, muscle & other soft tissue procedures",08,Diseases and Disorders of the Musculoskeletal System and Conn Tissue,3,Major,Major,Surgical,Medicaid,Medicaid,Medicaid,,N,Y,171205.83,34461.20
Long Island,Nassau,2908000,000511,NYU Winthrop Hospital,70 or Older,115,M,White,Spanish/Hispanic,3,Emergency,Left Against Medical Advice,2017,042,Secondary malignancies,159,OT DX PRCS ON MUSC/SKEL,317,"Tendon, muscle & other soft tissue procedures",08,Diseases and Disorders of the Musculoskeletal System and Conn Tissue,2,Moderate,Moderate,Surgical,Medicare,Medicare,Blue Cross/Blue Shield,,N,Y,145193.55,21748.71
Long Island,Nassau,2908000,000511,NYU Winthrop Hospital,18 to 29,110,F,White,Not Span/Hispanic,15,Emergency,Home or Self Care,2017,211,Other connective tissue disease,175,OT OR THER PRC SKN/BRST,317,"Tendon, muscle & other soft tissue procedures",08,Diseases and Disorders of the Musculoskeletal System and Conn Tissue,3,Major,Minor,Surgical,Medicaid,,,,N,Y,293678.38,82068.14
Long Island,Nassau,2908000,000511,NYU Winthrop Hospital,50 to 69,115,M,White,Spanish/Hispanic,7,Emergency,Home or Self Care,2017,050,Diabetes mellitus with complications,160,OT THER PRCS ON MUSCLES,317,"Tendon, muscle & other soft tissue procedures",08,Diseases and Disorders of the Musculoskeletal System and Conn Tissue,2,Moderate,Minor,Surgical,Self-Pay,Self-Pay,,,N,Y,67664.02,14740.12
Long Island,Nassau,2908000,000511,NYU Winthrop Hospital,50 to 69,115,M,Other Race,Not Span/Hispanic,17,Emergency,Skilled Nursing Home,2017,201,Infective arthritis and osteomyelitis (except that caused by tuberculosis or sexually transmitted disease),161,OT OR THER PRCS ON BONE,317,"Tendon, muscle & other soft tissue procedures",08,Diseases and Disorders of the Musculoskeletal System and Conn Tissue,3,Major,Moderate,Surgical,Medicare,Medicare,Medicaid,,N,Y,272218.14,66373.14
Long Island,Nassau,2908000,000511,NYU Winthrop Hospital,70 or Older,115,M,White,Not Span/Hispanic,4,Emergency,Inpatient Rehabilitation Facility,2017,232,Sprains and strains,160,OT THER PRCS ON MUSCLES,317,"Tendon, muscle & other soft tissue procedures",08,Diseases and Disorders of the Musculoskeletal System and Conn Tissue,1,Minor,Minor,Surgical,Medicare,Medicare,Private Health Insurance,,N,Y,80318.33,22758.12
Long Island,Nassau,2908000,000511,NYU Winthrop Hospital,50 to 69,115,M,White,Not Span/Hispanic,4,Emergency,Skilled Nursing Home,2017,244,Other injuries and conditions due to external causes,160,OT THER PRCS ON MUSCLES,317,"Tendon, muscle & other soft tissue procedures",08,Diseases and Disorders of the Musculoskeletal System and Conn Tissue,2,Moderate,Minor,Surgical,Medicare,Medicare,Medicaid,,N,Y,83215.68,22948.62
