Hospital Service Area,Hospital County,Operating Certificate Number,Permanent Facility Id,Facility Name,Age Group,Zip Code - 3 digits,Gender,Race,Ethnicity,Length of Stay,Type of Admission,Patient Disposition,Discharge Year,CCS Diagnosis Code,CCS Diagnosis Description,CCS Procedure Code,CCS Procedure Description,APR DRG Code,APR DRG Description,APR MDC Code,APR MDC Description,APR Severity of Illness Code,APR Severity of Illness Description,APR Risk of Mortality,APR Medical Surgical Description,Payment Typology 1,Payment Typology 2,Payment Typology 3,Birth Weight,Abortion Edit Indicator,Emergency Department Indicator,Total Charges,Total Costs
Hudson Valley,Dutchess,1302001,000181,Vassar Brothers Medical Center,30 to 49,126,F,White,Not Span/Hispanic,6,Emergency,Home w/ Home Health Services,2018,INJ024,"SPRAINS AND STRAINS, INITIAL ENCOUNTER",MST019,"MUSCLE, TENDON, BURSA, AND LIGAMENT EXCISION",317,"TENDON, MUSCLE & OTHER SOFT TISSUE PROCEDURES",08,DISEASES AND DISORDERS OF THE MUSCULOSKELETAL SYSTEM AND CONNECTIVE TISSUE,3,Major,Minor,Surgical,Medicaid,,,,,true,43916.21,14538.53
New York City,Bronx,7000008,001172,Lincoln Medical & Mental Health Center,18 to 29,104,M,Other Race,Not Span/Hispanic,4,Emergency,Home or Self Care,2018,INJ012,"OPEN WOUNDS TO LIMBS, INITIAL ENCOUNTER",MST022,"TENDON, MUSCLE, BURSA, AND LIGAMENT REPAIR (EXCLUDING PERINEAL)",317,"TENDON, MUSCLE & OTHER SOFT TISSUE PROCEDURES",08,DISEASES AND DISORDERS OF THE MUSCULOSKELETAL SYSTEM AND CONNECTIVE TISSUE,2,Moderate,Minor,Surgical,Medicaid,Medicaid,,,,true,31494,18599
Long Island,Nassau,7003004,000518,Long Island Jewish Valley Stream,18 to 29,115,M,Other Race,Unknown,1,Urgent,Home or Self Care,2018,INJ024,"SPRAINS AND STRAINS, INITIAL ENCOUNTER",MST019,"MUSCLE, TENDON, BURSA, AND LIGAMENT EXCISION",317,"TENDON, MUSCLE & OTHER SOFT TISSUE PROCEDURES",08,DISEASES AND DISORDERS OF THE MUSCULOSKELETAL SYSTEM AND CONNECTIVE TISSUE,1,Minor,Minor,Surgical,Blue Cross/Blue Shield,,,,,false,30797.46,7729.98
Finger Lakes,Monroe,2701001,000409,Highland Hospital,50 to 69,146,M,Black/African American,Not Span/Hispanic,5,Elective,Home or Self Care,2018,INJ035,"COMPLICATION OF INTERNAL ORTHOPEDIC DEVICE OR IMPLANT, INITIAL ENCOUNTER",MST020,SUBCUTANEOUS TISSUE AND FASCIA EXCISION,317,"TENDON, MUSCLE & OTHER SOFT TISSUE PROCEDURES",08,DISEASES AND DISORDERS OF THE MUSCULOSKELETAL SYSTEM AND CONNECTIVE TISSUE,2,Moderate,Minor,Surgical,Medicaid,,,,,false,15297.13,6120.48
New York City,Manhattan,7002020,001453,Memorial Hospital for Cancer and Allied Diseases,50 to 69,OOS,M,White,Not Span/Hispanic,6,Elective,Home or Self Care,2018,NEO023,BONE CANCER,GNR006,"CHEST WALL PROCEDURES, NEC",317,"TENDON, MUSCLE & OTHER SOFT TISSUE PROCEDURES",08,DISEASES AND DISORDERS OF THE MUSCULOSKELETAL SYSTEM AND CONNECTIVE TISSUE,2,Moderate,Moderate,Surgical,Private Health Insurance,,,,,false,89930.23,37771.97
New York City,Manhattan,7002020,001453,Memorial Hospital for Cancer and Allied Diseases,30 to 49,,M,Black/African American,Spanish/Hispanic,1,Elective,Home or Self Care,2018,NEO024,SARCOMA,MST019,"MUSCLE, TENDON, BURSA, AND LIGAMENT EXCISION",317,"TENDON, MUSCLE & OTHER SOFT TISSUE PROCEDURES",08,DISEASES AND DISORDERS OF THE MUSCULOSKELETAL SYSTEM AND CONNECTIVE TISSUE,1,Minor,Minor,Surgical,Private Health Insurance,,,,,false,23306.3,9994.81
Hudson Valley,Westchester,5957001,001139,Westchester Medical Center,50 to 69,125,F,Other Race,Spanish/Hispanic,16,Emergency,Inpatient Rehabilitation Facility,2018,MUS025,OTHER SPECIFIED CONNECTIVE TISSUE DISEASE,MST020,SUBCUTANEOUS TISSUE AND FASCIA EXCISION,317,"TENDON, MUSCLE & OTHER SOFT TISSUE PROCEDURES",08,DISEASES AND DISORDERS OF THE MUSCULOSKELETAL SYSTEM AND CONNECTIVE TISSUE,3,Major,Minor,Surgical,Medicare,Medicaid,,,,true,414429.04,75553.96
Hudson Valley,Westchester,5902001,001045,White Plains Hospital Center,18 to 29,105,M,Other Race,Not Span/Hispanic,4,Emergency,Home w/ Home Health Services,2018,MUS025,OTHER SPECIFIED CONNECTIVE TISSUE DISEASE,MST004,INCISION AND DRAINAGE OF MUSCULOSKELETAL TISSUE AND JOINTS,317,"TENDON, MUSCLE & OTHER SOFT TISSUE PROCEDURES",08,DISEASES AND DISORDERS OF THE MUSCULOSKELETAL SYSTEM AND CONNECTIVE TISSUE,2,Moderate,Minor,Surgical,Private Health Insurance,Private Health Insurance,,,,true,20626,5676.69
Capital/Adirond,Albany,0101004,000005,St. Peter's Hospital,70 or Older,122,F,White,Not Span/Hispanic,7,Emergency,Skilled Nursing Home,2018,INJ024,"SPRAINS AND STRAINS, INITIAL ENCOUNTER",MST022,"TENDON, MUSCLE, BURSA, AND LIGAMENT REPAIR (EXCLUDING PERINEAL)",317,"TENDON, MUSCLE & OTHER SOFT TISSUE PROCEDURES",08,DISEASES AND DISORDERS OF THE MUSCULOSKELETAL SYSTEM AND CONNECTIVE TISSUE,1,Minor,Moderate,Surgical,Medicare,Medicare,,,,true,39629.19,14913.2
Capital/Adirond,Schenectady,4601001,000829,Ellis Hospital,50 to 69,122,F,White,Not Span/Hispanic,4,Urgent,Home or Self Care,2018,INJ035,"COMPLICATION OF INTERNAL ORTHOPEDIC DEVICE OR IMPLANT, INITIAL ENCOUNTER",MST019,"MUSCLE, TENDON, BURSA, AND LIGAMENT EXCISION",317,"TENDON, MUSCLE & OTHER SOFT TISSUE PROCEDURES",08,DISEASES AND DISORDERS OF THE MUSCULOSKELETAL SYSTEM AND CONNECTIVE TISSUE,2,Moderate,Minor,Surgical,Blue Cross/Blue Shield,,,,,false,30013.85,8939.05
New York City,Kings,7001021,001306,New York - Presbyterian Brooklyn Methodist Hospital,50 to 69,112,F,Black/African American,Not Span/Hispanic,5,Emergency,Home w/ Home Health Services,2018,INJ024,"SPRAINS AND STRAINS, INITIAL ENCOUNTER",MST022,"TENDON, MUSCLE, BURSA, AND LIGAMENT REPAIR (EXCLUDING PERINEAL)",317,"TENDON, MUSCLE & OTHER SOFT TISSUE PROCEDURES",08,DISEASES AND DISORDERS OF THE MUSCULOSKELETAL SYSTEM AND CONNECTIVE TISSUE,1,Minor,Minor,Surgical,Private Health Insurance,Self-Pay,,,,true,66290.7,22073.86
New York City,Manhattan,7002024,001456,Mount Sinai Hospital,30 to 49,113,F,Black/African American,Not Span/Hispanic,4,Elective,Home w/ Home Health Services,2018,MUS025,OTHER SPECIFIED CONNECTIVE TISSUE DISEASE,MST019,"MUSCLE, TENDON, BURSA, AND LIGAMENT EXCISION",317,"TENDON, MUSCLE & OTHER SOFT TISSUE PROCEDURES",08,DISEASES AND DISORDERS OF THE MUSCULOSKELETAL SYSTEM AND CONNECTIVE TISSUE,1,Minor,Minor,Surgical,"Managed Care, Unspecified",Medicaid,Self-Pay,,,false,50187.54,17202.99
Central NY,Onondaga,3301003,000630,St. Joseph's Hospital Health Center,50 to 69,133,M,White,Not Span/Hispanic,8,Urgent,Home w/ Home Health Services,2018,INJ037,"COMPLICATION OF OTHER SURGICAL OR MEDICAL CARE, INJURY, INITIAL ENCOUNTER",MST020,SUBCUTANEOUS TISSUE AND FASCIA EXCISION,317,"TENDON, MUSCLE & OTHER SOFT TISSUE PROCEDURES",08,DISEASES AND DISORDERS OF THE MUSCULOSKELETAL SYSTEM AND CONNECTIVE TISSUE,2,Moderate,Moderate,Surgical,Medicare,Private Health Insurance,,,,false,29625.27,12875.22
New York City,Kings,7001020,001305,Maimonides Medical Center,30 to 49,112,M,Other Race,Spanish/Hispanic,12,Emergency,Home or Self Care,2018,MUS002,OSTEOMYELITIS,MST005,INCISION AND DRAINAGE OF SUBCUTANEOUS TISSUE AND FASCIA,317,"TENDON, MUSCLE & OTHER SOFT TISSUE PROCEDURES",08,DISEASES AND DISORDERS OF THE MUSCULOSKELETAL SYSTEM AND CONNECTIVE TISSUE,2,Moderate,Minor,Surgical,Medicaid,Medicaid,Self-Pay,,,true,68843,19597.84
Western NY,Erie,1401014,000208,John R. Oishei Children's Hospital,18 to 29,142,F,White,Not Span/Hispanic,2,Elective,Home or Self Care,2018,MUS027,MUSCULOSKELETAL ABSCESS,MST004,INCISION AND DRAINAGE OF MUSCULOSKELETAL TISSUE AND JOINTS,317,"TENDON, MUSCLE & OTHER SOFT TISSUE PROCEDURES",08,DISEASES AND DISORDERS OF THE MUSCULOSKELETAL SYSTEM AND CONNECTIVE TISSUE,2,Moderate,Minor,Surgical,Blue Cross/Blue Shield,Self-Pay,,,,false,22243.13,9336.71
Western NY,Erie,1401010,000216,Roswell Park Cancer Institute,70 or Older,143,M,White,Not Span/Hispanic,7,Elective,Home or Self Care,2018,NEO024,SARCOMA,MST019,"MUSCLE, TENDON, BURSA, AND LIGAMENT EXCISION",317,"TENDON, MUSCLE & OTHER SOFT TISSUE PROCEDURES",08,DISEASES AND DISORDERS OF THE MUSCULOSKELETAL SYSTEM AND CONNECTIVE TISSUE,2,Moderate,Moderate,Surgical,Blue Cross/Blue Shield,,,,,false,70030.85,25051.59
Long Island,Nassau,2951001,000541,North Shore University Hospital,50 to 69,117,M,White,Not Span/Hispanic,7,Elective,Home or Self Care,2018,INJ024,"SPRAINS AND STRAINS, INITIAL ENCOUNTER",MST022,"TENDON, MUSCLE, BURSA, AND LIGAMENT REPAIR (EXCLUDING PERINEAL)",317,"TENDON, MUSCLE & OTHER SOFT TISSUE PROCEDURES",08,DISEASES AND DISORDERS OF THE MUSCULOSKELETAL SYSTEM AND CONNECTIVE TISSUE,1,Minor,Minor,Surgical,Medicare,Medicare,,,,false,85485.85,18351.69
Western NY,Erie,1401014,000208,John R. Oishei Children's Hospital,0 to 17,142,F,Black/African American,Spanish/Hispanic,1,Elective,Home or Self Care,2018,MAL008,MUSCULOSKELETAL CONGENITAL CONDITIONS,MST030,"MUSCULOSKELETAL PROCEDURES, NEC",317,"TENDON, MUSCLE & OTHER SOFT TISSUE PROCEDURES",08,DISEASES AND DISORDERS OF THE MUSCULOSKELETAL SYSTEM AND CONNECTIVE TISSUE,3,Major,Major,Surgical,Medicaid,Self-Pay,,,,false,32074.39,11946.89
Western NY,Erie,1401014,000208,John R. Oishei Children's Hospital,0 to 17,142,M,Other Race,Not Span/Hispanic,5,Emergency,Home or Self Care,2018,MUS026,MUSCLE DISORDERS,MST005,INCISION AND DRAINAGE OF SUBCUTANEOUS TISSUE AND FASCIA,317,"TENDON, MUSCLE & OTHER SOFT TISSUE PROCEDURES",08,DISEASES AND DISORDERS OF THE MUSCULOSKELETAL SYSTEM AND CONNECTIVE TISSUE,1,Minor,Minor,Surgical,Blue Cross/Blue Shield,Self-Pay,,,,true,31645.93,14365.02
Central NY,Onondaga,3301007,000635,University Hospital SUNY Health Science Center,50 to 69,139,M,White,Not Span/Hispanic,22,Emergency,Skilled Nursing Home,2018,MUS024,SYSTEMIC LUPUS ERYTHEMATOSUS AND CONNECTIVE TISSUE DISORDERS,MST003,"SUBCUTANEOUS TISSUE, FASCIA, AND MUSCLE BIOPSY",317,"TENDON, MUSCLE & OTHER SOFT TISSUE PROCEDURES",08,DISEASES AND DISORDERS OF THE MUSCULOSKELETAL SYSTEM AND CONNECTIVE TISSUE,3,Major,Moderate,Surgical,Private Health Insurance,,,,,true,306994.26,86159.04
New York City,Manhattan,7002002,001439,Mount Sinai Beth Israel,70 or Older,100,M,White,Not Span/Hispanic,7,Emergency,Home w/ Home Health Services,2018,END003,DIABETES MELLITUS WITH COMPLICATION,MST020,SUBCUTANEOUS TISSUE AND FASCIA EXCISION,317,"TENDON, MUSCLE & OTHER SOFT TISSUE PROCEDURES",08,DISEASES AND DISORDERS OF THE MUSCULOSKELETAL SYSTEM AND CONNECTIVE TISSUE,3,Major,Major,Surgical,Medicare,Self-Pay,,,,true,82671.58,17671.28
Hudson Valley,Westchester,5957001,001139,Westchester Medical Center,70 or Older,109,M,White,Not Span/Hispanic,1,Emergency,Home or Self Care,2018,INJ014,"AMPUTATION OF A LIMB, INITIAL ENCOUNTER",MST028,"SUBCUTANEOUS TISSUE AND FASCIA PROCEDURES, NEC",317,"TENDON, MUSCLE & OTHER SOFT TISSUE PROCEDURES",08,DISEASES AND DISORDERS OF THE MUSCULOSKELETAL SYSTEM AND CONNECTIVE TISSUE,1,Minor,Minor,Surgical,Private Health Insurance,Medicare,,,,true,43811.54,8132.19
New York City,Manhattan,7002024,001456,Mount Sinai Hospital,70 or Older,113,M,White,Not Span/Hispanic,8,Elective,Skilled Nursing Home,2018,NEO024,SARCOMA,MST019,"MUSCLE, TENDON, BURSA, AND LIGAMENT EXCISION",317,"TENDON, MUSCLE & OTHER SOFT TISSUE PROCEDURES",08,DISEASES AND DISORDERS OF THE MUSCULOSKELETAL SYSTEM AND CONNECTIVE TISSUE,3,Major,Major,Surgical,Medicare,Medicaid,Self-Pay,,,false,103952.73,32545.86
Long Island,Nassau,7003004,000518,Long Island Jewish Valley Stream,50 to 69,114,M,Black/African American,Not Span/Hispanic,12,Emergency,Home or Self Care,2018,NEO070,SECONDARY MALIGNANCIES,MST002,BONE AND JOINT BIOPSY,317,"TENDON, MUSCLE & OTHER SOFT TISSUE PROCEDURES",08,DISEASES AND DISORDERS OF THE MUSCULOSKELETAL SYSTEM AND CONNECTIVE TISSUE,3,Major,Minor,Surgical,Blue Cross/Blue Shield,Medicare,,,,true,199896.73,45949.93
New York City,Kings,7002002,001324,Mount Sinai Brooklyn,70 or Older,112,M,White,Not Span/Hispanic,5,Emergency,Home w/ Home Health Services,2018,MUS001,INFECTIVE ARTHRITIS,MST005,INCISION AND DRAINAGE OF SUBCUTANEOUS TISSUE AND FASCIA,317,"TENDON, MUSCLE & OTHER SOFT TISSUE PROCEDURES",08,DISEASES AND DISORDERS OF THE MUSCULOSKELETAL SYSTEM AND CONNECTIVE TISSUE,2,Moderate,Moderate,Surgical,Medicare,Blue Cross/Blue Shield,Self-Pay,,,true,56913.96,9593.4
New York City,Manhattan,7002020,001453,Memorial Hospital for Cancer and Allied Diseases,50 to 69,OOS,M,White,Not Span/Hispanic,1,Elective,Home or Self Care,2018,NEO024,SARCOMA,MST019,"MUSCLE, TENDON, BURSA, AND LIGAMENT EXCISION",317,"TENDON, MUSCLE & OTHER SOFT TISSUE PROCEDURES",08,DISEASES AND DISORDERS OF THE MUSCULOSKELETAL SYSTEM AND CONNECTIVE TISSUE,2,Moderate,Moderate,Surgical,Medicare,Blue Cross/Blue Shield,,,,false,23312.84,10137.48
Finger Lakes,Monroe,2701001,000409,Highland Hospital,50 to 69,144,M,White,Not Span/Hispanic,5,Emergency,Home w/ Home Health Services,2018,INJ035,"COMPLICATION OF INTERNAL ORTHOPEDIC DEVICE OR IMPLANT, INITIAL ENCOUNTER",MST020,SUBCUTANEOUS TISSUE AND FASCIA EXCISION,317,"TENDON, MUSCLE & OTHER SOFT TISSUE PROCEDURES",08,DISEASES AND DISORDERS OF THE MUSCULOSKELETAL SYSTEM AND CONNECTIVE TISSUE,2,Moderate,Minor,Surgical,Medicaid,,,,,true,25790.08,9071.08
Long Island,Nassau,2951001,000541,North Shore University Hospital,18 to 29,110,M,Other Race,Not Span/Hispanic,1,Emergency,Home or Self Care,2018,MUS025,OTHER SPECIFIED CONNECTIVE TISSUE DISEASE,MST030,"MUSCULOSKELETAL PROCEDURES, NEC",317,"TENDON, MUSCLE & OTHER SOFT TISSUE PROCEDURES",08,DISEASES AND DISORDERS OF THE MUSCULOSKELETAL SYSTEM AND CONNECTIVE TISSUE,1,Minor,Minor,Surgical,Medicaid,,,,,true,40959.41,9016.68
Western NY,Erie,1401005,000210,Erie County Medical Center,50 to 69,140,M,White,Not Span/Hispanic,1,Emergency,Home or Self Care,2018,INJ012,"OPEN WOUNDS TO LIMBS, INITIAL ENCOUNTER",MST022,"TENDON, MUSCLE, BURSA, AND LIGAMENT REPAIR (EXCLUDING PERINEAL)",317,"TENDON, MUSCLE & OTHER SOFT TISSUE PROCEDURES",08,DISEASES AND DISORDERS OF THE MUSCULOSKELETAL SYSTEM AND CONNECTIVE TISSUE,1,Minor,Minor,Surgical,Blue Cross/Blue Shield,,,,,true,10789.11,5643.84
Long Island,Suffolk,5154001,000925,Good Samaritan Hospital Medical Center,70 or Older,117,F,Black/African American,Not Span/Hispanic,8,Emergency,Skilled Nursing Home,2018,MUS026,MUSCLE DISORDERS,MST003,"SUBCUTANEOUS TISSUE, FASCIA, AND MUSCLE BIOPSY",317,"TENDON, MUSCLE & OTHER SOFT TISSUE PROCEDURES",08,DISEASES AND DISORDERS OF THE MUSCULOSKELETAL SYSTEM AND CONNECTIVE TISSUE,2,Moderate,Moderate,Surgical,Medicare,Medicare,,,,true,79913.61,13639.95
Finger Lakes,Ontario,3402000,000671,Geneva General Hospital,30 to 49,144,M,White,Not Span/Hispanic,3,Emergency,Home or Self Care,2018,INJ024,"SPRAINS AND STRAINS, INITIAL ENCOUNTER",MST030,"MUSCULOSKELETAL PROCEDURES, NEC",317,"TENDON, MUSCLE & OTHER SOFT TISSUE PROCEDURES",08,DISEASES AND DISORDERS OF THE MUSCULOSKELETAL SYSTEM AND CONNECTIVE TISSUE,1,Minor,Minor,Surgical,Blue Cross/Blue Shield,,,,,true,17821.03,7052.66
Central NY,Onondaga,3301007,000635,University Hospital SUNY Health Science Center,50 to 69,148,M,White,Not Span/Hispanic,10,Emergency,Home w/ Home Health Services,2018,INJ035,"COMPLICATION OF INTERNAL ORTHOPEDIC DEVICE OR IMPLANT, INITIAL ENCOUNTER",MST020,SUBCUTANEOUS TISSUE AND FASCIA EXCISION,317,"TENDON, MUSCLE & OTHER SOFT TISSUE PROCEDURES",08,DISEASES AND DISORDERS OF THE MUSCULOSKELETAL SYSTEM AND CONNECTIVE TISSUE,2,Moderate,Minor,Surgical,Medicaid,,,,,false,72532.23,21966.81
Long Island,Suffolk,5154000,000924,South Shore University Hospital,70 or Older,117,M,White,Not Span/Hispanic,3,Emergency,Cancer Center or Children's Hospital,2018,INJ024,"SPRAINS AND STRAINS, INITIAL ENCOUNTER",MST022,"TENDON, MUSCLE, BURSA, AND LIGAMENT REPAIR (EXCLUDING PERINEAL)",317,"TENDON, MUSCLE & OTHER SOFT TISSUE PROCEDURES",08,DISEASES AND DISORDERS OF THE MUSCULOSKELETAL SYSTEM AND CONNECTIVE TISSUE,1,Minor,Moderate,Surgical,Medicare,Blue Cross/Blue Shield,,,,true,44179.37,11390.57
Long Island,Nassau,2951001,000541,North Shore University Hospital,30 to 49,110,M,White,Not Span/Hispanic,11,Emergency,Home or Self Care,2018,INJ026,OTHER SPECIFIED INJURY,MST020,SUBCUTANEOUS TISSUE AND FASCIA EXCISION,317,"TENDON, MUSCLE & OTHER SOFT TISSUE PROCEDURES",08,DISEASES AND DISORDERS OF THE MUSCULOSKELETAL SYSTEM AND CONNECTIVE TISSUE,1,Minor,Minor,Surgical,Blue Cross/Blue Shield,,,,,true,151012.56,33539.11
New York City,Manhattan,7002054,003975,New York Presbyterian Hospital - Allen Hospital,50 to 69,100,M,Other Race,Not Span/Hispanic,4,Emergency,Home w/ Home Health Services,2018,INJ024,"SPRAINS AND STRAINS, INITIAL ENCOUNTER",MST022,"TENDON, MUSCLE, BURSA, AND LIGAMENT REPAIR (EXCLUDING PERINEAL)",317,"TENDON, MUSCLE & OTHER SOFT TISSUE PROCEDURES",08,DISEASES AND DISORDERS OF THE MUSCULOSKELETAL SYSTEM AND CONNECTIVE TISSUE,1,Minor,Minor,Surgical,Medicare,Medicare,Self-Pay,,,false,69171.58,19285.92
Hudson Valley,Orange,3522000,000694,St Luke's Cornwall Hospital/Newburgh,30 to 49,109,M,Black/African American,Not Span/Hispanic,4,Trauma,Home or Self Care,2018,INJ018,"CRUSHING INJURY, INITIAL ENCOUNTER",MST020,SUBCUTANEOUS TISSUE AND FASCIA EXCISION,317,"TENDON, MUSCLE & OTHER SOFT TISSUE PROCEDURES",08,DISEASES AND DISORDERS OF THE MUSCULOSKELETAL SYSTEM AND CONNECTIVE TISSUE,1,Minor,Minor,Surgical,Miscellaneous/Other,,,,,true,43288.01,11477.12
Hudson Valley,Westchester,5922000,001122,New York - Presbyterian Hospital,50 to 69,107,F,Black/African American,Not Span/Hispanic,11,Emergency,Skilled Nursing Home,2018,END003,DIABETES MELLITUS WITH COMPLICATION,MST019,"MUSCLE, TENDON, BURSA, AND LIGAMENT EXCISION",317,"TENDON, MUSCLE & OTHER SOFT TISSUE PROCEDURES",08,DISEASES AND DISORDERS OF THE MUSCULOSKELETAL SYSTEM AND CONNECTIVE TISSUE,3,Major,Major,Surgical,Blue Cross/Blue Shield,,,,,true,133151.77,58574.95
New York City,Queens,7003004,001630,Long Island Jewish Medical Center,50 to 69,112,M,Other Race,Not Span/Hispanic,3,Elective,Home or Self Care,2018,MUS028,OTHER SPECIFIED BONE DISEASE AND MUSCULOSKELETAL DEFORMITIES,GNR006,"CHEST WALL PROCEDURES, NEC",317,"TENDON, MUSCLE & OTHER SOFT TISSUE PROCEDURES",08,DISEASES AND DISORDERS OF THE MUSCULOSKELETAL SYSTEM AND CONNECTIVE TISSUE,1,Minor,Minor,Surgical,Medicaid,Medicaid,Self-Pay,,,false,90050.79,46808.62
Western NY,Genesee,1801000,000339,United Memorial Medical Center North Street Campus,30 to 49,140,M,White,Not Span/Hispanic,2,Emergency,Home w/ Home Health Services,2018,MUS025,OTHER SPECIFIED CONNECTIVE TISSUE DISEASE,MST030,"MUSCULOSKELETAL PROCEDURES, NEC",317,"TENDON, MUSCLE & OTHER SOFT TISSUE PROCEDURES",08,DISEASES AND DISORDERS OF THE MUSCULOSKELETAL SYSTEM AND CONNECTIVE TISSUE,2,Moderate,Minor,Surgical,Medicaid,Medicaid,,,,true,21062.99,6338.34
Long Island,Nassau,2951001,000541,North Shore University Hospital,50 to 69,110,M,Other Race,Not Span/Hispanic,7,Trauma,Home w/ Home Health Services,2018,INJ026,OTHER SPECIFIED INJURY,MST030,"MUSCULOSKELETAL PROCEDURES, NEC",317,"TENDON, MUSCLE & OTHER SOFT TISSUE PROCEDURES",08,DISEASES AND DISORDERS OF THE MUSCULOSKELETAL SYSTEM AND CONNECTIVE TISSUE,2,Moderate,Minor,Surgical,Medicaid,Medicaid,,,,false,109646.68,21156.08
Hudson Valley,Dutchess,1327000,000192,Northern Dutchess Hospital,70 or Older,125,F,White,Not Span/Hispanic,4,Emergency,Home or Self Care,2018,MUS025,OTHER SPECIFIED CONNECTIVE TISSUE DISEASE,MST005,INCISION AND DRAINAGE OF SUBCUTANEOUS TISSUE AND FASCIA,317,"TENDON, MUSCLE & OTHER SOFT TISSUE PROCEDURES",08,DISEASES AND DISORDERS OF THE MUSCULOSKELETAL SYSTEM AND CONNECTIVE TISSUE,2,Moderate,Moderate,Surgical,Medicare,,,,,true,20028.84,6574.11
Long Island,Nassau,2901000,000490,Glen Cove Hospital,70 or Older,115,M,White,Not Span/Hispanic,7,Emergency,Home w/ Home Health Services,2018,INJ025,"INJURY TO NERVES, MUSCLES AND TENDONS, INITIAL ENCOUNTER",MST022,"TENDON, MUSCLE, BURSA, AND LIGAMENT REPAIR (EXCLUDING PERINEAL)",317,"TENDON, MUSCLE & OTHER SOFT TISSUE PROCEDURES",08,DISEASES AND DISORDERS OF THE MUSCULOSKELETAL SYSTEM AND CONNECTIVE TISSUE,2,Moderate,Minor,Surgical,Medicare,,,,,true,56219.25,19607.94
New York City,Manhattan,7002054,001437,New York-Presbyterian/Lower Manhattan Hospital,18 to 29,112,M,White,Spanish/Hispanic,2,Emergency,Home or Self Care,2018,INJ024,"SPRAINS AND STRAINS, INITIAL ENCOUNTER",MST022,"TENDON, MUSCLE, BURSA, AND LIGAMENT REPAIR (EXCLUDING PERINEAL)",317,"TENDON, MUSCLE & OTHER SOFT TISSUE PROCEDURES",08,DISEASES AND DISORDERS OF THE MUSCULOSKELETAL SYSTEM AND CONNECTIVE TISSUE,1,Minor,Minor,Surgical,Private Health Insurance,Self-Pay,,,,true,59943.18,20210.67
Finger Lakes,Monroe,2701001,000409,Highland Hospital,70 or Older,144,M,Black/African American,Not Span/Hispanic,4,Elective,Expired,2018,MUS009,TENDON AND SYNOVIAL DISORDERS,MST022,"TENDON, MUSCLE, BURSA, AND LIGAMENT REPAIR (EXCLUDING PERINEAL)",317,"TENDON, MUSCLE & OTHER SOFT TISSUE PROCEDURES",08,DISEASES AND DISORDERS OF THE MUSCULOSKELETAL SYSTEM AND CONNECTIVE TISSUE,2,Moderate,Extreme,Surgical,Medicare,,,,,false,22815.33,7740.77
New York City,Manhattan,7002054,001458,New York-Presbyterian Hospital - New York Weill Cornell Center,50 to 69,104,M,Black/African American,Not Span/Hispanic,17,Emergency,Home w/ Home Health Services,2018,MUS002,OSTEOMYELITIS,MST019,"MUSCLE, TENDON, BURSA, AND LIGAMENT EXCISION",317,"TENDON, MUSCLE & OTHER SOFT TISSUE PROCEDURES",08,DISEASES AND DISORDERS OF THE MUSCULOSKELETAL SYSTEM AND CONNECTIVE TISSUE,4,Extreme,Major,Surgical,"Managed Care, Unspecified",Medicaid,Self-Pay,,,true,255072.18,67577.11
New York City,Queens,7003004,003376,Cohen Children's Medical Center,0 to 17,112,M,Other Race,Not Span/Hispanic,2,Elective,Home or Self Care,2018,MAL008,MUSCULOSKELETAL CONGENITAL CONDITIONS,MST030,"MUSCULOSKELETAL PROCEDURES, NEC",317,"TENDON, MUSCLE & OTHER SOFT TISSUE PROCEDURES",08,DISEASES AND DISORDERS OF THE MUSCULOSKELETAL SYSTEM AND CONNECTIVE TISSUE,3,Major,Moderate,Surgical,Blue Cross/Blue Shield,Self-Pay,,,,false,37618.46,8393.16
Finger Lakes,Monroe,2701003,000411,Rochester General Hospital,50 to 69,144,F,White,Not Span/Hispanic,4,Elective,Home w/ Home Health Services,2018,NEO072,NEOPLASMS OF UNSPECIFIED NATURE OR UNCERTAIN BEHAVIOR,MST018,BONE EXCISION,317,"TENDON, MUSCLE & OTHER SOFT TISSUE PROCEDURES",08,DISEASES AND DISORDERS OF THE MUSCULOSKELETAL SYSTEM AND CONNECTIVE TISSUE,2,Moderate,Minor,Surgical,Blue Cross/Blue Shield,,,,,false,31476.7,13544.31
Long Island,Suffolk,5154000,000924,South Shore University Hospital,50 to 69,117,F,White,Not Span/Hispanic,2,Elective,Home or Self Care,2018,NEO024,SARCOMA,GNR008,"ABDOMINAL WALL PROCEDURES, NEC",317,"TENDON, MUSCLE & OTHER SOFT TISSUE PROCEDURES",08,DISEASES AND DISORDERS OF THE MUSCULOSKELETAL SYSTEM AND CONNECTIVE TISSUE,1,Minor,Minor,Surgical,Private Health Insurance,,,,,false,41074.29,9484.57
New York City,Queens,7003004,001638,Long Island Jewish Forest Hills,50 to 69,114,M,Black/African American,Not Span/Hispanic,5,Emergency,Home w/ Home Health Services,2018,INJ024,"SPRAINS AND STRAINS, INITIAL ENCOUNTER",MST022,"TENDON, MUSCLE, BURSA, AND LIGAMENT REPAIR (EXCLUDING PERINEAL)",317,"TENDON, MUSCLE & OTHER SOFT TISSUE PROCEDURES",08,DISEASES AND DISORDERS OF THE MUSCULOSKELETAL SYSTEM AND CONNECTIVE TISSUE,1,Minor,Minor,Surgical,Private Health Insurance,,,,,true,67070.29,13838.95
New York City,Manhattan,7002021,001454,Metropolitan Hospital Center,50 to 69,114,F,White,Not Span/Hispanic,13,Emergency,Skilled Nursing Home,2018,END003,DIABETES MELLITUS WITH COMPLICATION,MST005,INCISION AND DRAINAGE OF SUBCUTANEOUS TISSUE AND FASCIA,317,"TENDON, MUSCLE & OTHER SOFT TISSUE PROCEDURES",08,DISEASES AND DISORDERS OF THE MUSCULOSKELETAL SYSTEM AND CONNECTIVE TISSUE,3,Major,Moderate,Surgical,Medicaid,Medicaid,,,,false,64020.74,51725.56
Finger Lakes,Monroe,2701001,000409,Highland Hospital,50 to 69,146,M,White,Not Span/Hispanic,3,Emergency,Home or Self Care,2018,MUS025,OTHER SPECIFIED CONNECTIVE TISSUE DISEASE,MST020,SUBCUTANEOUS TISSUE AND FASCIA EXCISION,317,"TENDON, MUSCLE & OTHER SOFT TISSUE PROCEDURES",08,DISEASES AND DISORDERS OF THE MUSCULOSKELETAL SYSTEM AND CONNECTIVE TISSUE,2,Moderate,Moderate,Surgical,Private Health Insurance,Medicare,,,,true,16044.58,5763.33