Hospital Service Area,Hospital County,Operating Certificate Number,Permanent Facility Id,Facility Name,Age Group,Zip Code - 3 digits,Gender,Race,Ethnicity,Length of Stay,Type of Admission,Patient Disposition,Discharge Year,CCS Diagnosis Code,CCS Diagnosis Description,CCS Procedure Code,CCS Procedure Description,APR DRG Code,APR DRG Description,APR MDC Code,APR MDC Description,APR Severity of Illness Code,APR Severity of Illness Description,APR Risk of Mortality,APR Medical Surgical Description,Payment Typology 1,Payment Typology 2,Payment Typology 3,Birth Weight,Abortion Edit Indicator,Emergency Department Indicator,Total Charges,Total Costs
New York City,Kings,7002053,001304,NYU Langone Hospital-Brooklyn,70 or Older,112,F,Other Race,Not Span/Hispanic,12,Emergency,Skilled Nursing Home,2019,INJ035,"COMPLICATION OF INTERNAL ORTHOPEDIC DEVICE OR IMPLANT, INITIAL ENCOUNTER",MST020,SUBCUTANEOUS TISSUE AND FASCIA EXCISION,317,"TENDON, MUSCLE & OTHER SOFT TISSUE PROCEDURES",08,DISEASES AND DISORDERS OF THE MUSCULOSKELETAL SYSTEM AND CONNECTIVE TISSUE,2,Moderate,Moderate,Surgical,Medicare,Blue Cross/Blue Shield,,,,true,131485.26,46065.36
New York City,Kings,7002053,001304,NYU Langone Hospital-Brooklyn,30 to 49,112,M,Other Race,Spanish/Hispanic,2,Emergency,Home or Self Care,2019,INJ024,"SPRAINS AND STRAINS, INITIAL ENCOUNTER",MST022,"TENDON, MUSCLE, BURSA, AND LIGAMENT REPAIR (EXCLUDING PERINEAL)",317,"TENDON, MUSCLE & OTHER SOFT TISSUE PROCEDURES",08,DISEASES AND DISORDERS OF THE MUSCULOSKELETAL SYSTEM AND CONNECTIVE TISSUE,1,Minor,Minor,Surgical,Medicaid,,,,,true,48930.29,11685.45
New York City,Kings,7002053,001304,NYU Langone Hospital-Brooklyn,30 to 49,112,M,Other Race,Spanish/Hispanic,2,Emergency,Home or Self Care,2019,INJ024,"SPRAINS AND STRAINS, INITIAL ENCOUNTER",MST022,"TENDON, MUSCLE, BURSA, AND LIGAMENT REPAIR (EXCLUDING PERINEAL)",317,"TENDON, MUSCLE & OTHER SOFT TISSUE PROCEDURES",08,DISEASES AND DISORDERS OF THE MUSCULOSKELETAL SYSTEM AND CONNECTIVE TISSUE,1,Minor,Minor,Surgical,Medicaid,,,,,true,53904.48,12475
New York City,Kings,7002053,001304,NYU Langone Hospital-Brooklyn,50 to 69,112,M,White,Not Span/Hispanic,10,Emergency,Home or Self Care,2019,END003,DIABETES MELLITUS WITH COMPLICATION,MST005,INCISION AND DRAINAGE OF SUBCUTANEOUS TISSUE AND FASCIA,317,"TENDON, MUSCLE & OTHER SOFT TISSUE PROCEDURES",08,DISEASES AND DISORDERS OF THE MUSCULOSKELETAL SYSTEM AND CONNECTIVE TISSUE,3,Major,Moderate,Surgical,Medicare,Medicaid,,,,true,95115.79,34197.38
New York City,Kings,7002053,001304,NYU Langone Hospital-Brooklyn,70 or Older,112,F,White,Not Span/Hispanic,5,Emergency,Skilled Nursing Home,2019,MUS002,OSTEOMYELITIS,MST019,"MUSCLE, TENDON, BURSA, AND LIGAMENT EXCISION",317,"TENDON, MUSCLE & OTHER SOFT TISSUE PROCEDURES",08,DISEASES AND DISORDERS OF THE MUSCULOSKELETAL SYSTEM AND CONNECTIVE TISSUE,3,Major,Major,Surgical,Medicare,Medicaid,,,,true,63966.52,23991.01
New York City,Kings,7002053,001304,NYU Langone Hospital-Brooklyn,30 to 49,112,M,White,Not Span/Hispanic,5,Emergency,Home w/ Home Health Services,2019,INJ024,"SPRAINS AND STRAINS, INITIAL ENCOUNTER",MST020,SUBCUTANEOUS TISSUE AND FASCIA EXCISION,317,"TENDON, MUSCLE & OTHER SOFT TISSUE PROCEDURES",08,DISEASES AND DISORDERS OF THE MUSCULOSKELETAL SYSTEM AND CONNECTIVE TISSUE,1,Minor,Minor,Surgical,Miscellaneous/Other,,,,,true,122881.33,28733.49
New York City,Kings,7002053,001304,NYU Langone Hospital-Brooklyn,50 to 69,112,M,White,Not Span/Hispanic,4,Emergency,Inpatient Rehabilitation Facility,2019,INJ024,"SPRAINS AND STRAINS, INITIAL ENCOUNTER",MST022,"TENDON, MUSCLE, BURSA, AND LIGAMENT REPAIR (EXCLUDING PERINEAL)",317,"TENDON, MUSCLE & OTHER SOFT TISSUE PROCEDURES",08,DISEASES AND DISORDERS OF THE MUSCULOSKELETAL SYSTEM AND CONNECTIVE TISSUE,1,Minor,Minor,Surgical,Blue Cross/Blue Shield,,,,,true,94453.02,21671.42
New York City,Kings,7002053,001304,NYU Langone Hospital-Brooklyn,50 to 69,112,F,Other Race,Spanish/Hispanic,14,Emergency,Home w/ Home Health Services,2019,INJ037,"COMPLICATION OF OTHER SURGICAL OR MEDICAL CARE, INJURY, INITIAL ENCOUNTER",IMG002,FLUOROSCOPIC ANGIOGRAPHY (EXCLUDING CORONARY),317,"TENDON, MUSCLE & OTHER SOFT TISSUE PROCEDURES",08,DISEASES AND DISORDERS OF THE MUSCULOSKELETAL SYSTEM AND CONNECTIVE TISSUE,3,Major,Moderate,Surgical,Medicaid,,,,,true,321477.98,63229.62
New York City,Kings,7002053,001304,NYU Langone Hospital-Brooklyn,50 to 69,112,F,White,Unknown,7,Emergency,Home w/ Home Health Services,2019,END003,DIABETES MELLITUS WITH COMPLICATION,MST020,SUBCUTANEOUS TISSUE AND FASCIA EXCISION,317,"TENDON, MUSCLE & OTHER SOFT TISSUE PROCEDURES",08,DISEASES AND DISORDERS OF THE MUSCULOSKELETAL SYSTEM AND CONNECTIVE TISSUE,3,Major,Moderate,Surgical,Medicaid,,,,,true,98479.24,25485.85
New York City,Kings,7002053,001304,NYU Langone Hospital-Brooklyn,50 to 69,116,M,White,Not Span/Hispanic,7,Emergency,Home w/ Home Health Services,2019,INJ024,"SPRAINS AND STRAINS, INITIAL ENCOUNTER",MST022,"TENDON, MUSCLE, BURSA, AND LIGAMENT REPAIR (EXCLUDING PERINEAL)",317,"TENDON, MUSCLE & OTHER SOFT TISSUE PROCEDURES",08,DISEASES AND DISORDERS OF THE MUSCULOSKELETAL SYSTEM AND CONNECTIVE TISSUE,1,Minor,Minor,Surgical,Private Health Insurance,,,,,true,130440.96,34079.26
New York City,Kings,7002053,001304,NYU Langone Hospital-Brooklyn,30 to 49,112,M,Other Race,Not Span/Hispanic,10,Emergency,Home or Self Care,2019,INJ026,OTHER SPECIFIED INJURY,MST030,"MUSCULOSKELETAL PROCEDURES, NEC",317,"TENDON, MUSCLE & OTHER SOFT TISSUE PROCEDURES",08,DISEASES AND DISORDERS OF THE MUSCULOSKELETAL SYSTEM AND CONNECTIVE TISSUE,3,Major,Major,Surgical,Private Health Insurance,,,,,true,207012.26,50801.15
New York City,Kings,7002053,001304,NYU Langone Hospital-Brooklyn,70 or Older,112,M,White,Not Span/Hispanic,7,Emergency,Skilled Nursing Home,2019,INJ024,"SPRAINS AND STRAINS, INITIAL ENCOUNTER",MST022,"TENDON, MUSCLE, BURSA, AND LIGAMENT REPAIR (EXCLUDING PERINEAL)",317,"TENDON, MUSCLE & OTHER SOFT TISSUE PROCEDURES",08,DISEASES AND DISORDERS OF THE MUSCULOSKELETAL SYSTEM AND CONNECTIVE TISSUE,2,Moderate,Moderate,Surgical,Medicare,Blue Cross/Blue Shield,,,,true,148179.38,42947.06
New York City,Kings,7002053,001304,NYU Langone Hospital-Brooklyn,30 to 49,112,F,Black/African American,Not Span/Hispanic,4,Emergency,Home w/ Home Health Services,2019,END003,DIABETES MELLITUS WITH COMPLICATION,MST020,SUBCUTANEOUS TISSUE AND FASCIA EXCISION,317,"TENDON, MUSCLE & OTHER SOFT TISSUE PROCEDURES",08,DISEASES AND DISORDERS OF THE MUSCULOSKELETAL SYSTEM AND CONNECTIVE TISSUE,3,Major,Moderate,Surgical,Medicaid,,,,,true,97758.2,20773.15
New York City,Kings,7002053,001304,NYU Langone Hospital-Brooklyn,70 or Older,112,M,White,Not Span/Hispanic,6,Emergency,Skilled Nursing Home,2019,END003,DIABETES MELLITUS WITH COMPLICATION,MST005,INCISION AND DRAINAGE OF SUBCUTANEOUS TISSUE AND FASCIA,317,"TENDON, MUSCLE & OTHER SOFT TISSUE PROCEDURES",08,DISEASES AND DISORDERS OF THE MUSCULOSKELETAL SYSTEM AND CONNECTIVE TISSUE,3,Major,Major,Surgical,Medicare,Medicare,,,,true,120752.51,30420.37
New York City,Kings,7002053,001304,NYU Langone Hospital-Brooklyn,70 or Older,112,M,Other Race,Not Span/Hispanic,6,Emergency,Skilled Nursing Home,2019,NEO024,SARCOMA,MST003,"SUBCUTANEOUS TISSUE, FASCIA, AND MUSCLE BIOPSY",317,"TENDON, MUSCLE & OTHER SOFT TISSUE PROCEDURES",08,DISEASES AND DISORDERS OF THE MUSCULOSKELETAL SYSTEM AND CONNECTIVE TISSUE,2,Moderate,Minor,Surgical,Medicare,,,,,true,117170.45,30049.49
New York City,Kings,7002053,001304,NYU Langone Hospital-Brooklyn,70 or Older,112,M,White,Not Span/Hispanic,4,Emergency,Skilled Nursing Home,2019,INJ024,"SPRAINS AND STRAINS, INITIAL ENCOUNTER",MST022,"TENDON, MUSCLE, BURSA, AND LIGAMENT REPAIR (EXCLUDING PERINEAL)",317,"TENDON, MUSCLE & OTHER SOFT TISSUE PROCEDURES",08,DISEASES AND DISORDERS OF THE MUSCULOSKELETAL SYSTEM AND CONNECTIVE TISSUE,1,Minor,Moderate,Surgical,Medicare,Blue Cross/Blue Shield,,,,true,81568.54,20784.31
New York City,Kings,7002053,001304,NYU Langone Hospital-Brooklyn,50 to 69,113,M,Black/African American,Not Span/Hispanic,3,Emergency,Home w/ Home Health Services,2019,INJ024,"SPRAINS AND STRAINS, INITIAL ENCOUNTER",MST022,"TENDON, MUSCLE, BURSA, AND LIGAMENT REPAIR (EXCLUDING PERINEAL)",317,"TENDON, MUSCLE & OTHER SOFT TISSUE PROCEDURES",08,DISEASES AND DISORDERS OF THE MUSCULOSKELETAL SYSTEM AND CONNECTIVE TISSUE,1,Minor,Minor,Surgical,Private Health Insurance,,,,,true,236494.68,27576.37
New York City,Kings,7002053,001304,NYU Langone Hospital-Brooklyn,50 to 69,112,M,Black/African American,Not Span/Hispanic,3,Emergency,Home w/ Home Health Services,2019,INJ024,"SPRAINS AND STRAINS, INITIAL ENCOUNTER",MST022,"TENDON, MUSCLE, BURSA, AND LIGAMENT REPAIR (EXCLUDING PERINEAL)",317,"TENDON, MUSCLE & OTHER SOFT TISSUE PROCEDURES",08,DISEASES AND DISORDERS OF THE MUSCULOSKELETAL SYSTEM AND CONNECTIVE TISSUE,1,Minor,Minor,Surgical,Blue Cross/Blue Shield,,,,,true,86927.44,18246.96
New York City,Kings,7002053,001304,NYU Langone Hospital-Brooklyn,30 to 49,100,M,Black/African American,Not Span/Hispanic,1,Emergency,Home or Self Care,2019,INJ024,"SPRAINS AND STRAINS, INITIAL ENCOUNTER",MST022,"TENDON, MUSCLE, BURSA, AND LIGAMENT REPAIR (EXCLUDING PERINEAL)",317,"TENDON, MUSCLE & OTHER SOFT TISSUE PROCEDURES",08,DISEASES AND DISORDERS OF THE MUSCULOSKELETAL SYSTEM AND CONNECTIVE TISSUE,1,Minor,Minor,Surgical,Private Health Insurance,,,,,true,52071.62,9714.35
New York City,Kings,7002053,001304,NYU Langone Hospital-Brooklyn,70 or Older,112,M,White,Not Span/Hispanic,8,Emergency,Skilled Nursing Home,2019,INJ024,"SPRAINS AND STRAINS, INITIAL ENCOUNTER",MST022,"TENDON, MUSCLE, BURSA, AND LIGAMENT REPAIR (EXCLUDING PERINEAL)",317,"TENDON, MUSCLE & OTHER SOFT TISSUE PROCEDURES",08,DISEASES AND DISORDERS OF THE MUSCULOSKELETAL SYSTEM AND CONNECTIVE TISSUE,3,Major,Major,Surgical,Medicaid,,,,,true,171794.59,36333.27
New York City,Kings,7002053,001304,NYU Langone Hospital-Brooklyn,50 to 69,112,M,White,Not Span/Hispanic,7,Emergency,Home or Self Care,2019,END003,DIABETES MELLITUS WITH COMPLICATION,MST019,"MUSCLE, TENDON, BURSA, AND LIGAMENT EXCISION",317,"TENDON, MUSCLE & OTHER SOFT TISSUE PROCEDURES",08,DISEASES AND DISORDERS OF THE MUSCULOSKELETAL SYSTEM AND CONNECTIVE TISSUE,2,Moderate,Minor,Surgical,Blue Cross/Blue Shield,,,,,true,79090.81,24490.13
New York City,Kings,7002053,001304,NYU Langone Hospital-Brooklyn,70 or Older,112,M,White,Not Span/Hispanic,4,Emergency,Inpatient Rehabilitation Facility,2019,INJ003,"FRACTURE OF TORSO, INITIAL ENCOUNTER",MST022,"TENDON, MUSCLE, BURSA, AND LIGAMENT REPAIR (EXCLUDING PERINEAL)",317,"TENDON, MUSCLE & OTHER SOFT TISSUE PROCEDURES",08,DISEASES AND DISORDERS OF THE MUSCULOSKELETAL SYSTEM AND CONNECTIVE TISSUE,3,Major,Major,Surgical,Medicare,Blue Cross/Blue Shield,,,,true,146337.09,30367.45
New York City,Kings,7002053,001304,NYU Langone Hospital-Brooklyn,50 to 69,112,F,Other Race,Not Span/Hispanic,3,Emergency,Home w/ Home Health Services,2019,INJ005,"FRACTURE OF THE LOWER LIMB (EXCEPT HIP), INITIAL ENCOUNTER",MST022,"TENDON, MUSCLE, BURSA, AND LIGAMENT REPAIR (EXCLUDING PERINEAL)",317,"TENDON, MUSCLE & OTHER SOFT TISSUE PROCEDURES",08,DISEASES AND DISORDERS OF THE MUSCULOSKELETAL SYSTEM AND CONNECTIVE TISSUE,1,Minor,Minor,Surgical,Miscellaneous/Other,,,,,true,81778.37,18712.23
New York City,Kings,7002053,001304,NYU Langone Hospital-Brooklyn,50 to 69,112,M,White,Spanish/Hispanic,1,Emergency,Home w/ Home Health Services,2019,INJ005,"FRACTURE OF THE LOWER LIMB (EXCEPT HIP), INITIAL ENCOUNTER",MST011,FIXATION OF LEG AND FOOT BONES,317,"TENDON, MUSCLE & OTHER SOFT TISSUE PROCEDURES",08,DISEASES AND DISORDERS OF THE MUSCULOSKELETAL SYSTEM AND CONNECTIVE TISSUE,1,Minor,Minor,Surgical,Medicaid,,,,,true,72302.1,11950.4
New York City,Kings,7002053,001304,NYU Langone Hospital-Brooklyn,70 or Older,112,M,Other Race,Not Span/Hispanic,18,Emergency,Hospice - Home,2019,MUS002,OSTEOMYELITIS,MST019,"MUSCLE, TENDON, BURSA, AND LIGAMENT EXCISION",317,"TENDON, MUSCLE & OTHER SOFT TISSUE PROCEDURES",08,DISEASES AND DISORDERS OF THE MUSCULOSKELETAL SYSTEM AND CONNECTIVE TISSUE,4,Extreme,Major,Surgical,Private Health Insurance,Medicaid,,,,true,159688.53,63107.81
New York City,Kings,7002053,001304,NYU Langone Hospital-Brooklyn,70 or Older,112,F,White,Not Span/Hispanic,6,Emergency,Skilled Nursing Home,2019,INJ025,"INJURY TO NERVES, MUSCLES AND TENDONS, INITIAL ENCOUNTER",MST030,"MUSCULOSKELETAL PROCEDURES, NEC",317,"TENDON, MUSCLE & OTHER SOFT TISSUE PROCEDURES",08,DISEASES AND DISORDERS OF THE MUSCULOSKELETAL SYSTEM AND CONNECTIVE TISSUE,2,Moderate,Major,Surgical,Medicare,,,,,true,148434.57,27909.19
New York City,Kings,7002053,001304,NYU Langone Hospital-Brooklyn,50 to 69,103,F,Black/African American,Not Span/Hispanic,7,Emergency,Home w/ Home Health Services,2019,MUS025,OTHER SPECIFIED CONNECTIVE TISSUE DISEASE,MST005,INCISION AND DRAINAGE OF SUBCUTANEOUS TISSUE AND FASCIA,317,"TENDON, MUSCLE & OTHER SOFT TISSUE PROCEDURES",08,DISEASES AND DISORDERS OF THE MUSCULOSKELETAL SYSTEM AND CONNECTIVE TISSUE,3,Major,Moderate,Surgical,Medicaid,,,,,true,255101.38,34141.51
New York City,Kings,7002053,001304,NYU Langone Hospital-Brooklyn,30 to 49,112,F,Black/African American,Not Span/Hispanic,2,Elective,Home w/ Home Health Services,2019,NEO072,NEOPLASMS OF UNSPECIFIED NATURE OR UNCERTAIN BEHAVIOR,GNR008,"ABDOMINAL WALL PROCEDURES, NEC",317,"TENDON, MUSCLE & OTHER SOFT TISSUE PROCEDURES",08,DISEASES AND DISORDERS OF THE MUSCULOSKELETAL SYSTEM AND CONNECTIVE TISSUE,1,Minor,Minor,Surgical,Medicaid,,,,,false,133756.33,17553.14
New York City,Kings,7002053,001304,NYU Langone Hospital-Brooklyn,50 to 69,112,M,White,Not Span/Hispanic,11,Emergency,Home w/ Home Health Services,2019,MUS025,OTHER SPECIFIED CONNECTIVE TISSUE DISEASE,MST030,"MUSCULOSKELETAL PROCEDURES, NEC",317,"TENDON, MUSCLE & OTHER SOFT TISSUE PROCEDURES",08,DISEASES AND DISORDERS OF THE MUSCULOSKELETAL SYSTEM AND CONNECTIVE TISSUE,3,Major,Moderate,Surgical,Medicare,,,,,true,236569.29,55356.64
New York City,Kings,7002053,001304,NYU Langone Hospital-Brooklyn,70 or Older,112,M,Other Race,Spanish/Hispanic,12,Elective,Home w/ Home Health Services,2019,NEO024,SARCOMA,MRS005,MALE PERINEUM PROCEDURES,317,"TENDON, MUSCLE & OTHER SOFT TISSUE PROCEDURES",08,DISEASES AND DISORDERS OF THE MUSCULOSKELETAL SYSTEM AND CONNECTIVE TISSUE,2,Moderate,Moderate,Surgical,Medicare,,,,,false,373415.3,83119.78
