Hospital Service Area,Hospital County,Operating Certificate Number,Permanent Facility Id,Facility Name,Age Group,Zip Code - 3 digits,Gender,Race,Ethnicity,Length of Stay,Type of Admission,Patient Disposition,Discharge Year,CCS Diagnosis Code,CCS Diagnosis Description,CCS Procedure Code,CCS Procedure Description,APR DRG Code,APR DRG Description,APR MDC Code,APR MDC Description,APR Severity of Illness Code,APR Severity of Illness Description,APR Risk of Mortality,APR Medical Surgical Description,Payment Typology 1,Payment Typology 2,Payment Typology 3,Birth Weight,Abortion Edit Indicator,Emergency Department Indicator,Total Charges,Total Costs
Hudson Valley,Rockland,4329000,000779,Good Samaritan Hospital of Suffern,70 or Older,109,M,White,Not Span/Hispanic,5,Emergency,Inpatient Rehabilitation Facility,2020,MUS011,SPONDYLOPATHIES/SPONDYLOARTHROPATHY (INCLUDING INFECTIVE),PNS001,LUMBOSACRAL NERVE DECOMPRESSION,320,OTHER MUSCULOSKELETAL SYSTEM & CONNECTIVE TISSUE PROCEDURES,08,DISEASES AND DISORDERS OF THE MUSCULOSKELETAL SYSTEM AND CONNECTIVE TISSUE,1,Minor,Moderate,Surgical,Medicare,,,,,Y,126515.1,16808.58
New York City,Manhattan,7002024,001456,Mount Sinai Hospital,50 to 69,100,F,White,Not Span/Hispanic,3,Elective,Home w/ Home Health Services,2020,MUS011,SPONDYLOPATHIES/SPONDYLOARTHROPATHY (INCLUDING INFECTIVE),PNS001,LUMBOSACRAL NERVE DECOMPRESSION,320,OTHER MUSCULOSKELETAL SYSTEM & CONNECTIVE TISSUE PROCEDURES,08,DISEASES AND DISORDERS OF THE MUSCULOSKELETAL SYSTEM AND CONNECTIVE TISSUE,2,Moderate,Minor,Surgical,Blue Cross/Blue Shield,Self-Pay,,,,N,58814.67,16342.18
New York City,Bronx,7000006,001169,Montefiore Medical Center - Henry & Lucy Moses Div,70 or Older,104,F,Other Race,Spanish/Hispanic,4,Emergency,Home or Self Care,2020,INJ002,"FRACTURE OF THE SPINE AND BACK, INITIAL ENCOUNTER",MST029,"MUSCULOSKELETAL DEVICE PROCEDURES, NEC",320,OTHER MUSCULOSKELETAL SYSTEM & CONNECTIVE TISSUE PROCEDURES,08,DISEASES AND DISORDERS OF THE MUSCULOSKELETAL SYSTEM AND CONNECTIVE TISSUE,2,Moderate,Moderate,Surgical,Medicare,Medicaid,,,,Y,73467.72,13775.54
New York City,Bronx,7000006,001169,Montefiore Medical Center - Henry & Lucy Moses Div,50 to 69,104,F,Other Race,Not Span/Hispanic,1,Elective,Home or Self Care,2020,MUS011,SPONDYLOPATHIES/SPONDYLOARTHROPATHY (INCLUDING INFECTIVE),PNS001,LUMBOSACRAL NERVE DECOMPRESSION,320,OTHER MUSCULOSKELETAL SYSTEM & CONNECTIVE TISSUE PROCEDURES,08,DISEASES AND DISORDERS OF THE MUSCULOSKELETAL SYSTEM AND CONNECTIVE TISSUE,2,Moderate,Minor,Surgical,Medicaid,,,,,N,55848.31,10967.02
New York City,Manhattan,7002024,001456,Mount Sinai Hospital,0 to 17,114,M,Other Race,Spanish/Hispanic,2,Elective,Home or Self Care,2020,MUS011,SPONDYLOPATHIES/SPONDYLOARTHROPATHY (INCLUDING INFECTIVE),PNS002,CERVICOTHORACIC NERVE DECOMPRESSION,320,OTHER MUSCULOSKELETAL SYSTEM & CONNECTIVE TISSUE PROCEDURES,08,DISEASES AND DISORDERS OF THE MUSCULOSKELETAL SYSTEM AND CONNECTIVE TISSUE,2,Moderate,Minor,Surgical,Medicaid,Self-Pay,,,,N,76319.4,20112.93
New York City,Manhattan,7002012,001447,Hospital for Special Surgery,0 to 17,117,F,Other Race,Not Span/Hispanic,4,Elective,Home or Self Care,2020,MAL008,MUSCULOSKELETAL CONGENITAL CONDITIONS,MST012,BONE FIXATION (EXCLUDING EXTREMITIES),320,OTHER MUSCULOSKELETAL SYSTEM & CONNECTIVE TISSUE PROCEDURES,08,DISEASES AND DISORDERS OF THE MUSCULOSKELETAL SYSTEM AND CONNECTIVE TISSUE,2,Moderate,Minor,Surgical,Private Health Insurance,,,,,N,71136,31105.66
New York City,Manhattan,7002054,003975,New York Presbyterian Hospital - Allen Hospital,70 or Older,OOS,M,Other Race,Not Span/Hispanic,1,Elective,Home or Self Care,2020,MUS011,SPONDYLOPATHIES/SPONDYLOARTHROPATHY (INCLUDING INFECTIVE),PNS001,LUMBOSACRAL NERVE DECOMPRESSION,320,OTHER MUSCULOSKELETAL SYSTEM & CONNECTIVE TISSUE PROCEDURES,08,DISEASES AND DISORDERS OF THE MUSCULOSKELETAL SYSTEM AND CONNECTIVE TISSUE,2,Moderate,Minor,Surgical,Medicare,Private Health Insurance,Self-Pay,,,N,55198.31,16765.07
New York City,Manhattan,7002054,003975,New York Presbyterian Hospital - Allen Hospital,70 or Older,109,F,White,Not Span/Hispanic,1,Emergency,Home or Self Care,2020,MUS011,SPONDYLOPATHIES/SPONDYLOARTHROPATHY (INCLUDING INFECTIVE),PNS001,LUMBOSACRAL NERVE DECOMPRESSION,320,OTHER MUSCULOSKELETAL SYSTEM & CONNECTIVE TISSUE PROCEDURES,08,DISEASES AND DISORDERS OF THE MUSCULOSKELETAL SYSTEM AND CONNECTIVE TISSUE,1,Minor,Minor,Surgical,Private Health Insurance,Self-Pay,,,,N,41799.26,13592.25
New York City,Manhattan,7002054,003975,New York Presbyterian Hospital - Allen Hospital,50 to 69,117,M,Other Race,Not Span/Hispanic,1,Emergency,Home or Self Care,2020,MUS011,SPONDYLOPATHIES/SPONDYLOARTHROPATHY (INCLUDING INFECTIVE),PNS001,LUMBOSACRAL NERVE DECOMPRESSION,320,OTHER MUSCULOSKELETAL SYSTEM & CONNECTIVE TISSUE PROCEDURES,08,DISEASES AND DISORDERS OF THE MUSCULOSKELETAL SYSTEM AND CONNECTIVE TISSUE,1,Minor,Minor,Surgical,Private Health Insurance,Self-Pay,,,,N,48596.96,15264.72
New York City,Manhattan,7002054,003975,New York Presbyterian Hospital - Allen Hospital,50 to 69,100,M,White,Not Span/Hispanic,1,Elective,Home or Self Care,2020,MUS011,SPONDYLOPATHIES/SPONDYLOARTHROPATHY (INCLUDING INFECTIVE),PNS001,LUMBOSACRAL NERVE DECOMPRESSION,320,OTHER MUSCULOSKELETAL SYSTEM & CONNECTIVE TISSUE PROCEDURES,08,DISEASES AND DISORDERS OF THE MUSCULOSKELETAL SYSTEM AND CONNECTIVE TISSUE,2,Moderate,Moderate,Surgical,Medicare,Blue Cross/Blue Shield,Self-Pay,,,N,46032.92,13256.9
New York City,Manhattan,7002012,001447,Hospital for Special Surgery,70 or Older,OOS,M,White,Not Span/Hispanic,1,Elective,Home w/ Home Health Services,2020,MUS011,SPONDYLOPATHIES/SPONDYLOARTHROPATHY (INCLUDING INFECTIVE),PNS001,LUMBOSACRAL NERVE DECOMPRESSION,320,OTHER MUSCULOSKELETAL SYSTEM & CONNECTIVE TISSUE PROCEDURES,08,DISEASES AND DISORDERS OF THE MUSCULOSKELETAL SYSTEM AND CONNECTIVE TISSUE,1,Minor,Minor,Surgical,Private Health Insurance,,,,,N,36820,14022.78
New York City,Manhattan,7002012,001447,Hospital for Special Surgery,70 or Older,OOS,M,Other Race,Spanish/Hispanic,1,Elective,Home or Self Care,2020,MUS011,SPONDYLOPATHIES/SPONDYLOARTHROPATHY (INCLUDING INFECTIVE),PNS001,LUMBOSACRAL NERVE DECOMPRESSION,320,OTHER MUSCULOSKELETAL SYSTEM & CONNECTIVE TISSUE PROCEDURES,08,DISEASES AND DISORDERS OF THE MUSCULOSKELETAL SYSTEM AND CONNECTIVE TISSUE,1,Minor,Minor,Surgical,Blue Cross/Blue Shield,Medicare,,,,N,35954,15944.84
New York City,Manhattan,7002012,001447,Hospital for Special Surgery,50 to 69,108,M,White,Not Span/Hispanic,2,Elective,Home w/ Home Health Services,2020,MUS011,SPONDYLOPATHIES/SPONDYLOARTHROPATHY (INCLUDING INFECTIVE),PNS001,LUMBOSACRAL NERVE DECOMPRESSION,320,OTHER MUSCULOSKELETAL SYSTEM & CONNECTIVE TISSUE PROCEDURES,08,DISEASES AND DISORDERS OF THE MUSCULOSKELETAL SYSTEM AND CONNECTIVE TISSUE,2,Moderate,Minor,Surgical,Private Health Insurance,,,,,N,48456,20171.94
New York City,Manhattan,7002012,001447,Hospital for Special Surgery,50 to 69,125,M,White,Not Span/Hispanic,1,Elective,Home or Self Care,2020,MUS011,SPONDYLOPATHIES/SPONDYLOARTHROPATHY (INCLUDING INFECTIVE),PNS001,LUMBOSACRAL NERVE DECOMPRESSION,320,OTHER MUSCULOSKELETAL SYSTEM & CONNECTIVE TISSUE PROCEDURES,08,DISEASES AND DISORDERS OF THE MUSCULOSKELETAL SYSTEM AND CONNECTIVE TISSUE,1,Minor,Minor,Surgical,Miscellaneous/Other,,,,,N,37542,14945.37
New York City,Manhattan,7002012,001447,Hospital for Special Surgery,50 to 69,110,M,White,Not Span/Hispanic,1,Elective,Home or Self Care,2020,MUS011,SPONDYLOPATHIES/SPONDYLOARTHROPATHY (INCLUDING INFECTIVE),PNS001,LUMBOSACRAL NERVE DECOMPRESSION,320,OTHER MUSCULOSKELETAL SYSTEM & CONNECTIVE TISSUE PROCEDURES,08,DISEASES AND DISORDERS OF THE MUSCULOSKELETAL SYSTEM AND CONNECTIVE TISSUE,1,Minor,Minor,Surgical,Blue Cross/Blue Shield,,,,,N,32519,14885.04
New York City,Manhattan,7002012,001447,Hospital for Special Surgery,50 to 69,,M,White,Spanish/Hispanic,1,Elective,Home or Self Care,2020,MUS011,SPONDYLOPATHIES/SPONDYLOARTHROPATHY (INCLUDING INFECTIVE),PNS001,LUMBOSACRAL NERVE DECOMPRESSION,320,OTHER MUSCULOSKELETAL SYSTEM & CONNECTIVE TISSUE PROCEDURES,08,DISEASES AND DISORDERS OF THE MUSCULOSKELETAL SYSTEM AND CONNECTIVE TISSUE,1,Minor,Minor,Surgical,Blue Cross/Blue Shield,,,,,N,35827,15955.54
New York City,Manhattan,7002012,001447,Hospital for Special Surgery,30 to 49,OOS,F,White,Not Span/Hispanic,1,Elective,Home or Self Care,2020,INJ035,"COMPLICATION OF INTERNAL ORTHOPEDIC DEVICE OR IMPLANT, INITIAL ENCOUNTER",MST012,BONE FIXATION (EXCLUDING EXTREMITIES),320,OTHER MUSCULOSKELETAL SYSTEM & CONNECTIVE TISSUE PROCEDURES,08,DISEASES AND DISORDERS OF THE MUSCULOSKELETAL SYSTEM AND CONNECTIVE TISSUE,1,Minor,Minor,Surgical,Blue Cross/Blue Shield,,,,,N,37213,14019.02
New York City,Manhattan,7002012,001447,Hospital for Special Surgery,30 to 49,OOS,F,Other Race,Spanish/Hispanic,3,Elective,Home or Self Care,2020,MAL008,MUSCULOSKELETAL CONGENITAL CONDITIONS,MST012,BONE FIXATION (EXCLUDING EXTREMITIES),320,OTHER MUSCULOSKELETAL SYSTEM & CONNECTIVE TISSUE PROCEDURES,08,DISEASES AND DISORDERS OF THE MUSCULOSKELETAL SYSTEM AND CONNECTIVE TISSUE,2,Moderate,Minor,Surgical,Blue Cross/Blue Shield,,,,,N,63362,26859.93
New York City,Manhattan,7002012,001447,Hospital for Special Surgery,50 to 69,100,F,Other Race,Not Span/Hispanic,2,Elective,Home or Self Care,2020,MUS011,SPONDYLOPATHIES/SPONDYLOARTHROPATHY (INCLUDING INFECTIVE),PNS001,LUMBOSACRAL NERVE DECOMPRESSION,320,OTHER MUSCULOSKELETAL SYSTEM & CONNECTIVE TISSUE PROCEDURES,08,DISEASES AND DISORDERS OF THE MUSCULOSKELETAL SYSTEM AND CONNECTIVE TISSUE,2,Moderate,Minor,Surgical,Private Health Insurance,,,,,N,54101,21498.07
New York City,Manhattan,7002012,001447,Hospital for Special Surgery,50 to 69,OOS,M,White,Not Span/Hispanic,1,Elective,Home or Self Care,2020,INJ035,"COMPLICATION OF INTERNAL ORTHOPEDIC DEVICE OR IMPLANT, INITIAL ENCOUNTER",MST012,BONE FIXATION (EXCLUDING EXTREMITIES),320,OTHER MUSCULOSKELETAL SYSTEM & CONNECTIVE TISSUE PROCEDURES,08,DISEASES AND DISORDERS OF THE MUSCULOSKELETAL SYSTEM AND CONNECTIVE TISSUE,1,Minor,Minor,Surgical,Medicare,Blue Cross/Blue Shield,,,,N,31930,10707.33
New York City,Manhattan,7002012,001447,Hospital for Special Surgery,50 to 69,117,F,White,Not Span/Hispanic,10,Elective,Home w/ Home Health Services,2020,MUS015,"PATHOLOGICAL FRACTURE, SUBSEQUENT ENCOUNTER",MST012,BONE FIXATION (EXCLUDING EXTREMITIES),320,OTHER MUSCULOSKELETAL SYSTEM & CONNECTIVE TISSUE PROCEDURES,08,DISEASES AND DISORDERS OF THE MUSCULOSKELETAL SYSTEM AND CONNECTIVE TISSUE,2,Moderate,Minor,Surgical,Medicare,Private Health Insurance,,,,N,112703,56728
New York City,Manhattan,7002012,001447,Hospital for Special Surgery,50 to 69,100,M,White,Not Span/Hispanic,1,Elective,Home or Self Care,2020,MUS011,SPONDYLOPATHIES/SPONDYLOARTHROPATHY (INCLUDING INFECTIVE),PNS002,CERVICOTHORACIC NERVE DECOMPRESSION,320,OTHER MUSCULOSKELETAL SYSTEM & CONNECTIVE TISSUE PROCEDURES,08,DISEASES AND DISORDERS OF THE MUSCULOSKELETAL SYSTEM AND CONNECTIVE TISSUE,2,Moderate,Minor,Surgical,Private Health Insurance,,,,,N,47911,20078.41
New York City,Manhattan,7002054,001464,New York-Presbyterian Hospital - Columbia Presbyterian Center,70 or Older,105,M,White,Not Span/Hispanic,4,Elective,Home w/ Home Health Services,2020,INJ035,"COMPLICATION OF INTERNAL ORTHOPEDIC DEVICE OR IMPLANT, INITIAL ENCOUNTER",MST030,"MUSCULOSKELETAL PROCEDURES, NEC",320,OTHER MUSCULOSKELETAL SYSTEM & CONNECTIVE TISSUE PROCEDURES,08,DISEASES AND DISORDERS OF THE MUSCULOSKELETAL SYSTEM AND CONNECTIVE TISSUE,2,Moderate,Moderate,Surgical,Medicare,Private Health Insurance,Self-Pay,,,N,110852.83,32603.62
New York City,Manhattan,7002012,001447,Hospital for Special Surgery,50 to 69,OOS,M,White,Not Span/Hispanic,1,Elective,Home or Self Care,2020,MUS011,SPONDYLOPATHIES/SPONDYLOARTHROPATHY (INCLUDING INFECTIVE),PNS001,LUMBOSACRAL NERVE DECOMPRESSION,320,OTHER MUSCULOSKELETAL SYSTEM & CONNECTIVE TISSUE PROCEDURES,08,DISEASES AND DISORDERS OF THE MUSCULOSKELETAL SYSTEM AND CONNECTIVE TISSUE,1,Minor,Minor,Surgical,Private Health Insurance,,,,,N,40000,14981.33
New York City,Manhattan,7002012,001447,Hospital for Special Surgery,0 to 17,OOS,F,White,Spanish/Hispanic,2,Elective,Home or Self Care,2020,MAL008,MUSCULOSKELETAL CONGENITAL CONDITIONS,MST012,BONE FIXATION (EXCLUDING EXTREMITIES),320,OTHER MUSCULOSKELETAL SYSTEM & CONNECTIVE TISSUE PROCEDURES,08,DISEASES AND DISORDERS OF THE MUSCULOSKELETAL SYSTEM AND CONNECTIVE TISSUE,1,Minor,Minor,Surgical,Blue Cross/Blue Shield,,,,,N,54790,22147.22
New York City,Manhattan,7002012,001447,Hospital for Special Surgery,70 or Older,OOS,F,White,Not Span/Hispanic,1,Elective,Home w/ Home Health Services,2020,INJ035,"COMPLICATION OF INTERNAL ORTHOPEDIC DEVICE OR IMPLANT, INITIAL ENCOUNTER",MST012,BONE FIXATION (EXCLUDING EXTREMITIES),320,OTHER MUSCULOSKELETAL SYSTEM & CONNECTIVE TISSUE PROCEDURES,08,DISEASES AND DISORDERS OF THE MUSCULOSKELETAL SYSTEM AND CONNECTIVE TISSUE,1,Minor,Minor,Surgical,Medicare,Blue Cross/Blue Shield,,,,N,34097,15048.86
New York City,Manhattan,7002054,001464,New York-Presbyterian Hospital - Columbia Presbyterian Center,0 to 17,116,M,Black/African American,Not Span/Hispanic,3,Elective,Home or Self Care,2020,MUS007,OTHER SPECIFIED JOINT DISORDERS,MST012,BONE FIXATION (EXCLUDING EXTREMITIES),320,OTHER MUSCULOSKELETAL SYSTEM & CONNECTIVE TISSUE PROCEDURES,08,DISEASES AND DISORDERS OF THE MUSCULOSKELETAL SYSTEM AND CONNECTIVE TISSUE,2,Moderate,Minor,Surgical,Private Health Insurance,Self-Pay,,,,N,74602.46,21319.34
New York City,Manhattan,7002012,001447,Hospital for Special Surgery,70 or Older,OOS,F,White,Not Span/Hispanic,7,Urgent,Inpatient Rehabilitation Facility,2020,MUS014,"PATHOLOGICAL FRACTURE, INITIAL ENCOUNTER",MST012,BONE FIXATION (EXCLUDING EXTREMITIES),320,OTHER MUSCULOSKELETAL SYSTEM & CONNECTIVE TISSUE PROCEDURES,08,DISEASES AND DISORDERS OF THE MUSCULOSKELETAL SYSTEM AND CONNECTIVE TISSUE,2,Moderate,Minor,Surgical,Medicare,Private Health Insurance,,,,N,133909,54091.36
New York City,Manhattan,7002012,001447,Hospital for Special Surgery,70 or Older,100,F,Other Race,Not Span/Hispanic,2,Elective,Home w/ Home Health Services,2020,MUS011,SPONDYLOPATHIES/SPONDYLOARTHROPATHY (INCLUDING INFECTIVE),PNS001,LUMBOSACRAL NERVE DECOMPRESSION,320,OTHER MUSCULOSKELETAL SYSTEM & CONNECTIVE TISSUE PROCEDURES,08,DISEASES AND DISORDERS OF THE MUSCULOSKELETAL SYSTEM AND CONNECTIVE TISSUE,2,Moderate,Minor,Surgical,Medicare,,,,,N,58938,23570.09
New York City,Manhattan,7002024,001456,Mount Sinai Hospital,70 or Older,OOS,M,White,Not Span/Hispanic,8,Elective,Home w/ Home Health Services,2020,NEO070,SECONDARY MALIGNANCIES,MST029,"MUSCULOSKELETAL DEVICE PROCEDURES, NEC",320,OTHER MUSCULOSKELETAL SYSTEM & CONNECTIVE TISSUE PROCEDURES,08,DISEASES AND DISORDERS OF THE MUSCULOSKELETAL SYSTEM AND CONNECTIVE TISSUE,2,Moderate,Major,Surgical,Medicare,Private Health Insurance,Self-Pay,,,N,149899.25,40287.74
New York City,Queens,7003010,001637,New York - Presbyterian/Queens,50 to 69,113,F,Other Race,Not Span/Hispanic,3,Emergency,Home w/ Home Health Services,2020,INJ005,"FRACTURE OF THE LOWER LIMB (EXCEPT HIP), INITIAL ENCOUNTER",MST011,FIXATION OF LEG AND FOOT BONES,320,OTHER MUSCULOSKELETAL SYSTEM & CONNECTIVE TISSUE PROCEDURES,08,DISEASES AND DISORDERS OF THE MUSCULOSKELETAL SYSTEM AND CONNECTIVE TISSUE,1,Minor,Minor,Surgical,Medicare,Medicare,Medicaid,,,Y,35087.61,10135.17
New York City,Queens,7003010,001637,New York - Presbyterian/Queens,0 to 17,113,M,White,Not Span/Hispanic,2,Emergency,Home or Self Care,2020,INJ035,"COMPLICATION OF INTERNAL ORTHOPEDIC DEVICE OR IMPLANT, INITIAL ENCOUNTER",MST011,FIXATION OF LEG AND FOOT BONES,320,OTHER MUSCULOSKELETAL SYSTEM & CONNECTIVE TISSUE PROCEDURES,08,DISEASES AND DISORDERS OF THE MUSCULOSKELETAL SYSTEM AND CONNECTIVE TISSUE,1,Minor,Minor,Surgical,Medicaid,Self-Pay,,,,Y,29256.4,8781.73
New York City,Queens,7003010,001637,New York - Presbyterian/Queens,50 to 69,111,F,White,Not Span/Hispanic,1,Urgent,Home w/ Home Health Services,2020,INJ005,"FRACTURE OF THE LOWER LIMB (EXCEPT HIP), INITIAL ENCOUNTER",MST011,FIXATION OF LEG AND FOOT BONES,320,OTHER MUSCULOSKELETAL SYSTEM & CONNECTIVE TISSUE PROCEDURES,08,DISEASES AND DISORDERS OF THE MUSCULOSKELETAL SYSTEM AND CONNECTIVE TISSUE,1,Minor,Minor,Surgical,Miscellaneous/Other,Private Health Insurance,Self-Pay,,,N,24003.54,8751.55
New York City,Manhattan,7002053,001463,NYU Langone Hospitals,50 to 69,117,F,White,Not Span/Hispanic,2,Emergency,Home w/ Home Health Services,2020,MUS011,SPONDYLOPATHIES/SPONDYLOARTHROPATHY (INCLUDING INFECTIVE),PNS001,LUMBOSACRAL NERVE DECOMPRESSION,320,OTHER MUSCULOSKELETAL SYSTEM & CONNECTIVE TISSUE PROCEDURES,08,DISEASES AND DISORDERS OF THE MUSCULOSKELETAL SYSTEM AND CONNECTIVE TISSUE,2,Moderate,Minor,Surgical,Medicare,Medicare,,,,Y,79513.55,14276.19
New York City,Manhattan,7002054,001458,New York-Presbyterian Hospital - New York Weill Cornell Center,50 to 69,108,M,White,Not Span/Hispanic,1,Elective,Home or Self Care,2020,MUS011,SPONDYLOPATHIES/SPONDYLOARTHROPATHY (INCLUDING INFECTIVE),PNS001,LUMBOSACRAL NERVE DECOMPRESSION,320,OTHER MUSCULOSKELETAL SYSTEM & CONNECTIVE TISSUE PROCEDURES,08,DISEASES AND DISORDERS OF THE MUSCULOSKELETAL SYSTEM AND CONNECTIVE TISSUE,1,Minor,Minor,Surgical,Blue Cross/Blue Shield,Self-Pay,,,,N,39574.65,12245.99
New York City,Manhattan,7002054,001458,New York-Presbyterian Hospital - New York Weill Cornell Center,50 to 69,105,M,Other Race,Not Span/Hispanic,2,Elective,Home or Self Care,2020,NEO073,BENIGN NEOPLASMS,PNS005,PERIPHERAL NERVE DENERVATION,320,OTHER MUSCULOSKELETAL SYSTEM & CONNECTIVE TISSUE PROCEDURES,08,DISEASES AND DISORDERS OF THE MUSCULOSKELETAL SYSTEM AND CONNECTIVE TISSUE,1,Minor,Minor,Surgical,Blue Cross/Blue Shield,Self-Pay,,,,N,54648.01,15838.1
New York City,Manhattan,7002054,001458,New York-Presbyterian Hospital - New York Weill Cornell Center,70 or Older,OOS,F,White,Not Span/Hispanic,1,Elective,Home or Self Care,2020,MUS011,SPONDYLOPATHIES/SPONDYLOARTHROPATHY (INCLUDING INFECTIVE),PNS001,LUMBOSACRAL NERVE DECOMPRESSION,320,OTHER MUSCULOSKELETAL SYSTEM & CONNECTIVE TISSUE PROCEDURES,08,DISEASES AND DISORDERS OF THE MUSCULOSKELETAL SYSTEM AND CONNECTIVE TISSUE,1,Minor,Minor,Surgical,Medicare,Private Health Insurance,Self-Pay,,,N,34439.1,10419.22
New York City,Manhattan,7002054,001458,New York-Presbyterian Hospital - New York Weill Cornell Center,70 or Older,100,F,Other Race,Not Span/Hispanic,1,Emergency,Home w/ Home Health Services,2020,INJ005,"FRACTURE OF THE LOWER LIMB (EXCEPT HIP), INITIAL ENCOUNTER",MST011,FIXATION OF LEG AND FOOT BONES,320,OTHER MUSCULOSKELETAL SYSTEM & CONNECTIVE TISSUE PROCEDURES,08,DISEASES AND DISORDERS OF THE MUSCULOSKELETAL SYSTEM AND CONNECTIVE TISSUE,1,Minor,Minor,Surgical,Medicare,Private Health Insurance,Self-Pay,,,N,47650.42,15961.51
New York City,Manhattan,7002054,001437,New York-Presbyterian/Lower Manhattan Hospital,30 to 49,104,M,Other Race,Spanish/Hispanic,5,Elective,Home or Self Care,2020,MUS011,SPONDYLOPATHIES/SPONDYLOARTHROPATHY (INCLUDING INFECTIVE),PNS001,LUMBOSACRAL NERVE DECOMPRESSION,320,OTHER MUSCULOSKELETAL SYSTEM & CONNECTIVE TISSUE PROCEDURES,08,DISEASES AND DISORDERS OF THE MUSCULOSKELETAL SYSTEM AND CONNECTIVE TISSUE,1,Minor,Minor,Surgical,Miscellaneous/Other,Self-Pay,,,,N,81798.57,21805.29
New York City,Manhattan,7002054,001458,New York-Presbyterian Hospital - New York Weill Cornell Center,30 to 49,100,M,White,Not Span/Hispanic,2,Elective,Home or Self Care,2020,NEO023,BONE CANCER,MST018,BONE EXCISION,320,OTHER MUSCULOSKELETAL SYSTEM & CONNECTIVE TISSUE PROCEDURES,08,DISEASES AND DISORDERS OF THE MUSCULOSKELETAL SYSTEM AND CONNECTIVE TISSUE,1,Minor,Minor,Surgical,Private Health Insurance,Self-Pay,,,,N,72757.6,32536.1
New York City,Manhattan,7002054,001458,New York-Presbyterian Hospital - New York Weill Cornell Center,70 or Older,OOS,M,White,Not Span/Hispanic,5,Elective,Skilled Nursing Home,2020,MUS011,SPONDYLOPATHIES/SPONDYLOARTHROPATHY (INCLUDING INFECTIVE),PNS001,LUMBOSACRAL NERVE DECOMPRESSION,320,OTHER MUSCULOSKELETAL SYSTEM & CONNECTIVE TISSUE PROCEDURES,08,DISEASES AND DISORDERS OF THE MUSCULOSKELETAL SYSTEM AND CONNECTIVE TISSUE,1,Minor,Minor,Surgical,Medicare,Blue Cross/Blue Shield,Self-Pay,,,N,125082.05,55576.49
New York City,Kings,7001021,001306,New York - Presbyterian Brooklyn Methodist Hospital,70 or Older,112,F,Other Race,Not Span/Hispanic,4,Elective,Home w/ Home Health Services,2020,INJ005,"FRACTURE OF THE LOWER LIMB (EXCEPT HIP), INITIAL ENCOUNTER",MST011,FIXATION OF LEG AND FOOT BONES,320,OTHER MUSCULOSKELETAL SYSTEM & CONNECTIVE TISSUE PROCEDURES,08,DISEASES AND DISORDERS OF THE MUSCULOSKELETAL SYSTEM AND CONNECTIVE TISSUE,1,Minor,Minor,Surgical,Blue Cross/Blue Shield,Medicare,Self-Pay,,,N,41550.46,17118.37
New York City,Manhattan,7002054,001458,New York-Presbyterian Hospital - New York Weill Cornell Center,70 or Older,112,M,White,Not Span/Hispanic,3,Elective,Home w/ Home Health Services,2020,MUS011,SPONDYLOPATHIES/SPONDYLOARTHROPATHY (INCLUDING INFECTIVE),PNS001,LUMBOSACRAL NERVE DECOMPRESSION,320,OTHER MUSCULOSKELETAL SYSTEM & CONNECTIVE TISSUE PROCEDURES,08,DISEASES AND DISORDERS OF THE MUSCULOSKELETAL SYSTEM AND CONNECTIVE TISSUE,1,Minor,Minor,Surgical,Medicare,Blue Cross/Blue Shield,Self-Pay,,,N,86580.14,38294.57
New York City,Manhattan,7002054,001458,New York-Presbyterian Hospital - New York Weill Cornell Center,70 or Older,,F,Other Race,Not Span/Hispanic,14,Emergency,Skilled Nursing Home,2020,INJ035,"COMPLICATION OF INTERNAL ORTHOPEDIC DEVICE OR IMPLANT, INITIAL ENCOUNTER",MST001,ARTHROCENTESIS,320,OTHER MUSCULOSKELETAL SYSTEM & CONNECTIVE TISSUE PROCEDURES,08,DISEASES AND DISORDERS OF THE MUSCULOSKELETAL SYSTEM AND CONNECTIVE TISSUE,4,Extreme,Extreme,Surgical,Medicare,Private Health Insurance,Self-Pay,,,N,250761.98,59434.83
New York City,Kings,7001021,001306,New York - Presbyterian Brooklyn Methodist Hospital,70 or Older,112,F,White,Not Span/Hispanic,4,Emergency,Inpatient Rehabilitation Facility,2020,INJ003,"FRACTURE OF TORSO, INITIAL ENCOUNTER",MST012,BONE FIXATION (EXCLUDING EXTREMITIES),320,OTHER MUSCULOSKELETAL SYSTEM & CONNECTIVE TISSUE PROCEDURES,08,DISEASES AND DISORDERS OF THE MUSCULOSKELETAL SYSTEM AND CONNECTIVE TISSUE,2,Moderate,Minor,Surgical,Medicare,Medicaid,Self-Pay,,,Y,49287.82,19903.85
New York City,Manhattan,7002054,001458,New York-Presbyterian Hospital - New York Weill Cornell Center,70 or Older,OOS,F,Other Race,Not Span/Hispanic,1,Elective,Home or Self Care,2020,MUS011,SPONDYLOPATHIES/SPONDYLOARTHROPATHY (INCLUDING INFECTIVE),PNS001,LUMBOSACRAL NERVE DECOMPRESSION,320,OTHER MUSCULOSKELETAL SYSTEM & CONNECTIVE TISSUE PROCEDURES,08,DISEASES AND DISORDERS OF THE MUSCULOSKELETAL SYSTEM AND CONNECTIVE TISSUE,1,Minor,Minor,Surgical,Medicare,Self-Pay,,,,N,29170.58,8641.71
New York City,Kings,7001021,001306,New York - Presbyterian Brooklyn Methodist Hospital,30 to 49,112,M,White,Not Span/Hispanic,4,Emergency,Home or Self Care,2020,END003,DIABETES MELLITUS WITH COMPLICATION,MST018,BONE EXCISION,320,OTHER MUSCULOSKELETAL SYSTEM & CONNECTIVE TISSUE PROCEDURES,08,DISEASES AND DISORDERS OF THE MUSCULOSKELETAL SYSTEM AND CONNECTIVE TISSUE,2,Moderate,Minor,Surgical,"Managed Care, Unspecified",Medicaid,Self-Pay,,,Y,49328.85,15652.85
New York City,Bronx,7000006,001168,Montefiore Medical Center-Wakefield Hospital,50 to 69,104,M,Black/African American,Not Span/Hispanic,1,Elective,Home w/ Home Health Services,2020,INJ035,"COMPLICATION OF INTERNAL ORTHOPEDIC DEVICE OR IMPLANT, INITIAL ENCOUNTER",MST006,KNEE ARTHROPLASTY,320,OTHER MUSCULOSKELETAL SYSTEM & CONNECTIVE TISSUE PROCEDURES,08,DISEASES AND DISORDERS OF THE MUSCULOSKELETAL SYSTEM AND CONNECTIVE TISSUE,1,Minor,Minor,Surgical,Medicaid,,,,,N,58124.33,13303.56