Hospital Service Area,Hospital County,Operating Certificate Number,Permanent Facility Id,Facility Name,Age Group,Zip Code - 3 digits,Gender,Race,Ethnicity,Length of Stay,Type of Admission,Patient Disposition,Discharge Year,CCS Diagnosis Code,CCS Diagnosis Description,CCS Procedure Code,CCS Procedure Description,APR DRG Code,APR DRG Description,APR MDC Code,APR MDC Description,APR Severity of Illness Code,APR Severity of Illness Description,APR Risk of Mortality,APR Medical Surgical Description,Payment Typology 1,Payment Typology 2,Payment Typology 3,Birth Weight,Abortion Edit Indicator,Emergency Department Indicator,Total Charges,Total Costs
Long Island,Nassau,2908000,000511,NYU Langone Hospital-Long Island,50 to 69,117,M,White,Not Span/Hispanic,3,Elective,Home or Self Care,2020,MUS011,SPONDYLOPATHIES/SPONDYLOARTHROPATHY (INCLUDING INFECTIVE),PNS002,CERVICOTHORACIC NERVE DECOMPRESSION,320,OTHER MUSCULOSKELETAL SYSTEM & CONNECTIVE TISSUE PROCEDURES,08,DISEASES AND DISORDERS OF THE MUSCULOSKELETAL SYSTEM AND CONNECTIVE TISSUE,1,Minor,Minor,Surgical,Private Health Insurance,,,,,N,149879.16,34555.25
Long Island,Nassau,2908000,000511,NYU Langone Hospital-Long Island,50 to 69,110,F,White,Not Span/Hispanic,1,Emergency,Home w/ Home Health Services,2020,INJ004,"FRACTURE OF THE UPPER LIMB, INITIAL ENCOUNTER",MST009,FIXATION OF UPPER EXTREMITY BONES,320,OTHER MUSCULOSKELETAL SYSTEM & CONNECTIVE TISSUE PROCEDURES,08,DISEASES AND DISORDERS OF THE MUSCULOSKELETAL SYSTEM AND CONNECTIVE TISSUE,2,Moderate,Minor,Surgical,Medicare,Blue Cross/Blue Shield,,,,Y,127450.06,23397.92
Long Island,Nassau,2908000,000511,NYU Langone Hospital-Long Island,18 to 29,117,M,White,Not Span/Hispanic,3,Trauma,Home or Self Care,2020,INJ004,"FRACTURE OF THE UPPER LIMB, INITIAL ENCOUNTER",MST009,FIXATION OF UPPER EXTREMITY BONES,320,OTHER MUSCULOSKELETAL SYSTEM & CONNECTIVE TISSUE PROCEDURES,08,DISEASES AND DISORDERS OF THE MUSCULOSKELETAL SYSTEM AND CONNECTIVE TISSUE,2,Moderate,Minor,Surgical,Miscellaneous/Other,Blue Cross/Blue Shield,,,,Y,154683.19,26820.63
Long Island,Nassau,2908000,000511,NYU Langone Hospital-Long Island,70 or Older,117,M,White,Not Span/Hispanic,3,Elective,Home w/ Home Health Services,2020,INJ035,"COMPLICATION OF INTERNAL ORTHOPEDIC DEVICE OR IMPLANT, INITIAL ENCOUNTER",MST012,BONE FIXATION (EXCLUDING EXTREMITIES),320,OTHER MUSCULOSKELETAL SYSTEM & CONNECTIVE TISSUE PROCEDURES,08,DISEASES AND DISORDERS OF THE MUSCULOSKELETAL SYSTEM AND CONNECTIVE TISSUE,1,Minor,Minor,Surgical,Medicare,Blue Cross/Blue Shield,,,,N,146737.55,34202.75
Long Island,Nassau,2908000,000511,NYU Langone Hospital-Long Island,50 to 69,117,M,White,Not Span/Hispanic,2,Elective,Home or Self Care,2020,MUS025,OTHER SPECIFIED CONNECTIVE TISSUE DISEASE,MST018,BONE EXCISION,320,OTHER MUSCULOSKELETAL SYSTEM & CONNECTIVE TISSUE PROCEDURES,08,DISEASES AND DISORDERS OF THE MUSCULOSKELETAL SYSTEM AND CONNECTIVE TISSUE,1,Minor,Minor,Surgical,Miscellaneous/Other,,,,,N,150802.53,24843.36
Long Island,Nassau,2908000,000511,NYU Langone Hospital-Long Island,50 to 69,119,F,White,Not Span/Hispanic,1,Elective,Home or Self Care,2020,NEO073,BENIGN NEOPLASMS,GNR009,"RETROPERITONEAL PROCEDURES, NEC",320,OTHER MUSCULOSKELETAL SYSTEM & CONNECTIVE TISSUE PROCEDURES,08,DISEASES AND DISORDERS OF THE MUSCULOSKELETAL SYSTEM AND CONNECTIVE TISSUE,1,Minor,Minor,Surgical,Blue Cross/Blue Shield,,,,,N,66853.8,10920.78
Long Island,Nassau,2908000,000511,NYU Langone Hospital-Long Island,70 or Older,115,M,White,Not Span/Hispanic,2,Elective,Home w/ Home Health Services,2020,NEO024,SARCOMA,GNR009,"RETROPERITONEAL PROCEDURES, NEC",320,OTHER MUSCULOSKELETAL SYSTEM & CONNECTIVE TISSUE PROCEDURES,08,DISEASES AND DISORDERS OF THE MUSCULOSKELETAL SYSTEM AND CONNECTIVE TISSUE,2,Moderate,Minor,Surgical,Medicare,Private Health Insurance,,,,N,76802.67,14359.13
Long Island,Nassau,2908000,000511,NYU Langone Hospital-Long Island,50 to 69,110,F,Other Race,Not Span/Hispanic,1,Elective,Home or Self Care,2020,NEO070,SECONDARY MALIGNANCIES,MST018,BONE EXCISION,320,OTHER MUSCULOSKELETAL SYSTEM & CONNECTIVE TISSUE PROCEDURES,08,DISEASES AND DISORDERS OF THE MUSCULOSKELETAL SYSTEM AND CONNECTIVE TISSUE,1,Minor,Moderate,Surgical,Medicaid,,,,,N,114861.43,17636.04
Long Island,Nassau,2908000,000511,NYU Langone Hospital-Long Island,30 to 49,110,M,White,Not Span/Hispanic,6,Emergency,Home w/ Home Health Services,2020,MUS011,SPONDYLOPATHIES/SPONDYLOARTHROPATHY (INCLUDING INFECTIVE),PNS001,LUMBOSACRAL NERVE DECOMPRESSION,320,OTHER MUSCULOSKELETAL SYSTEM & CONNECTIVE TISSUE PROCEDURES,08,DISEASES AND DISORDERS OF THE MUSCULOSKELETAL SYSTEM AND CONNECTIVE TISSUE,1,Minor,Minor,Surgical,Private Health Insurance,,,,,Y,133742.78,28972.99
Long Island,Nassau,2908000,000511,NYU Langone Hospital-Long Island,70 or Older,117,F,White,Unknown,1,Elective,Home or Self Care,2020,NEO070,SECONDARY MALIGNANCIES,MST002,BONE AND JOINT BIOPSY,320,OTHER MUSCULOSKELETAL SYSTEM & CONNECTIVE TISSUE PROCEDURES,08,DISEASES AND DISORDERS OF THE MUSCULOSKELETAL SYSTEM AND CONNECTIVE TISSUE,2,Moderate,Major,Surgical,Medicare,Medicare,,,,N,84112.1,12656.97
Long Island,Nassau,2908000,000511,NYU Langone Hospital-Long Island,50 to 69,115,M,White,Spanish/Hispanic,7,Emergency,Home or Self Care,2020,INJ005,"FRACTURE OF THE LOWER LIMB (EXCEPT HIP), INITIAL ENCOUNTER",MST011,FIXATION OF LEG AND FOOT BONES,320,OTHER MUSCULOSKELETAL SYSTEM & CONNECTIVE TISSUE PROCEDURES,08,DISEASES AND DISORDERS OF THE MUSCULOSKELETAL SYSTEM AND CONNECTIVE TISSUE,2,Moderate,Minor,Surgical,Miscellaneous/Other,,,,,Y,119798.88,31322.36
Long Island,Nassau,2908000,000511,NYU Langone Hospital-Long Island,30 to 49,113,M,Other Race,Not Span/Hispanic,4,Elective,Home or Self Care,2020,NEO073,BENIGN NEOPLASMS,GNR009,"RETROPERITONEAL PROCEDURES, NEC",320,OTHER MUSCULOSKELETAL SYSTEM & CONNECTIVE TISSUE PROCEDURES,08,DISEASES AND DISORDERS OF THE MUSCULOSKELETAL SYSTEM AND CONNECTIVE TISSUE,1,Minor,Minor,Surgical,Medicaid,,,,,N,109849.41,22387.71
Long Island,Nassau,2908000,000511,NYU Langone Hospital-Long Island,30 to 49,117,M,White,Not Span/Hispanic,1,Elective,Home or Self Care,2020,MUS011,SPONDYLOPATHIES/SPONDYLOARTHROPATHY (INCLUDING INFECTIVE),PNS002,CERVICOTHORACIC NERVE DECOMPRESSION,320,OTHER MUSCULOSKELETAL SYSTEM & CONNECTIVE TISSUE PROCEDURES,08,DISEASES AND DISORDERS OF THE MUSCULOSKELETAL SYSTEM AND CONNECTIVE TISSUE,1,Minor,Minor,Surgical,Private Health Insurance,,,,,N,115199.74,18932.01
Long Island,Nassau,2908000,000511,NYU Langone Hospital-Long Island,30 to 49,117,F,Other Race,Not Span/Hispanic,2,Elective,Home w/ Home Health Services,2020,MUS007,OTHER SPECIFIED JOINT DISORDERS,MST011,FIXATION OF LEG AND FOOT BONES,320,OTHER MUSCULOSKELETAL SYSTEM & CONNECTIVE TISSUE PROCEDURES,08,DISEASES AND DISORDERS OF THE MUSCULOSKELETAL SYSTEM AND CONNECTIVE TISSUE,1,Minor,Minor,Surgical,Miscellaneous/Other,,,,,N,133782.97,24691.23
Long Island,Nassau,2908000,000511,NYU Langone Hospital-Long Island,70 or Older,110,F,White,Not Span/Hispanic,17,Trauma,Skilled Nursing Home,2020,END003,DIABETES MELLITUS WITH COMPLICATION,MST018,BONE EXCISION,320,OTHER MUSCULOSKELETAL SYSTEM & CONNECTIVE TISSUE PROCEDURES,08,DISEASES AND DISORDERS OF THE MUSCULOSKELETAL SYSTEM AND CONNECTIVE TISSUE,3,Major,Major,Surgical,Medicare,Blue Cross/Blue Shield,,,,Y,338311.05,94046.76
Long Island,Nassau,2908000,000511,NYU Langone Hospital-Long Island,70 or Older,114,M,Black/African American,Not Span/Hispanic,1,Elective,Home or Self Care,2020,MUS028,OTHER SPECIFIED BONE DISEASE AND MUSCULOSKELETAL DEFORMITIES,MST002,BONE AND JOINT BIOPSY,320,OTHER MUSCULOSKELETAL SYSTEM & CONNECTIVE TISSUE PROCEDURES,08,DISEASES AND DISORDERS OF THE MUSCULOSKELETAL SYSTEM AND CONNECTIVE TISSUE,2,Moderate,Minor,Surgical,Medicare,,,,,N,51954.89,10247.18
Long Island,Nassau,2908000,000511,NYU Langone Hospital-Long Island,30 to 49,115,M,White,Not Span/Hispanic,1,Emergency,Home or Self Care,2020,INJ073,"INJURY, SEQUELA",MST009,FIXATION OF UPPER EXTREMITY BONES,320,OTHER MUSCULOSKELETAL SYSTEM & CONNECTIVE TISSUE PROCEDURES,08,DISEASES AND DISORDERS OF THE MUSCULOSKELETAL SYSTEM AND CONNECTIVE TISSUE,1,Minor,Minor,Surgical,Miscellaneous/Other,,,,,Y,43320.6,9156.3
Long Island,Nassau,2908000,000511,NYU Langone Hospital-Long Island,70 or Older,117,M,White,Not Span/Hispanic,3,Elective,Home or Self Care,2020,MUS011,SPONDYLOPATHIES/SPONDYLOARTHROPATHY (INCLUDING INFECTIVE),PNS001,LUMBOSACRAL NERVE DECOMPRESSION,320,OTHER MUSCULOSKELETAL SYSTEM & CONNECTIVE TISSUE PROCEDURES,08,DISEASES AND DISORDERS OF THE MUSCULOSKELETAL SYSTEM AND CONNECTIVE TISSUE,2,Moderate,Moderate,Surgical,Medicare,Medicare,,,,N,113078.27,27129.71
Long Island,Nassau,2908000,000511,NYU Langone Hospital-Long Island,30 to 49,115,F,Other Race,Spanish/Hispanic,1,Emergency,Home w/ Home Health Services,2020,INJ005,"FRACTURE OF THE LOWER LIMB (EXCEPT HIP), INITIAL ENCOUNTER",MST011,FIXATION OF LEG AND FOOT BONES,320,OTHER MUSCULOSKELETAL SYSTEM & CONNECTIVE TISSUE PROCEDURES,08,DISEASES AND DISORDERS OF THE MUSCULOSKELETAL SYSTEM AND CONNECTIVE TISSUE,1,Minor,Minor,Surgical,Medicaid,,,,,Y,77511.9,13765.25
Long Island,Nassau,2908000,000511,NYU Langone Hospital-Long Island,70 or Older,115,F,White,Not Span/Hispanic,9,Emergency,Home w/ Home Health Services,2020,INJ035,"COMPLICATION OF INTERNAL ORTHOPEDIC DEVICE OR IMPLANT, INITIAL ENCOUNTER",MST006,KNEE ARTHROPLASTY,320,OTHER MUSCULOSKELETAL SYSTEM & CONNECTIVE TISSUE PROCEDURES,08,DISEASES AND DISORDERS OF THE MUSCULOSKELETAL SYSTEM AND CONNECTIVE TISSUE,3,Major,Moderate,Surgical,Medicare,Medicare,Blue Cross/Blue Shield,,,Y,414488.88,84608.98
Long Island,Nassau,2908000,000511,NYU Langone Hospital-Long Island,50 to 69,119,M,White,Not Span/Hispanic,4,Elective,Home or Self Care,2020,MUS024,SYSTEMIC LUPUS ERYTHEMATOSUS AND CONNECTIVE TISSUE DISORDERS,RES008,"LUNG, PLEURA, OR DIAPHRAGM RESECTION (OPEN AND THORACOSCOPIC)",320,OTHER MUSCULOSKELETAL SYSTEM & CONNECTIVE TISSUE PROCEDURES,08,DISEASES AND DISORDERS OF THE MUSCULOSKELETAL SYSTEM AND CONNECTIVE TISSUE,2,Moderate,Moderate,Surgical,Private Health Insurance,,,,,N,229432.48,43461.66
Long Island,Nassau,2908000,000511,NYU Langone Hospital-Long Island,70 or Older,115,M,White,Not Span/Hispanic,16,Emergency,Skilled Nursing Home,2020,INJ037,"COMPLICATION OF OTHER SURGICAL OR MEDICAL CARE, INJURY, INITIAL ENCOUNTER",MST002,BONE AND JOINT BIOPSY,320,OTHER MUSCULOSKELETAL SYSTEM & CONNECTIVE TISSUE PROCEDURES,08,DISEASES AND DISORDERS OF THE MUSCULOSKELETAL SYSTEM AND CONNECTIVE TISSUE,3,Major,Major,Surgical,Medicare,,,,,Y,288567.03,82363.46
Long Island,Nassau,2908000,000511,NYU Langone Hospital-Long Island,50 to 69,117,M,Other Race,Spanish/Hispanic,1,Elective,Home w/ Home Health Services,2020,MUS011,SPONDYLOPATHIES/SPONDYLOARTHROPATHY (INCLUDING INFECTIVE),PNS001,LUMBOSACRAL NERVE DECOMPRESSION,320,OTHER MUSCULOSKELETAL SYSTEM & CONNECTIVE TISSUE PROCEDURES,08,DISEASES AND DISORDERS OF THE MUSCULOSKELETAL SYSTEM AND CONNECTIVE TISSUE,1,Minor,Minor,Surgical,Miscellaneous/Other,Miscellaneous/Other,,,,N,106671.07,17574.65
Long Island,Nassau,2908000,000511,NYU Langone Hospital-Long Island,30 to 49,114,M,Black/African American,Not Span/Hispanic,6,Trauma,Home or Self Care,2020,INJ004,"FRACTURE OF THE UPPER LIMB, INITIAL ENCOUNTER",MST009,FIXATION OF UPPER EXTREMITY BONES,320,OTHER MUSCULOSKELETAL SYSTEM & CONNECTIVE TISSUE PROCEDURES,08,DISEASES AND DISORDERS OF THE MUSCULOSKELETAL SYSTEM AND CONNECTIVE TISSUE,3,Major,Moderate,Surgical,Miscellaneous/Other,,,,,Y,287793.24,55302.35
Long Island,Nassau,2908000,000511,NYU Langone Hospital-Long Island,70 or Older,115,M,White,Not Span/Hispanic,6,Elective,Home or Self Care,2020,MUS011,SPONDYLOPATHIES/SPONDYLOARTHROPATHY (INCLUDING INFECTIVE),PNS001,LUMBOSACRAL NERVE DECOMPRESSION,320,OTHER MUSCULOSKELETAL SYSTEM & CONNECTIVE TISSUE PROCEDURES,08,DISEASES AND DISORDERS OF THE MUSCULOSKELETAL SYSTEM AND CONNECTIVE TISSUE,1,Minor,Minor,Surgical,Medicare,,,,,N,192129.96,44141.12
Long Island,Nassau,2908000,000511,NYU Langone Hospital-Long Island,70 or Older,115,M,White,Not Span/Hispanic,4,Elective,Home w/ Home Health Services,2020,MUS011,SPONDYLOPATHIES/SPONDYLOARTHROPATHY (INCLUDING INFECTIVE),PNS001,LUMBOSACRAL NERVE DECOMPRESSION,320,OTHER MUSCULOSKELETAL SYSTEM & CONNECTIVE TISSUE PROCEDURES,08,DISEASES AND DISORDERS OF THE MUSCULOSKELETAL SYSTEM AND CONNECTIVE TISSUE,1,Minor,Minor,Surgical,Medicare,,,,,N,119070.48,28352.68
Long Island,Nassau,2908000,000511,NYU Langone Hospital-Long Island,0 to 17,115,M,Black/African American,Not Span/Hispanic,1,Emergency,Home or Self Care,2020,INJ041,"FRACTURE OF THE UPPER LIMB, SUBSEQUENT ENCOUNTER",MST009,FIXATION OF UPPER EXTREMITY BONES,320,OTHER MUSCULOSKELETAL SYSTEM & CONNECTIVE TISSUE PROCEDURES,08,DISEASES AND DISORDERS OF THE MUSCULOSKELETAL SYSTEM AND CONNECTIVE TISSUE,1,Minor,Minor,Surgical,Medicaid,,,,,Y,65787.19,12095.22
Long Island,Nassau,2908000,000511,NYU Langone Hospital-Long Island,50 to 69,110,F,White,Not Span/Hispanic,3,Emergency,Home w/ Home Health Services,2020,INJ005,"FRACTURE OF THE LOWER LIMB (EXCEPT HIP), INITIAL ENCOUNTER",MST011,FIXATION OF LEG AND FOOT BONES,320,OTHER MUSCULOSKELETAL SYSTEM & CONNECTIVE TISSUE PROCEDURES,08,DISEASES AND DISORDERS OF THE MUSCULOSKELETAL SYSTEM AND CONNECTIVE TISSUE,2,Moderate,Minor,Surgical,Private Health Insurance,Medicare,,,,Y,128319.06,27098.12
Long Island,Nassau,2908000,000511,NYU Langone Hospital-Long Island,50 to 69,117,F,White,Not Span/Hispanic,1,Elective,Home or Self Care,2020,NEO073,BENIGN NEOPLASMS,GNR009,"RETROPERITONEAL PROCEDURES, NEC",320,OTHER MUSCULOSKELETAL SYSTEM & CONNECTIVE TISSUE PROCEDURES,08,DISEASES AND DISORDERS OF THE MUSCULOSKELETAL SYSTEM AND CONNECTIVE TISSUE,1,Minor,Minor,Surgical,Private Health Insurance,,,,,N,53105.27,9981.52
Long Island,Nassau,2908000,000511,NYU Langone Hospital-Long Island,50 to 69,117,F,White,Not Span/Hispanic,1,Emergency,Home w/ Home Health Services,2020,INJ005,"FRACTURE OF THE LOWER LIMB (EXCEPT HIP), INITIAL ENCOUNTER",MST011,FIXATION OF LEG AND FOOT BONES,320,OTHER MUSCULOSKELETAL SYSTEM & CONNECTIVE TISSUE PROCEDURES,08,DISEASES AND DISORDERS OF THE MUSCULOSKELETAL SYSTEM AND CONNECTIVE TISSUE,1,Minor,Minor,Surgical,Medicare,Medicare,,,,Y,129827.99,21071.61
Long Island,Nassau,2908000,000511,NYU Langone Hospital-Long Island,70 or Older,115,M,White,Not Span/Hispanic,1,Elective,Home w/ Home Health Services,2020,INJ035,"COMPLICATION OF INTERNAL ORTHOPEDIC DEVICE OR IMPLANT, INITIAL ENCOUNTER",MST011,FIXATION OF LEG AND FOOT BONES,320,OTHER MUSCULOSKELETAL SYSTEM & CONNECTIVE TISSUE PROCEDURES,08,DISEASES AND DISORDERS OF THE MUSCULOSKELETAL SYSTEM AND CONNECTIVE TISSUE,1,Minor,Minor,Surgical,Medicare,,,,,N,144577.66,23064.06
Long Island,Nassau,2908000,000511,NYU Langone Hospital-Long Island,18 to 29,,M,White,Unknown,2,Emergency,Home or Self Care,2020,INJ004,"FRACTURE OF THE UPPER LIMB, INITIAL ENCOUNTER",MST009,FIXATION OF UPPER EXTREMITY BONES,320,OTHER MUSCULOSKELETAL SYSTEM & CONNECTIVE TISSUE PROCEDURES,08,DISEASES AND DISORDERS OF THE MUSCULOSKELETAL SYSTEM AND CONNECTIVE TISSUE,1,Minor,Minor,Surgical,Medicaid,,,,,Y,109114.08,21272.19
Long Island,Nassau,2908000,000511,NYU Langone Hospital-Long Island,70 or Older,115,F,White,Not Span/Hispanic,4,Emergency,Home w/ Home Health Services,2020,INJ005,"FRACTURE OF THE LOWER LIMB (EXCEPT HIP), INITIAL ENCOUNTER",MST011,FIXATION OF LEG AND FOOT BONES,320,OTHER MUSCULOSKELETAL SYSTEM & CONNECTIVE TISSUE PROCEDURES,08,DISEASES AND DISORDERS OF THE MUSCULOSKELETAL SYSTEM AND CONNECTIVE TISSUE,2,Moderate,Minor,Surgical,Medicare,Blue Cross/Blue Shield,Private Health Insurance,,,Y,166467.32,35765.52
Long Island,Nassau,2908000,000511,NYU Langone Hospital-Long Island,50 to 69,117,F,White,Not Span/Hispanic,3,Elective,Home w/ Home Health Services,2020,MUS025,OTHER SPECIFIED CONNECTIVE TISSUE DISEASE,GNR009,"RETROPERITONEAL PROCEDURES, NEC",320,OTHER MUSCULOSKELETAL SYSTEM & CONNECTIVE TISSUE PROCEDURES,08,DISEASES AND DISORDERS OF THE MUSCULOSKELETAL SYSTEM AND CONNECTIVE TISSUE,2,Moderate,Minor,Surgical,Medicare,Private Health Insurance,,,,N,120379.45,24926.34
Long Island,Nassau,2908000,000511,NYU Langone Hospital-Long Island,70 or Older,110,F,White,Not Span/Hispanic,2,Elective,Home w/ Home Health Services,2020,INJ005,"FRACTURE OF THE LOWER LIMB (EXCEPT HIP), INITIAL ENCOUNTER",MST011,FIXATION OF LEG AND FOOT BONES,320,OTHER MUSCULOSKELETAL SYSTEM & CONNECTIVE TISSUE PROCEDURES,08,DISEASES AND DISORDERS OF THE MUSCULOSKELETAL SYSTEM AND CONNECTIVE TISSUE,2,Moderate,Minor,Surgical,Medicare,Private Health Insurance,,,,N,75052.09,16454.79
Long Island,Nassau,2908000,000511,NYU Langone Hospital-Long Island,50 to 69,113,F,White,Not Span/Hispanic,11,Emergency,Home w/ Home Health Services,2020,MUS024,SYSTEMIC LUPUS ERYTHEMATOSUS AND CONNECTIVE TISSUE DISORDERS,PNS006,"PERIPHERAL NERVE PROCEDURES, NEC",320,OTHER MUSCULOSKELETAL SYSTEM & CONNECTIVE TISSUE PROCEDURES,08,DISEASES AND DISORDERS OF THE MUSCULOSKELETAL SYSTEM AND CONNECTIVE TISSUE,3,Major,Major,Surgical,Medicare,Medicare,,,,Y,224646.45,60232.7
Long Island,Nassau,2908000,000511,NYU Langone Hospital-Long Island,70 or Older,115,F,White,Not Span/Hispanic,4,Elective,Home w/ Home Health Services,2020,MUS011,SPONDYLOPATHIES/SPONDYLOARTHROPATHY (INCLUDING INFECTIVE),PNS001,LUMBOSACRAL NERVE DECOMPRESSION,320,OTHER MUSCULOSKELETAL SYSTEM & CONNECTIVE TISSUE PROCEDURES,08,DISEASES AND DISORDERS OF THE MUSCULOSKELETAL SYSTEM AND CONNECTIVE TISSUE,1,Minor,Minor,Surgical,Medicare,Blue Cross/Blue Shield,,,,N,138915.2,30804.07
Long Island,Nassau,2908000,000511,NYU Langone Hospital-Long Island,30 to 49,110,M,White,Not Span/Hispanic,8,Emergency,Home w/ Home Health Services,2020,INJ035,"COMPLICATION OF INTERNAL ORTHOPEDIC DEVICE OR IMPLANT, INITIAL ENCOUNTER",MST006,KNEE ARTHROPLASTY,320,OTHER MUSCULOSKELETAL SYSTEM & CONNECTIVE TISSUE PROCEDURES,08,DISEASES AND DISORDERS OF THE MUSCULOSKELETAL SYSTEM AND CONNECTIVE TISSUE,3,Major,Minor,Surgical,Miscellaneous/Other,Blue Cross/Blue Shield,,,,Y,195555.59,51307.07
Long Island,Nassau,2908000,000511,NYU Langone Hospital-Long Island,30 to 49,115,F,Other Race,Spanish/Hispanic,2,Emergency,Home w/ Home Health Services,2020,INJ005,"FRACTURE OF THE LOWER LIMB (EXCEPT HIP), INITIAL ENCOUNTER",MST011,FIXATION OF LEG AND FOOT BONES,320,OTHER MUSCULOSKELETAL SYSTEM & CONNECTIVE TISSUE PROCEDURES,08,DISEASES AND DISORDERS OF THE MUSCULOSKELETAL SYSTEM AND CONNECTIVE TISSUE,2,Moderate,Minor,Surgical,Medicaid,,,,,Y,150913.37,27097.61
Long Island,Nassau,2908000,000511,NYU Langone Hospital-Long Island,50 to 69,117,F,White,Not Span/Hispanic,2,Elective,Home or Self Care,2020,NEO069,CANCER OF OTHER SITES,GNR009,"RETROPERITONEAL PROCEDURES, NEC",320,OTHER MUSCULOSKELETAL SYSTEM & CONNECTIVE TISSUE PROCEDURES,08,DISEASES AND DISORDERS OF THE MUSCULOSKELETAL SYSTEM AND CONNECTIVE TISSUE,1,Minor,Minor,Surgical,Blue Cross/Blue Shield,,,,,N,195816.98,29181.92
Long Island,Nassau,2908000,000511,NYU Langone Hospital-Long Island,50 to 69,117,M,White,Not Span/Hispanic,1,Elective,Home or Self Care,2020,MUS011,SPONDYLOPATHIES/SPONDYLOARTHROPATHY (INCLUDING INFECTIVE),PNS001,LUMBOSACRAL NERVE DECOMPRESSION,320,OTHER MUSCULOSKELETAL SYSTEM & CONNECTIVE TISSUE PROCEDURES,08,DISEASES AND DISORDERS OF THE MUSCULOSKELETAL SYSTEM AND CONNECTIVE TISSUE,1,Minor,Minor,Surgical,Blue Cross/Blue Shield,,,,,N,130383.97,21227.46
Long Island,Nassau,2908000,000511,NYU Langone Hospital-Long Island,18 to 29,110,M,Other Race,Spanish/Hispanic,2,Emergency,Home or Self Care,2020,INJ004,"FRACTURE OF THE UPPER LIMB, INITIAL ENCOUNTER",MST009,FIXATION OF UPPER EXTREMITY BONES,320,OTHER MUSCULOSKELETAL SYSTEM & CONNECTIVE TISSUE PROCEDURES,08,DISEASES AND DISORDERS OF THE MUSCULOSKELETAL SYSTEM AND CONNECTIVE TISSUE,1,Minor,Minor,Surgical,Private Health Insurance,,,,,Y,104351.64,20670.1
Long Island,Nassau,2908000,000511,NYU Langone Hospital-Long Island,70 or Older,117,M,White,Not Span/Hispanic,5,Emergency,Home w/ Home Health Services,2020,MUS011,SPONDYLOPATHIES/SPONDYLOARTHROPATHY (INCLUDING INFECTIVE),PNS001,LUMBOSACRAL NERVE DECOMPRESSION,320,OTHER MUSCULOSKELETAL SYSTEM & CONNECTIVE TISSUE PROCEDURES,08,DISEASES AND DISORDERS OF THE MUSCULOSKELETAL SYSTEM AND CONNECTIVE TISSUE,1,Minor,Minor,Surgical,Medicare,Medicaid,,,,N,198695.55,42860.17
Long Island,Nassau,2908000,000511,NYU Langone Hospital-Long Island,70 or Older,110,F,White,Not Span/Hispanic,6,Trauma,Home w/ Home Health Services,2020,INJ002,"FRACTURE OF THE SPINE AND BACK, INITIAL ENCOUNTER",MST012,BONE FIXATION (EXCLUDING EXTREMITIES),320,OTHER MUSCULOSKELETAL SYSTEM & CONNECTIVE TISSUE PROCEDURES,08,DISEASES AND DISORDERS OF THE MUSCULOSKELETAL SYSTEM AND CONNECTIVE TISSUE,3,Major,Moderate,Surgical,Medicare,,,,,Y,177747.3,43489.62
Long Island,Nassau,2908000,000511,NYU Langone Hospital-Long Island,70 or Older,115,F,White,Not Span/Hispanic,8,Emergency,Home w/ Home Health Services,2020,MUS002,OSTEOMYELITIS,MST002,BONE AND JOINT BIOPSY,320,OTHER MUSCULOSKELETAL SYSTEM & CONNECTIVE TISSUE PROCEDURES,08,DISEASES AND DISORDERS OF THE MUSCULOSKELETAL SYSTEM AND CONNECTIVE TISSUE,2,Moderate,Moderate,Surgical,Medicare,,,,,Y,119607.88,40741.96
Long Island,Nassau,2908000,000511,NYU Langone Hospital-Long Island,50 to 69,117,F,White,Not Span/Hispanic,2,Emergency,Home w/ Home Health Services,2020,INJ005,"FRACTURE OF THE LOWER LIMB (EXCEPT HIP), INITIAL ENCOUNTER",MST011,FIXATION OF LEG AND FOOT BONES,320,OTHER MUSCULOSKELETAL SYSTEM & CONNECTIVE TISSUE PROCEDURES,08,DISEASES AND DISORDERS OF THE MUSCULOSKELETAL SYSTEM AND CONNECTIVE TISSUE,1,Minor,Moderate,Surgical,Blue Cross/Blue Shield,,,,,Y,114535.6,20518.27
Long Island,Nassau,2908000,000511,NYU Langone Hospital-Long Island,50 to 69,,M,White,Spanish/Hispanic,1,Elective,Home w/ Home Health Services,2020,MUS011,SPONDYLOPATHIES/SPONDYLOARTHROPATHY (INCLUDING INFECTIVE),PNS001,LUMBOSACRAL NERVE DECOMPRESSION,320,OTHER MUSCULOSKELETAL SYSTEM & CONNECTIVE TISSUE PROCEDURES,08,DISEASES AND DISORDERS OF THE MUSCULOSKELETAL SYSTEM AND CONNECTIVE TISSUE,1,Minor,Minor,Surgical,Medicare,,,,,N,99512.12,16717.04
