Hospital Service Area,Hospital County,Operating Certificate Number,Permanent Facility Id,Facility Name,Age Group,Zip Code - 3 digits,Gender,Race,Ethnicity,Length of Stay,Type of Admission,Patient Disposition,Discharge Year,CCS Diagnosis Code,CCS Diagnosis Description,CCS Procedure Code,CCS Procedure Description,APR DRG Code,APR DRG Description,APR MDC Code,APR MDC Description,APR Severity of Illness Code,APR Severity of Illness Description,APR Risk of Mortality,APR Medical Surgical Description,Payment Typology 1,Payment Typology 2,Payment Typology 3,Birth Weight,Abortion Edit Indicator,Emergency Department Indicator,Total Charges,Total Costs
Long Island,Nassau,2908000,000511,NYU Winthrop Hospital,50 to 69,117,M,White,Not Span/Hispanic,2,Elective,Home w/ Home Health Services,2017,205,Spondylosis; intervertebral disc disorders; other back problems,003,LAMINECTOMY; EXC IV DSC,321,Cervical spinal fusion & other back/neck proc exc disc excis/decomp,08,Diseases and Disorders of the Musculoskeletal System and Conn Tissue,2,Moderate,Minor,Surgical,Private Health Insurance,,,,N,N,62823.93,16069.77
Long Island,Nassau,2908000,000511,NYU Winthrop Hospital,50 to 69,114,F,Black/African American,Not Span/Hispanic,7,Elective,Skilled Nursing Home,2017,205,Spondylosis; intervertebral disc disorders; other back problems,158,SPINAL FUSION,321,Cervical spinal fusion & other back/neck proc exc disc excis/decomp,08,Diseases and Disorders of the Musculoskeletal System and Conn Tissue,1,Minor,Minor,Surgical,Private Health Insurance,,,,N,N,214618.81,52214.74
Long Island,Nassau,2908000,000511,NYU Winthrop Hospital,30 to 49,115,F,White,Not Span/Hispanic,2,Elective,Home w/ Home Health Services,2017,205,Spondylosis; intervertebral disc disorders; other back problems,006,DECOMP PERIPHERAL NERVE,321,Cervical spinal fusion & other back/neck proc exc disc excis/decomp,08,Diseases and Disorders of the Musculoskeletal System and Conn Tissue,2,Moderate,Minor,Surgical,Blue Cross/Blue Shield,,,,N,N,67013.97,18036.89
Long Island,Nassau,2908000,000511,NYU Winthrop Hospital,70 or Older,117,M,White,Not Span/Hispanic,2,Elective,Home or Self Care,2017,209,Other acquired deformities,158,SPINAL FUSION,321,Cervical spinal fusion & other back/neck proc exc disc excis/decomp,08,Diseases and Disorders of the Musculoskeletal System and Conn Tissue,1,Minor,Moderate,Surgical,Blue Cross/Blue Shield,Medicare,Medicare,,N,N,113201.52,31411.59
Long Island,Nassau,2908000,000511,NYU Winthrop Hospital,50 to 69,117,F,White,Not Span/Hispanic,3,Elective,Home w/ Home Health Services,2017,205,Spondylosis; intervertebral disc disorders; other back problems,009,OTHER OR THER NERV SYS,321,Cervical spinal fusion & other back/neck proc exc disc excis/decomp,08,Diseases and Disorders of the Musculoskeletal System and Conn Tissue,2,Moderate,Minor,Surgical,Private Health Insurance,,,,N,N,75603.74,18748.06
Long Island,Nassau,2908000,000511,NYU Winthrop Hospital,50 to 69,115,F,Other Race,Spanish/Hispanic,1,Elective,Home or Self Care,2017,205,Spondylosis; intervertebral disc disorders; other back problems,158,SPINAL FUSION,321,Cervical spinal fusion & other back/neck proc exc disc excis/decomp,08,Diseases and Disorders of the Musculoskeletal System and Conn Tissue,1,Minor,Minor,Surgical,Private Health Insurance,,,,N,N,109532.53,29958.58
Long Island,Nassau,2908000,000511,NYU Winthrop Hospital,30 to 49,117,F,White,Not Span/Hispanic,2,Elective,Home w/ Home Health Services,2017,205,Spondylosis; intervertebral disc disorders; other back problems,158,SPINAL FUSION,321,Cervical spinal fusion & other back/neck proc exc disc excis/decomp,08,Diseases and Disorders of the Musculoskeletal System and Conn Tissue,1,Minor,Minor,Surgical,Private Health Insurance,,,,N,N,178702.88,48146.32
Long Island,Nassau,2908000,000511,NYU Winthrop Hospital,30 to 49,117,M,White,Not Span/Hispanic,2,Elective,Home w/ Home Health Services,2017,205,Spondylosis; intervertebral disc disorders; other back problems,158,SPINAL FUSION,321,Cervical spinal fusion & other back/neck proc exc disc excis/decomp,08,Diseases and Disorders of the Musculoskeletal System and Conn Tissue,2,Moderate,Minor,Surgical,Private Health Insurance,,,,N,N,63815.18,18471.49
Long Island,Nassau,2908000,000511,NYU Winthrop Hospital,50 to 69,115,M,White,Not Span/Hispanic,16,Emergency,Home or Self Care,2017,205,Spondylosis; intervertebral disc disorders; other back problems,009,OTHER OR THER NERV SYS,321,Cervical spinal fusion & other back/neck proc exc disc excis/decomp,08,Diseases and Disorders of the Musculoskeletal System and Conn Tissue,2,Moderate,Minor,Surgical,Private Health Insurance,Federal/State/Local/VA,,,N,Y,213427.16,46009.86
Long Island,Nassau,2908000,000511,NYU Winthrop Hospital,50 to 69,117,M,White,Not Span/Hispanic,1,Elective,Home or Self Care,2017,231,Other fractures,148,OT FRACTURE/DISLOC PRC,321,Cervical spinal fusion & other back/neck proc exc disc excis/decomp,08,Diseases and Disorders of the Musculoskeletal System and Conn Tissue,1,Minor,Minor,Surgical,Private Health Insurance,,,,N,N,53655.09,15123.49
Long Island,Nassau,2908000,000511,NYU Winthrop Hospital,70 or Older,110,F,White,Not Span/Hispanic,16,Emergency,Skilled Nursing Home,2017,231,Other fractures,148,OT FRACTURE/DISLOC PRC,321,Cervical spinal fusion & other back/neck proc exc disc excis/decomp,08,Diseases and Disorders of the Musculoskeletal System and Conn Tissue,3,Major,Moderate,Surgical,Medicare,Medicare,Private Health Insurance,,N,Y,153617.37,37756.53
Long Island,Nassau,2908000,000511,NYU Winthrop Hospital,30 to 49,,M,Other Race,Spanish/Hispanic,2,Elective,Home or Self Care,2017,205,Spondylosis; intervertebral disc disorders; other back problems,158,SPINAL FUSION,321,Cervical spinal fusion & other back/neck proc exc disc excis/decomp,08,Diseases and Disorders of the Musculoskeletal System and Conn Tissue,1,Minor,Minor,Surgical,Private Health Insurance,,,,N,N,83983.63,24339.02
Long Island,Nassau,2908000,000511,NYU Winthrop Hospital,30 to 49,104,F,Black/African American,Not Span/Hispanic,3,Elective,Home or Self Care,2017,205,Spondylosis; intervertebral disc disorders; other back problems,158,SPINAL FUSION,321,Cervical spinal fusion & other back/neck proc exc disc excis/decomp,08,Diseases and Disorders of the Musculoskeletal System and Conn Tissue,2,Moderate,Minor,Surgical,Private Health Insurance,,,,N,N,83036.03,22662.79
Long Island,Nassau,2908000,000511,NYU Winthrop Hospital,18 to 29,115,F,White,Not Span/Hispanic,3,Emergency,Home or Self Care,2017,205,Spondylosis; intervertebral disc disorders; other back problems,158,SPINAL FUSION,321,Cervical spinal fusion & other back/neck proc exc disc excis/decomp,08,Diseases and Disorders of the Musculoskeletal System and Conn Tissue,1,Minor,Minor,Surgical,Medicaid,Medicaid,Medicaid,,N,Y,163652.73,44859.63
Long Island,Nassau,2908000,000511,NYU Winthrop Hospital,70 or Older,115,F,White,Not Span/Hispanic,5,Emergency,Home w/ Home Health Services,2017,207,Pathological fracture,159,OT DX PRCS ON MUSC/SKEL,321,Cervical spinal fusion & other back/neck proc exc disc excis/decomp,08,Diseases and Disorders of the Musculoskeletal System and Conn Tissue,1,Minor,Moderate,Surgical,Medicare,Medicare,Private Health Insurance,,N,Y,93922.35,24242.05
Long Island,Nassau,2908000,000511,NYU Winthrop Hospital,70 or Older,117,F,White,Not Span/Hispanic,3,Emergency,Home w/ Home Health Services,2017,231,Other fractures,148,OT FRACTURE/DISLOC PRC,321,Cervical spinal fusion & other back/neck proc exc disc excis/decomp,08,Diseases and Disorders of the Musculoskeletal System and Conn Tissue,1,Minor,Minor,Surgical,Medicare,Medicare,Self-Pay,,N,Y,90025.86,19771.02
Long Island,Nassau,2908000,000511,NYU Winthrop Hospital,50 to 69,110,F,White,Not Span/Hispanic,4,Emergency,Skilled Nursing Home,2017,205,Spondylosis; intervertebral disc disorders; other back problems,158,SPINAL FUSION,321,Cervical spinal fusion & other back/neck proc exc disc excis/decomp,08,Diseases and Disorders of the Musculoskeletal System and Conn Tissue,1,Minor,Minor,Surgical,Medicare,,,,N,Y,205238.79,54095.00
Long Island,Nassau,2908000,000511,NYU Winthrop Hospital,70 or Older,112,F,White,Not Span/Hispanic,1,Elective,Inpatient Rehabilitation Facility,2017,207,Pathological fracture,148,OT FRACTURE/DISLOC PRC,321,Cervical spinal fusion & other back/neck proc exc disc excis/decomp,08,Diseases and Disorders of the Musculoskeletal System and Conn Tissue,1,Minor,Moderate,Surgical,Medicare,Medicare,Private Health Insurance,,N,N,54868.27,15590.47
Long Island,Nassau,2908000,000511,NYU Winthrop Hospital,30 to 49,115,M,Black/African American,Not Span/Hispanic,5,Emergency,Home or Self Care,2017,205,Spondylosis; intervertebral disc disorders; other back problems,158,SPINAL FUSION,321,Cervical spinal fusion & other back/neck proc exc disc excis/decomp,08,Diseases and Disorders of the Musculoskeletal System and Conn Tissue,1,Minor,Minor,Surgical,Medicaid,Medicaid,,,N,Y,176016.16,44981.32
Long Island,Nassau,2908000,000511,NYU Winthrop Hospital,50 to 69,117,F,White,Not Span/Hispanic,9,Emergency,Home or Self Care,2017,205,Spondylosis; intervertebral disc disorders; other back problems,174,OT NON-OR THER PRC SKIN,321,Cervical spinal fusion & other back/neck proc exc disc excis/decomp,08,Diseases and Disorders of the Musculoskeletal System and Conn Tissue,1,Minor,Minor,Surgical,Federal/State/Local/VA,,,,N,Y,104784.78,21647.87
Long Island,Nassau,2908000,000511,NYU Winthrop Hospital,50 to 69,113,F,White,Not Span/Hispanic,2,Elective,Home w/ Home Health Services,2017,205,Spondylosis; intervertebral disc disorders; other back problems,158,SPINAL FUSION,321,Cervical spinal fusion & other back/neck proc exc disc excis/decomp,08,Diseases and Disorders of the Musculoskeletal System and Conn Tissue,2,Moderate,Moderate,Surgical,Private Health Insurance,,,,N,N,86856.95,23936.37
Long Island,Nassau,2908000,000511,NYU Winthrop Hospital,30 to 49,113,M,Black/African American,Not Span/Hispanic,2,Elective,Home w/ Home Health Services,2017,205,Spondylosis; intervertebral disc disorders; other back problems,158,SPINAL FUSION,321,Cervical spinal fusion & other back/neck proc exc disc excis/decomp,08,Diseases and Disorders of the Musculoskeletal System and Conn Tissue,1,Minor,Minor,Surgical,Miscellaneous/Other,,,,N,N,94228.32,26440.81
Long Island,Nassau,2908000,000511,NYU Winthrop Hospital,50 to 69,113,M,White,Not Span/Hispanic,3,Elective,Home w/ Home Health Services,2017,205,Spondylosis; intervertebral disc disorders; other back problems,158,SPINAL FUSION,321,Cervical spinal fusion & other back/neck proc exc disc excis/decomp,08,Diseases and Disorders of the Musculoskeletal System and Conn Tissue,1,Minor,Minor,Surgical,Miscellaneous/Other,,,,N,N,205004.52,56324.09
Long Island,Nassau,2908000,000511,NYU Winthrop Hospital,50 to 69,113,M,White,Not Span/Hispanic,1,Elective,Home or Self Care,2017,205,Spondylosis; intervertebral disc disorders; other back problems,158,SPINAL FUSION,321,Cervical spinal fusion & other back/neck proc exc disc excis/decomp,08,Diseases and Disorders of the Musculoskeletal System and Conn Tissue,1,Minor,Minor,Surgical,Medicare,Medicare,,,N,N,107580.75,29209.52
Long Island,Nassau,2908000,000511,NYU Winthrop Hospital,50 to 69,118,M,White,Not Span/Hispanic,1,Elective,Home or Self Care,2017,205,Spondylosis; intervertebral disc disorders; other back problems,158,SPINAL FUSION,321,Cervical spinal fusion & other back/neck proc exc disc excis/decomp,08,Diseases and Disorders of the Musculoskeletal System and Conn Tissue,1,Minor,Minor,Surgical,Private Health Insurance,,,,N,N,104720.34,29144.74
Long Island,Nassau,2908000,000511,NYU Winthrop Hospital,30 to 49,117,F,White,Not Span/Hispanic,2,Elective,Home or Self Care,2017,237,Complication of device; implant or graft,158,SPINAL FUSION,321,Cervical spinal fusion & other back/neck proc exc disc excis/decomp,08,Diseases and Disorders of the Musculoskeletal System and Conn Tissue,1,Minor,Minor,Surgical,Miscellaneous/Other,,,,N,N,100867.11,26979.52
Long Island,Nassau,2908000,000511,NYU Winthrop Hospital,30 to 49,115,M,White,Not Span/Hispanic,4,Elective,Skilled Nursing Home,2017,205,Spondylosis; intervertebral disc disorders; other back problems,158,SPINAL FUSION,321,Cervical spinal fusion & other back/neck proc exc disc excis/decomp,08,Diseases and Disorders of the Musculoskeletal System and Conn Tissue,1,Minor,Minor,Surgical,Miscellaneous/Other,,,,N,N,89173.56,24886.84
Long Island,Nassau,2908000,000511,NYU Winthrop Hospital,50 to 69,112,M,Black/African American,Not Span/Hispanic,3,Elective,Home or Self Care,2017,205,Spondylosis; intervertebral disc disorders; other back problems,158,SPINAL FUSION,321,Cervical spinal fusion & other back/neck proc exc disc excis/decomp,08,Diseases and Disorders of the Musculoskeletal System and Conn Tissue,1,Minor,Minor,Surgical,Private Health Insurance,Private Health Insurance,,,N,N,132633.43,34498.39
Long Island,Nassau,2908000,000511,NYU Winthrop Hospital,50 to 69,117,M,White,Not Span/Hispanic,1,Elective,Home or Self Care,2017,205,Spondylosis; intervertebral disc disorders; other back problems,158,SPINAL FUSION,321,Cervical spinal fusion & other back/neck proc exc disc excis/decomp,08,Diseases and Disorders of the Musculoskeletal System and Conn Tissue,1,Minor,Minor,Surgical,Miscellaneous/Other,,,,N,N,199823.69,52983.20
Long Island,Nassau,2908000,000511,NYU Winthrop Hospital,70 or Older,114,F,White,Not Span/Hispanic,9,Elective,Home w/ Home Health Services,2017,205,Spondylosis; intervertebral disc disorders; other back problems,158,SPINAL FUSION,321,Cervical spinal fusion & other back/neck proc exc disc excis/decomp,08,Diseases and Disorders of the Musculoskeletal System and Conn Tissue,2,Moderate,Moderate,Surgical,Medicare,Medicare,,,N,N,146397.92,39424.54
Long Island,Nassau,2908000,000511,NYU Winthrop Hospital,50 to 69,115,M,White,Not Span/Hispanic,4,Elective,Home w/ Home Health Services,2017,205,Spondylosis; intervertebral disc disorders; other back problems,158,SPINAL FUSION,321,Cervical spinal fusion & other back/neck proc exc disc excis/decomp,08,Diseases and Disorders of the Musculoskeletal System and Conn Tissue,2,Moderate,Minor,Surgical,Medicare,Medicare,Blue Cross/Blue Shield,,N,N,188190.88,49734.74
Long Island,Nassau,2908000,000511,NYU Winthrop Hospital,50 to 69,112,F,Black/African American,Not Span/Hispanic,3,Elective,Home or Self Care,2017,205,Spondylosis; intervertebral disc disorders; other back problems,158,SPINAL FUSION,321,Cervical spinal fusion & other back/neck proc exc disc excis/decomp,08,Diseases and Disorders of the Musculoskeletal System and Conn Tissue,2,Moderate,Minor,Surgical,Private Health Insurance,,,,N,N,94133.44,25683.58
Long Island,Nassau,2908000,000511,NYU Winthrop Hospital,50 to 69,117,M,White,Not Span/Hispanic,2,Elective,Home w/ Home Health Services,2017,205,Spondylosis; intervertebral disc disorders; other back problems,006,DECOMP PERIPHERAL NERVE,321,Cervical spinal fusion & other back/neck proc exc disc excis/decomp,08,Diseases and Disorders of the Musculoskeletal System and Conn Tissue,1,Minor,Minor,Surgical,Private Health Insurance,,,,N,N,72307.88,19093.94
Long Island,Nassau,2908000,000511,NYU Winthrop Hospital,50 to 69,115,M,White,Not Span/Hispanic,3,Elective,Home w/ Home Health Services,2017,205,Spondylosis; intervertebral disc disorders; other back problems,158,SPINAL FUSION,321,Cervical spinal fusion & other back/neck proc exc disc excis/decomp,08,Diseases and Disorders of the Musculoskeletal System and Conn Tissue,2,Moderate,Minor,Surgical,Blue Cross/Blue Shield,,,,N,N,206730.23,56601.63
Long Island,Nassau,2908000,000511,NYU Winthrop Hospital,50 to 69,,F,White,Spanish/Hispanic,3,Elective,Home or Self Care,2017,205,Spondylosis; intervertebral disc disorders; other back problems,158,SPINAL FUSION,321,Cervical spinal fusion & other back/neck proc exc disc excis/decomp,08,Diseases and Disorders of the Musculoskeletal System and Conn Tissue,2,Moderate,Minor,Surgical,Private Health Insurance,,,,N,N,166308.11,45547.41
Long Island,Nassau,2908000,000511,NYU Winthrop Hospital,70 or Older,115,F,White,Not Span/Hispanic,12,Emergency,Skilled Nursing Home,2017,231,Other fractures,148,OT FRACTURE/DISLOC PRC,321,Cervical spinal fusion & other back/neck proc exc disc excis/decomp,08,Diseases and Disorders of the Musculoskeletal System and Conn Tissue,1,Minor,Minor,Surgical,Medicare,Medicare,,,N,Y,126163.94,31587.19
Long Island,Nassau,2908000,000511,NYU Winthrop Hospital,50 to 69,115,F,Black/African American,Not Span/Hispanic,2,Elective,Home or Self Care,2017,205,Spondylosis; intervertebral disc disorders; other back problems,158,SPINAL FUSION,321,Cervical spinal fusion & other back/neck proc exc disc excis/decomp,08,Diseases and Disorders of the Musculoskeletal System and Conn Tissue,2,Moderate,Minor,Surgical,Miscellaneous/Other,,,,N,N,194483.57,51862.64
Long Island,Nassau,2908000,000511,NYU Winthrop Hospital,18 to 29,117,M,White,Not Span/Hispanic,1,Elective,Home or Self Care,2017,205,Spondylosis; intervertebral disc disorders; other back problems,003,LAMINECTOMY; EXC IV DSC,321,Cervical spinal fusion & other back/neck proc exc disc excis/decomp,08,Diseases and Disorders of the Musculoskeletal System and Conn Tissue,1,Minor,Minor,Surgical,Private Health Insurance,,,,N,N,73462.96,21025.60
Long Island,Nassau,2908000,000511,NYU Winthrop Hospital,50 to 69,117,M,White,Not Span/Hispanic,1,Elective,Home or Self Care,2017,205,Spondylosis; intervertebral disc disorders; other back problems,158,SPINAL FUSION,321,Cervical spinal fusion & other back/neck proc exc disc excis/decomp,08,Diseases and Disorders of the Musculoskeletal System and Conn Tissue,1,Minor,Minor,Surgical,Miscellaneous/Other,,,,N,N,121623.44,32749.63
Long Island,Nassau,2908000,000511,NYU Winthrop Hospital,70 or Older,117,F,White,Not Span/Hispanic,12,Emergency,Skilled Nursing Home,2017,231,Other fractures,148,OT FRACTURE/DISLOC PRC,321,Cervical spinal fusion & other back/neck proc exc disc excis/decomp,08,Diseases and Disorders of the Musculoskeletal System and Conn Tissue,2,Moderate,Moderate,Surgical,Medicare,Medicare,Private Health Insurance,,N,Y,210996.31,53102.52
Long Island,Nassau,2908000,000511,NYU Winthrop Hospital,30 to 49,115,M,Black/African American,Not Span/Hispanic,5,Emergency,Home or Self Care,2017,237,Complication of device; implant or graft,158,SPINAL FUSION,321,Cervical spinal fusion & other back/neck proc exc disc excis/decomp,08,Diseases and Disorders of the Musculoskeletal System and Conn Tissue,3,Major,Moderate,Surgical,Private Health Insurance,Medicaid,Medicaid,,N,Y,175794.72,43490.85
Long Island,Nassau,2908000,000511,NYU Winthrop Hospital,70 or Older,115,F,White,Not Span/Hispanic,6,Emergency,Home w/ Home Health Services,2017,207,Pathological fracture,148,OT FRACTURE/DISLOC PRC,321,Cervical spinal fusion & other back/neck proc exc disc excis/decomp,08,Diseases and Disorders of the Musculoskeletal System and Conn Tissue,2,Moderate,Moderate,Surgical,Medicare,Medicare,Private Health Insurance,,N,Y,190260.30,49007.23
Long Island,Nassau,2908000,000511,NYU Winthrop Hospital,30 to 49,117,F,White,Not Span/Hispanic,3,Elective,Home w/ Home Health Services,2017,205,Spondylosis; intervertebral disc disorders; other back problems,158,SPINAL FUSION,321,Cervical spinal fusion & other back/neck proc exc disc excis/decomp,08,Diseases and Disorders of the Musculoskeletal System and Conn Tissue,2,Moderate,Minor,Surgical,Blue Cross/Blue Shield,,,,N,N,138588.60,36258.19
Long Island,Nassau,2908000,000511,NYU Winthrop Hospital,50 to 69,117,M,White,Not Span/Hispanic,4,Elective,Home w/ Home Health Services,2017,205,Spondylosis; intervertebral disc disorders; other back problems,158,SPINAL FUSION,321,Cervical spinal fusion & other back/neck proc exc disc excis/decomp,08,Diseases and Disorders of the Musculoskeletal System and Conn Tissue,1,Minor,Minor,Surgical,Blue Cross/Blue Shield,,,,N,N,175372.35,45636.45
Long Island,Nassau,2908000,000511,NYU Winthrop Hospital,30 to 49,115,M,Other Race,Not Span/Hispanic,2,Elective,Home w/ Home Health Services,2017,205,Spondylosis; intervertebral disc disorders; other back problems,003,LAMINECTOMY; EXC IV DSC,321,Cervical spinal fusion & other back/neck proc exc disc excis/decomp,08,Diseases and Disorders of the Musculoskeletal System and Conn Tissue,1,Minor,Moderate,Surgical,Private Health Insurance,,,,N,N,82112.86,22082.11
Long Island,Nassau,2908000,000511,NYU Winthrop Hospital,50 to 69,110,M,White,Not Span/Hispanic,6,Elective,Home w/ Home Health Services,2017,205,Spondylosis; intervertebral disc disorders; other back problems,006,DECOMP PERIPHERAL NERVE,321,Cervical spinal fusion & other back/neck proc exc disc excis/decomp,08,Diseases and Disorders of the Musculoskeletal System and Conn Tissue,1,Minor,Minor,Surgical,Private Health Insurance,Private Health Insurance,,,N,N,127880.75,29712.27
Long Island,Nassau,2908000,000511,NYU Winthrop Hospital,30 to 49,117,M,White,Not Span/Hispanic,3,Elective,Home w/ Home Health Services,2017,205,Spondylosis; intervertebral disc disorders; other back problems,142,PARTIAL EXCISION BONE,321,Cervical spinal fusion & other back/neck proc exc disc excis/decomp,08,Diseases and Disorders of the Musculoskeletal System and Conn Tissue,2,Moderate,Minor,Surgical,Medicare,Medicare,Medicaid,,N,N,191165.35,51510.11
Long Island,Nassau,2908000,000511,NYU Winthrop Hospital,30 to 49,115,M,White,Not Span/Hispanic,2,Elective,Home w/ Home Health Services,2017,205,Spondylosis; intervertebral disc disorders; other back problems,158,SPINAL FUSION,321,Cervical spinal fusion & other back/neck proc exc disc excis/decomp,08,Diseases and Disorders of the Musculoskeletal System and Conn Tissue,1,Minor,Minor,Surgical,Private Health Insurance,,,,N,N,79198.09,21128.27
Long Island,Nassau,2908000,000511,NYU Winthrop Hospital,70 or Older,114,M,White,Not Span/Hispanic,6,Elective,Home w/ Home Health Services,2017,205,Spondylosis; intervertebral disc disorders; other back problems,006,DECOMP PERIPHERAL NERVE,321,Cervical spinal fusion & other back/neck proc exc disc excis/decomp,08,Diseases and Disorders of the Musculoskeletal System and Conn Tissue,3,Major,Major,Surgical,Medicare,Medicare,Private Health Insurance,,N,N,121985.73,26390.95
Long Island,Nassau,2908000,000511,NYU Winthrop Hospital,50 to 69,115,M,White,Not Span/Hispanic,2,Elective,Home w/ Home Health Services,2017,205,Spondylosis; intervertebral disc disorders; other back problems,006,DECOMP PERIPHERAL NERVE,321,Cervical spinal fusion & other back/neck proc exc disc excis/decomp,08,Diseases and Disorders of the Musculoskeletal System and Conn Tissue,1,Minor,Minor,Surgical,Private Health Insurance,,,,N,N,55059.21,15439.31
Long Island,Nassau,2908000,000511,NYU Winthrop Hospital,30 to 49,117,F,White,Not Span/Hispanic,1,Elective,Home or Self Care,2017,205,Spondylosis; intervertebral disc disorders; other back problems,158,SPINAL FUSION,321,Cervical spinal fusion & other back/neck proc exc disc excis/decomp,08,Diseases and Disorders of the Musculoskeletal System and Conn Tissue,1,Minor,Minor,Surgical,Blue Cross/Blue Shield,,,,N,N,112610.52,30480.83
Long Island,Nassau,2908000,000511,NYU Winthrop Hospital,50 to 69,110,F,White,Not Span/Hispanic,2,Elective,Home w/ Home Health Services,2017,205,Spondylosis; intervertebral disc disorders; other back problems,158,SPINAL FUSION,321,Cervical spinal fusion & other back/neck proc exc disc excis/decomp,08,Diseases and Disorders of the Musculoskeletal System and Conn Tissue,1,Minor,Minor,Surgical,Miscellaneous/Other,,,,N,N,88899.04,23614.89