Hospital Service Area,Hospital County,Operating Certificate Number,Permanent Facility Id,Facility Name,Age Group,Zip Code - 3 digits,Gender,Race,Ethnicity,Length of Stay,Type of Admission,Patient Disposition,Discharge Year,CCS Diagnosis Code,CCS Diagnosis Description,CCS Procedure Code,CCS Procedure Description,APR DRG Code,APR DRG Description,APR MDC Code,APR MDC Description,APR Severity of Illness Code,APR Severity of Illness Description,APR Risk of Mortality,APR Medical Surgical Description,Payment Typology 1,Payment Typology 2,Payment Typology 3,Birth Weight,Abortion Edit Indicator,Emergency Department Indicator,Total Charges,Total Costs
New York City,Richmond,7004010,001738,Richmond University Medical Center,30 to 49,103,M,Black/African American,Not Span/Hispanic,6,Emergency,Home or Self Care,2018,MUS011,SPONDYLOPATHIES/SPONDYLOARTHROPATHY (INCLUDING INFECTIVE),MST013,SPINE FUSION,321,CERVICAL SPINAL FUSION & OTHER BACK/NECK PROC EXC DISC EXCIS/DECOMP,08,DISEASES AND DISORDERS OF THE MUSCULOSKELETAL SYSTEM AND CONNECTIVE TISSUE,3,Major,Minor,Surgical,Medicaid,Medicaid,Self-Pay,,,true,69941.75,18468.83
New York City,Manhattan,7002054,001437,New York-Presbyterian/Lower Manhattan Hospital,50 to 69,116,M,White,Not Span/Hispanic,2,Elective,Home or Self Care,2018,MUS011,SPONDYLOPATHIES/SPONDYLOARTHROPATHY (INCLUDING INFECTIVE),MST013,SPINE FUSION,321,CERVICAL SPINAL FUSION & OTHER BACK/NECK PROC EXC DISC EXCIS/DECOMP,08,DISEASES AND DISORDERS OF THE MUSCULOSKELETAL SYSTEM AND CONNECTIVE TISSUE,1,Minor,Minor,Surgical,Miscellaneous/Other,Self-Pay,,,,false,42704.23,13075.47
New York City,Manhattan,7002054,001458,New York-Presbyterian Hospital - New York Weill Cornell Center,70 or Older,100,M,Other Race,Not Span/Hispanic,3,Emergency,Skilled Nursing Home,2018,MUS016,"STRESS FRACTURE, INITIAL ENCOUNTER",MST012,BONE FIXATION (EXCLUDING EXTREMITIES),321,CERVICAL SPINAL FUSION & OTHER BACK/NECK PROC EXC DISC EXCIS/DECOMP,08,DISEASES AND DISORDERS OF THE MUSCULOSKELETAL SYSTEM AND CONNECTIVE TISSUE,3,Major,Moderate,Surgical,Medicare,Blue Cross/Blue Shield,Self-Pay,,,false,57163.65,18210.37
Western NY,Erie,1401005,000210,Erie County Medical Center,70 or Older,143,M,White,Not Span/Hispanic,13,Emergency,Skilled Nursing Home,2018,INJ002,"FRACTURE OF THE SPINE AND BACK, INITIAL ENCOUNTER",MST013,SPINE FUSION,321,CERVICAL SPINAL FUSION & OTHER BACK/NECK PROC EXC DISC EXCIS/DECOMP,08,DISEASES AND DISORDERS OF THE MUSCULOSKELETAL SYSTEM AND CONNECTIVE TISSUE,3,Major,Extreme,Surgical,Medicare,Blue Cross/Blue Shield,,,,true,56137.5,28432.81
New York City,Manhattan,7002001,001438,Bellevue Hospital Center,70 or Older,100,M,Other Race,Spanish/Hispanic,3,Elective,Home or Self Care,2018,MUS011,SPONDYLOPATHIES/SPONDYLOARTHROPATHY (INCLUDING INFECTIVE),CNS008,SPINAL CORD DECOMPRESSION,321,CERVICAL SPINAL FUSION & OTHER BACK/NECK PROC EXC DISC EXCIS/DECOMP,08,DISEASES AND DISORDERS OF THE MUSCULOSKELETAL SYSTEM AND CONNECTIVE TISSUE,1,Minor,Minor,Surgical,Medicare,Medicare,Medicaid,,,false,21159.12,14062.35
Long Island,Suffolk,5153000,000913,Huntington Hospital,50 to 69,117,F,White,Not Span/Hispanic,8,Emergency,Expired,2018,INJ002,"FRACTURE OF THE SPINE AND BACK, INITIAL ENCOUNTER",MST013,SPINE FUSION,321,CERVICAL SPINAL FUSION & OTHER BACK/NECK PROC EXC DISC EXCIS/DECOMP,08,DISEASES AND DISORDERS OF THE MUSCULOSKELETAL SYSTEM AND CONNECTIVE TISSUE,4,Extreme,Extreme,Surgical,Blue Cross/Blue Shield,Medicare,,,,true,171490.27,42399.71
New York City,Manhattan,7002054,001464,New York-Presbyterian Hospital - Columbia Presbyterian Center,50 to 69,100,M,Other Race,Not Span/Hispanic,120 +,Elective,Home or Self Care,2018,MUS011,SPONDYLOPATHIES/SPONDYLOARTHROPATHY (INCLUDING INFECTIVE),MST013,SPINE FUSION,321,CERVICAL SPINAL FUSION & OTHER BACK/NECK PROC EXC DISC EXCIS/DECOMP,08,DISEASES AND DISORDERS OF THE MUSCULOSKELETAL SYSTEM AND CONNECTIVE TISSUE,3,Major,Moderate,Surgical,Self-Pay,Self-Pay,,,,false,1807415.13,437056.36
New York City,Manhattan,7002054,001458,New York-Presbyterian Hospital - New York Weill Cornell Center,70 or Older,100,F,White,Not Span/Hispanic,1,Elective,Home or Self Care,2018,MUS011,SPONDYLOPATHIES/SPONDYLOARTHROPATHY (INCLUDING INFECTIVE),MST013,SPINE FUSION,321,CERVICAL SPINAL FUSION & OTHER BACK/NECK PROC EXC DISC EXCIS/DECOMP,08,DISEASES AND DISORDERS OF THE MUSCULOSKELETAL SYSTEM AND CONNECTIVE TISSUE,1,Minor,Minor,Surgical,Medicare,Private Health Insurance,Self-Pay,,,false,53323.28,19534.53
Finger Lakes,Monroe,2701005,000413,Strong Memorial Hospital,50 to 69,146,F,White,Not Span/Hispanic,2,Emergency,Home or Self Care,2018,MUS011,SPONDYLOPATHIES/SPONDYLOARTHROPATHY (INCLUDING INFECTIVE),MST016,VERTEBRAL DISCECTOMY,321,CERVICAL SPINAL FUSION & OTHER BACK/NECK PROC EXC DISC EXCIS/DECOMP,08,DISEASES AND DISORDERS OF THE MUSCULOSKELETAL SYSTEM AND CONNECTIVE TISSUE,2,Moderate,Minor,Surgical,Self-Pay,Self-Pay,,,,true,31036.59,13933.07
Hudson Valley,Westchester,5957001,001139,Westchester Medical Center,0 to 17,125,F,Other Race,Unknown,6,Elective,Home or Self Care,2018,INJ035,"COMPLICATION OF INTERNAL ORTHOPEDIC DEVICE OR IMPLANT, INITIAL ENCOUNTER",MST012,BONE FIXATION (EXCLUDING EXTREMITIES),321,CERVICAL SPINAL FUSION & OTHER BACK/NECK PROC EXC DISC EXCIS/DECOMP,08,DISEASES AND DISORDERS OF THE MUSCULOSKELETAL SYSTEM AND CONNECTIVE TISSUE,2,Moderate,Minor,Surgical,Medicaid,Medicaid,,,,false,344188.99,64810.04
Long Island,Nassau,2951001,000541,North Shore University Hospital,50 to 69,114,M,Black/African American,Not Span/Hispanic,2,Elective,Home or Self Care,2018,MUS011,SPONDYLOPATHIES/SPONDYLOARTHROPATHY (INCLUDING INFECTIVE),MST013,SPINE FUSION,321,CERVICAL SPINAL FUSION & OTHER BACK/NECK PROC EXC DISC EXCIS/DECOMP,08,DISEASES AND DISORDERS OF THE MUSCULOSKELETAL SYSTEM AND CONNECTIVE TISSUE,2,Moderate,Minor,Surgical,Private Health Insurance,,,,,false,113486.41,31369.36
Long Island,Nassau,2951001,000541,North Shore University Hospital,70 or Older,117,F,Black/African American,Not Span/Hispanic,10,Elective,Skilled Nursing Home,2018,MUS011,SPONDYLOPATHIES/SPONDYLOARTHROPATHY (INCLUDING INFECTIVE),MST013,SPINE FUSION,321,CERVICAL SPINAL FUSION & OTHER BACK/NECK PROC EXC DISC EXCIS/DECOMP,08,DISEASES AND DISORDERS OF THE MUSCULOSKELETAL SYSTEM AND CONNECTIVE TISSUE,1,Minor,Major,Surgical,Medicare,Medicaid,,,,false,181001.46,38401.54
Long Island,Nassau,2951001,000541,North Shore University Hospital,30 to 49,OOS,F,White,Not Span/Hispanic,4,Elective,Home or Self Care,2018,MUS011,SPONDYLOPATHIES/SPONDYLOARTHROPATHY (INCLUDING INFECTIVE),MST013,SPINE FUSION,321,CERVICAL SPINAL FUSION & OTHER BACK/NECK PROC EXC DISC EXCIS/DECOMP,08,DISEASES AND DISORDERS OF THE MUSCULOSKELETAL SYSTEM AND CONNECTIVE TISSUE,3,Major,Moderate,Surgical,Blue Cross/Blue Shield,,,,,false,176430.04,43795.54
Capital/Adirond,Albany,0101004,000005,St. Peter's Hospital,70 or Older,128,M,White,Not Span/Hispanic,2,Elective,Home w/ Home Health Services,2018,MUS011,SPONDYLOPATHIES/SPONDYLOARTHROPATHY (INCLUDING INFECTIVE),MST013,SPINE FUSION,321,CERVICAL SPINAL FUSION & OTHER BACK/NECK PROC EXC DISC EXCIS/DECOMP,08,DISEASES AND DISORDERS OF THE MUSCULOSKELETAL SYSTEM AND CONNECTIVE TISSUE,1,Minor,Moderate,Surgical,Medicare,Private Health Insurance,,,,false,47812.18,19153.89
Hudson Valley,Westchester,5907001,001097,SJRH - St Johns Division,50 to 69,107,F,White,Not Span/Hispanic,1,Emergency,Home or Self Care,2018,MUS011,SPONDYLOPATHIES/SPONDYLOARTHROPATHY (INCLUDING INFECTIVE),MST012,BONE FIXATION (EXCLUDING EXTREMITIES),321,CERVICAL SPINAL FUSION & OTHER BACK/NECK PROC EXC DISC EXCIS/DECOMP,08,DISEASES AND DISORDERS OF THE MUSCULOSKELETAL SYSTEM AND CONNECTIVE TISSUE,1,Minor,Minor,Surgical,Federal/State/Local/VA,,,,,false,51462.1,22694.1
Long Island,Suffolk,5154001,000925,Good Samaritan Hospital Medical Center,30 to 49,115,M,White,Not Span/Hispanic,2,Elective,Home or Self Care,2018,MUS011,SPONDYLOPATHIES/SPONDYLOARTHROPATHY (INCLUDING INFECTIVE),MST013,SPINE FUSION,321,CERVICAL SPINAL FUSION & OTHER BACK/NECK PROC EXC DISC EXCIS/DECOMP,08,DISEASES AND DISORDERS OF THE MUSCULOSKELETAL SYSTEM AND CONNECTIVE TISSUE,2,Moderate,Minor,Surgical,Blue Cross/Blue Shield,,,,,false,121381.73,23152.14
Capital/Adirond,Albany,0101000,000001,Albany Medical Center Hospital,50 to 69,128,M,White,Not Span/Hispanic,4,Urgent,Skilled Nursing Home,2018,MUS011,SPONDYLOPATHIES/SPONDYLOARTHROPATHY (INCLUDING INFECTIVE),MST013,SPINE FUSION,321,CERVICAL SPINAL FUSION & OTHER BACK/NECK PROC EXC DISC EXCIS/DECOMP,08,DISEASES AND DISORDERS OF THE MUSCULOSKELETAL SYSTEM AND CONNECTIVE TISSUE,2,Moderate,Minor,Surgical,Private Health Insurance,Medicare,,,,false,74595.88,30788.58
Long Island,Nassau,7003004,000518,Long Island Jewish Valley Stream,50 to 69,117,M,White,Not Span/Hispanic,2,Urgent,Home or Self Care,2018,MUS011,SPONDYLOPATHIES/SPONDYLOARTHROPATHY (INCLUDING INFECTIVE),MST013,SPINE FUSION,321,CERVICAL SPINAL FUSION & OTHER BACK/NECK PROC EXC DISC EXCIS/DECOMP,08,DISEASES AND DISORDERS OF THE MUSCULOSKELETAL SYSTEM AND CONNECTIVE TISSUE,2,Moderate,Minor,Surgical,Blue Cross/Blue Shield,,,,,false,68182.89,18818.29
Long Island,Nassau,7003004,000518,Long Island Jewish Valley Stream,50 to 69,117,M,White,Not Span/Hispanic,1,Elective,Home or Self Care,2018,MUS011,SPONDYLOPATHIES/SPONDYLOARTHROPATHY (INCLUDING INFECTIVE),MST013,SPINE FUSION,321,CERVICAL SPINAL FUSION & OTHER BACK/NECK PROC EXC DISC EXCIS/DECOMP,08,DISEASES AND DISORDERS OF THE MUSCULOSKELETAL SYSTEM AND CONNECTIVE TISSUE,1,Minor,Minor,Surgical,Blue Cross/Blue Shield,,,,,false,88537.11,26552.44
New York City,Manhattan,7002054,001437,New York-Presbyterian/Lower Manhattan Hospital,30 to 49,113,M,Other Race,Spanish/Hispanic,2,Elective,Home or Self Care,2018,MUS011,SPONDYLOPATHIES/SPONDYLOARTHROPATHY (INCLUDING INFECTIVE),MST013,SPINE FUSION,321,CERVICAL SPINAL FUSION & OTHER BACK/NECK PROC EXC DISC EXCIS/DECOMP,08,DISEASES AND DISORDERS OF THE MUSCULOSKELETAL SYSTEM AND CONNECTIVE TISSUE,1,Minor,Minor,Surgical,Miscellaneous/Other,Self-Pay,,,,false,43045.44,13175.5
Long Island,Nassau,2951001,000541,North Shore University Hospital,30 to 49,117,F,White,Not Span/Hispanic,1,Elective,Home or Self Care,2018,MUS011,SPONDYLOPATHIES/SPONDYLOARTHROPATHY (INCLUDING INFECTIVE),MST013,SPINE FUSION,321,CERVICAL SPINAL FUSION & OTHER BACK/NECK PROC EXC DISC EXCIS/DECOMP,08,DISEASES AND DISORDERS OF THE MUSCULOSKELETAL SYSTEM AND CONNECTIVE TISSUE,1,Minor,Minor,Surgical,Private Health Insurance,,,,,false,72181.81,21609.97
Long Island,Nassau,2951001,000541,North Shore University Hospital,70 or Older,110,M,White,Not Span/Hispanic,2,Elective,Home or Self Care,2018,MUS011,SPONDYLOPATHIES/SPONDYLOARTHROPATHY (INCLUDING INFECTIVE),MST013,SPINE FUSION,321,CERVICAL SPINAL FUSION & OTHER BACK/NECK PROC EXC DISC EXCIS/DECOMP,08,DISEASES AND DISORDERS OF THE MUSCULOSKELETAL SYSTEM AND CONNECTIVE TISSUE,2,Moderate,Moderate,Surgical,Medicare,Private Health Insurance,,,,false,72770.07,18456.82
Central NY,Onondaga,3301007,000635,University Hospital SUNY Health Science Center,50 to 69,132,F,Black/African American,Not Span/Hispanic,6,Emergency,Inpatient Rehabilitation Facility,2018,MUS011,SPONDYLOPATHIES/SPONDYLOARTHROPATHY (INCLUDING INFECTIVE),CNS008,SPINAL CORD DECOMPRESSION,321,CERVICAL SPINAL FUSION & OTHER BACK/NECK PROC EXC DISC EXCIS/DECOMP,08,DISEASES AND DISORDERS OF THE MUSCULOSKELETAL SYSTEM AND CONNECTIVE TISSUE,2,Moderate,Minor,Surgical,Private Health Insurance,,,,,true,210948.58,61699.69
New York City,Manhattan,7002012,001447,Hospital for Special Surgery,50 to 69,100,M,White,Spanish/Hispanic,2,Elective,Home or Self Care,2018,MUS011,SPONDYLOPATHIES/SPONDYLOARTHROPATHY (INCLUDING INFECTIVE),MST013,SPINE FUSION,321,CERVICAL SPINAL FUSION & OTHER BACK/NECK PROC EXC DISC EXCIS/DECOMP,08,DISEASES AND DISORDERS OF THE MUSCULOSKELETAL SYSTEM AND CONNECTIVE TISSUE,2,Moderate,Minor,Surgical,Blue Cross/Blue Shield,,,,,false,93756,36255.57
Finger Lakes,Ontario,3402000,000671,Geneva General Hospital,50 to 69,145,M,White,Not Span/Hispanic,1,Elective,Home or Self Care,2018,MUS011,SPONDYLOPATHIES/SPONDYLOARTHROPATHY (INCLUDING INFECTIVE),MST013,SPINE FUSION,321,CERVICAL SPINAL FUSION & OTHER BACK/NECK PROC EXC DISC EXCIS/DECOMP,08,DISEASES AND DISORDERS OF THE MUSCULOSKELETAL SYSTEM AND CONNECTIVE TISSUE,1,Minor,Minor,Surgical,Blue Cross/Blue Shield,,,,,false,38656.74,30806.09
New York City,Kings,7001009,001294,Coney Island Hospital,50 to 69,112,M,Other Race,Not Span/Hispanic,10,Emergency,Skilled Nursing Home,2018,MUS011,SPONDYLOPATHIES/SPONDYLOARTHROPATHY (INCLUDING INFECTIVE),MST016,VERTEBRAL DISCECTOMY,321,CERVICAL SPINAL FUSION & OTHER BACK/NECK PROC EXC DISC EXCIS/DECOMP,08,DISEASES AND DISORDERS OF THE MUSCULOSKELETAL SYSTEM AND CONNECTIVE TISSUE,1,Minor,Minor,Surgical,Medicare,Medicare,Medicaid,,,true,85771.62,48008.86
Hudson Valley,Dutchess,1302001,000181,Vassar Brothers Medical Center,50 to 69,125,F,White,Not Span/Hispanic,6,Emergency,Home or Self Care,2018,MUS011,SPONDYLOPATHIES/SPONDYLOARTHROPATHY (INCLUDING INFECTIVE),MST013,SPINE FUSION,321,CERVICAL SPINAL FUSION & OTHER BACK/NECK PROC EXC DISC EXCIS/DECOMP,08,DISEASES AND DISORDERS OF THE MUSCULOSKELETAL SYSTEM AND CONNECTIVE TISSUE,2,Moderate,Minor,Surgical,Blue Cross/Blue Shield,,,,,true,88456.85,33818.01
New York City,Manhattan,7002054,001437,New York-Presbyterian/Lower Manhattan Hospital,18 to 29,OOS,M,Other Race,Not Span/Hispanic,1,Elective,Home or Self Care,2018,MUS011,SPONDYLOPATHIES/SPONDYLOARTHROPATHY (INCLUDING INFECTIVE),MST013,SPINE FUSION,321,CERVICAL SPINAL FUSION & OTHER BACK/NECK PROC EXC DISC EXCIS/DECOMP,08,DISEASES AND DISORDERS OF THE MUSCULOSKELETAL SYSTEM AND CONNECTIVE TISSUE,1,Minor,Minor,Surgical,Miscellaneous/Other,Self-Pay,,,,false,52499.8,20451.05
New York City,Manhattan,7002054,001437,New York-Presbyterian/Lower Manhattan Hospital,18 to 29,114,F,Multi-racial,Not Span/Hispanic,1,Elective,Home or Self Care,2018,MUS011,SPONDYLOPATHIES/SPONDYLOARTHROPATHY (INCLUDING INFECTIVE),MST013,SPINE FUSION,321,CERVICAL SPINAL FUSION & OTHER BACK/NECK PROC EXC DISC EXCIS/DECOMP,08,DISEASES AND DISORDERS OF THE MUSCULOSKELETAL SYSTEM AND CONNECTIVE TISSUE,1,Minor,Minor,Surgical,Miscellaneous/Other,Self-Pay,,,,false,38963.3,13643.06
Hudson Valley,Dutchess,1302001,000181,Vassar Brothers Medical Center,50 to 69,125,M,White,Not Span/Hispanic,5,Urgent,Skilled Nursing Home,2018,MUS011,SPONDYLOPATHIES/SPONDYLOARTHROPATHY (INCLUDING INFECTIVE),MST013,SPINE FUSION,321,CERVICAL SPINAL FUSION & OTHER BACK/NECK PROC EXC DISC EXCIS/DECOMP,08,DISEASES AND DISORDERS OF THE MUSCULOSKELETAL SYSTEM AND CONNECTIVE TISSUE,3,Major,Moderate,Surgical,Medicare,,,,,false,72937.03,31290.71
Central NY,Onondaga,3301003,000630,St. Joseph's Hospital Health Center,50 to 69,130,F,White,Not Span/Hispanic,1,Elective,Home or Self Care,2018,MUS011,SPONDYLOPATHIES/SPONDYLOARTHROPATHY (INCLUDING INFECTIVE),MST013,SPINE FUSION,321,CERVICAL SPINAL FUSION & OTHER BACK/NECK PROC EXC DISC EXCIS/DECOMP,08,DISEASES AND DISORDERS OF THE MUSCULOSKELETAL SYSTEM AND CONNECTIVE TISSUE,1,Minor,Minor,Surgical,Blue Cross/Blue Shield,,,,,false,39526.85,12750.26
Central NY,Onondaga,3301003,000630,St. Joseph's Hospital Health Center,50 to 69,130,M,White,Not Span/Hispanic,1,Elective,Home or Self Care,2018,MUS011,SPONDYLOPATHIES/SPONDYLOARTHROPATHY (INCLUDING INFECTIVE),MST013,SPINE FUSION,321,CERVICAL SPINAL FUSION & OTHER BACK/NECK PROC EXC DISC EXCIS/DECOMP,08,DISEASES AND DISORDERS OF THE MUSCULOSKELETAL SYSTEM AND CONNECTIVE TISSUE,1,Minor,Minor,Surgical,Medicare,,,,,false,54972.09,16894.02
Long Island,Suffolk,5151001,000245,Stony Brook University Hospital,30 to 49,119,M,White,Not Span/Hispanic,1,Elective,Home or Self Care,2018,MUS011,SPONDYLOPATHIES/SPONDYLOARTHROPATHY (INCLUDING INFECTIVE),MST013,SPINE FUSION,321,CERVICAL SPINAL FUSION & OTHER BACK/NECK PROC EXC DISC EXCIS/DECOMP,08,DISEASES AND DISORDERS OF THE MUSCULOSKELETAL SYSTEM AND CONNECTIVE TISSUE,2,Moderate,Minor,Surgical,Private Health Insurance,,,,,false,84470.17,43081.41
Long Island,Suffolk,5151001,000245,Stony Brook University Hospital,50 to 69,117,F,White,Not Span/Hispanic,2,Elective,Home or Self Care,2018,MUS011,SPONDYLOPATHIES/SPONDYLOARTHROPATHY (INCLUDING INFECTIVE),MST013,SPINE FUSION,321,CERVICAL SPINAL FUSION & OTHER BACK/NECK PROC EXC DISC EXCIS/DECOMP,08,DISEASES AND DISORDERS OF THE MUSCULOSKELETAL SYSTEM AND CONNECTIVE TISSUE,1,Minor,Minor,Surgical,Private Health Insurance,,,,,false,50926.79,23759.69
Central NY,Onondaga,3301007,000635,University Hospital SUNY Health Science Center,30 to 49,145,M,White,Not Span/Hispanic,1,Elective,Home or Self Care,2018,MUS011,SPONDYLOPATHIES/SPONDYLOARTHROPATHY (INCLUDING INFECTIVE),MST013,SPINE FUSION,321,CERVICAL SPINAL FUSION & OTHER BACK/NECK PROC EXC DISC EXCIS/DECOMP,08,DISEASES AND DISORDERS OF THE MUSCULOSKELETAL SYSTEM AND CONNECTIVE TISSUE,1,Minor,Minor,Surgical,Federal/State/Local/VA,,,,,false,59000.8,17468.36
Long Island,Nassau,2951001,000541,North Shore University Hospital,30 to 49,116,M,White,Not Span/Hispanic,1,Elective,Home or Self Care,2018,MUS011,SPONDYLOPATHIES/SPONDYLOARTHROPATHY (INCLUDING INFECTIVE),MST013,SPINE FUSION,321,CERVICAL SPINAL FUSION & OTHER BACK/NECK PROC EXC DISC EXCIS/DECOMP,08,DISEASES AND DISORDERS OF THE MUSCULOSKELETAL SYSTEM AND CONNECTIVE TISSUE,2,Moderate,Minor,Surgical,Private Health Insurance,,,,,false,47590.86,13463.42
New York City,Bronx,7000001,001178,BronxCare Hospital Center,50 to 69,104,F,Other Race,Spanish/Hispanic,1,Elective,Home or Self Care,2018,MUS011,SPONDYLOPATHIES/SPONDYLOARTHROPATHY (INCLUDING INFECTIVE),MST013,SPINE FUSION,321,CERVICAL SPINAL FUSION & OTHER BACK/NECK PROC EXC DISC EXCIS/DECOMP,08,DISEASES AND DISORDERS OF THE MUSCULOSKELETAL SYSTEM AND CONNECTIVE TISSUE,1,Minor,Minor,Surgical,Miscellaneous/Other,,,,,false,18770.21,21525.92
Western NY,Erie,1401008,000213,Mercy Hospital of Buffalo,70 or Older,140,F,White,Not Span/Hispanic,12,Emergency,Home or Self Care,2018,MUS013,OSTEOPOROSIS,MST012,BONE FIXATION (EXCLUDING EXTREMITIES),321,CERVICAL SPINAL FUSION & OTHER BACK/NECK PROC EXC DISC EXCIS/DECOMP,08,DISEASES AND DISORDERS OF THE MUSCULOSKELETAL SYSTEM AND CONNECTIVE TISSUE,3,Major,Extreme,Surgical,Medicare,Medicare,,,,true,48016.92,22517.49
Finger Lakes,Monroe,2701005,000413,Strong Memorial Hospital,50 to 69,146,F,White,Not Span/Hispanic,2,Elective,Home w/ Home Health Services,2018,MUS011,SPONDYLOPATHIES/SPONDYLOARTHROPATHY (INCLUDING INFECTIVE),MST013,SPINE FUSION,321,CERVICAL SPINAL FUSION & OTHER BACK/NECK PROC EXC DISC EXCIS/DECOMP,08,DISEASES AND DISORDERS OF THE MUSCULOSKELETAL SYSTEM AND CONNECTIVE TISSUE,1,Minor,Minor,Surgical,Miscellaneous/Other,Medicare,,,,false,45399.68,23437.33
Long Island,Nassau,2908000,000511,NYU Langone Hospital-Long Island,30 to 49,114,F,Black/African American,Not Span/Hispanic,1,Elective,Home or Self Care,2018,MUS011,SPONDYLOPATHIES/SPONDYLOARTHROPATHY (INCLUDING INFECTIVE),MST013,SPINE FUSION,321,CERVICAL SPINAL FUSION & OTHER BACK/NECK PROC EXC DISC EXCIS/DECOMP,08,DISEASES AND DISORDERS OF THE MUSCULOSKELETAL SYSTEM AND CONNECTIVE TISSUE,1,Minor,Minor,Surgical,Miscellaneous/Other,,,,,false,136407.21,21576.22
Western NY,Erie,1401014,000207,Buffalo General Medical Center,70 or Older,146,M,Other Race,Spanish/Hispanic,1,Elective,Home or Self Care,2018,MUS011,SPONDYLOPATHIES/SPONDYLOARTHROPATHY (INCLUDING INFECTIVE),MST013,SPINE FUSION,321,CERVICAL SPINAL FUSION & OTHER BACK/NECK PROC EXC DISC EXCIS/DECOMP,08,DISEASES AND DISORDERS OF THE MUSCULOSKELETAL SYSTEM AND CONNECTIVE TISSUE,1,Minor,Minor,Surgical,Miscellaneous/Other,Medicare,Medicaid,,,false,37204,13815.66
Long Island,Nassau,2952006,000551,St. Joseph Hospital,70 or Older,117,F,White,Not Span/Hispanic,7,Emergency,Skilled Nursing Home,2018,INJ002,"FRACTURE OF THE SPINE AND BACK, INITIAL ENCOUNTER",MST012,BONE FIXATION (EXCLUDING EXTREMITIES),321,CERVICAL SPINAL FUSION & OTHER BACK/NECK PROC EXC DISC EXCIS/DECOMP,08,DISEASES AND DISORDERS OF THE MUSCULOSKELETAL SYSTEM AND CONNECTIVE TISSUE,2,Moderate,Moderate,Surgical,Medicare,Private Health Insurance,,,,true,83538.29,18644.27
New York City,Manhattan,7002054,003975,New York Presbyterian Hospital - Allen Hospital,30 to 49,111,M,White,Not Span/Hispanic,1,Elective,Home or Self Care,2018,MUS011,SPONDYLOPATHIES/SPONDYLOARTHROPATHY (INCLUDING INFECTIVE),MST013,SPINE FUSION,321,CERVICAL SPINAL FUSION & OTHER BACK/NECK PROC EXC DISC EXCIS/DECOMP,08,DISEASES AND DISORDERS OF THE MUSCULOSKELETAL SYSTEM AND CONNECTIVE TISSUE,2,Moderate,Minor,Surgical,Private Health Insurance,Self-Pay,,,,false,22889.21,5789.6
New York City,Manhattan,7002020,001453,Memorial Hospital for Cancer and Allied Diseases,70 or Older,115,M,White,Not Span/Hispanic,6,Emergency,Home or Self Care,2018,MUS014,"PATHOLOGICAL FRACTURE, INITIAL ENCOUNTER",MST012,BONE FIXATION (EXCLUDING EXTREMITIES),321,CERVICAL SPINAL FUSION & OTHER BACK/NECK PROC EXC DISC EXCIS/DECOMP,08,DISEASES AND DISORDERS OF THE MUSCULOSKELETAL SYSTEM AND CONNECTIVE TISSUE,3,Major,Major,Surgical,Medicare,Private Health Insurance,,,,false,114146.33,43189.41
Finger Lakes,Monroe,2701003,000411,Rochester General Hospital,50 to 69,146,M,White,Not Span/Hispanic,2,Elective,Home w/ Home Health Services,2018,MUS011,SPONDYLOPATHIES/SPONDYLOARTHROPATHY (INCLUDING INFECTIVE),MST013,SPINE FUSION,321,CERVICAL SPINAL FUSION & OTHER BACK/NECK PROC EXC DISC EXCIS/DECOMP,08,DISEASES AND DISORDERS OF THE MUSCULOSKELETAL SYSTEM AND CONNECTIVE TISSUE,1,Minor,Minor,Surgical,Miscellaneous/Other,Medicaid,,,,false,13162.07,5456.09
Finger Lakes,Monroe,2701003,000411,Rochester General Hospital,50 to 69,146,M,Black/African American,Not Span/Hispanic,4,Elective,Home or Self Care,2018,MUS011,SPONDYLOPATHIES/SPONDYLOARTHROPATHY (INCLUDING INFECTIVE),CNS008,SPINAL CORD DECOMPRESSION,321,CERVICAL SPINAL FUSION & OTHER BACK/NECK PROC EXC DISC EXCIS/DECOMP,08,DISEASES AND DISORDERS OF THE MUSCULOSKELETAL SYSTEM AND CONNECTIVE TISSUE,1,Minor,Minor,Surgical,Medicaid,,,,,false,70237.75,21009.78
Finger Lakes,Ontario,3402000,000671,Geneva General Hospital,50 to 69,131,M,White,Not Span/Hispanic,1,Elective,Home or Self Care,2018,MUS011,SPONDYLOPATHIES/SPONDYLOARTHROPATHY (INCLUDING INFECTIVE),MST013,SPINE FUSION,321,CERVICAL SPINAL FUSION & OTHER BACK/NECK PROC EXC DISC EXCIS/DECOMP,08,DISEASES AND DISORDERS OF THE MUSCULOSKELETAL SYSTEM AND CONNECTIVE TISSUE,2,Moderate,Minor,Surgical,Miscellaneous/Other,Medicare,,,,false,24215.58,17266.2
New York City,Manhattan,7002053,001446,NYU Langone Orthopedic Hospital,50 to 69,103,F,White,Not Span/Hispanic,3,Elective,Home w/ Home Health Services,2018,MUS011,SPONDYLOPATHIES/SPONDYLOARTHROPATHY (INCLUDING INFECTIVE),MST013,SPINE FUSION,321,CERVICAL SPINAL FUSION & OTHER BACK/NECK PROC EXC DISC EXCIS/DECOMP,08,DISEASES AND DISORDERS OF THE MUSCULOSKELETAL SYSTEM AND CONNECTIVE TISSUE,1,Minor,Minor,Surgical,Medicare,,,,,false,312466.35,55018.63
New York City,Manhattan,7002054,001464,New York-Presbyterian Hospital - Columbia Presbyterian Center,70 or Older,104,F,White,Not Span/Hispanic,7,Emergency,Skilled Nursing Home,2018,INJ002,"FRACTURE OF THE SPINE AND BACK, INITIAL ENCOUNTER",MST013,SPINE FUSION,321,CERVICAL SPINAL FUSION & OTHER BACK/NECK PROC EXC DISC EXCIS/DECOMP,08,DISEASES AND DISORDERS OF THE MUSCULOSKELETAL SYSTEM AND CONNECTIVE TISSUE,3,Major,Major,Surgical,Medicare,Private Health Insurance,Self-Pay,,,true,227180.69,81310.65
Long Island,Suffolk,5153000,000913,Huntington Hospital,50 to 69,,M,White,Spanish/Hispanic,2,Emergency,Home or Self Care,2018,MUS011,SPONDYLOPATHIES/SPONDYLOARTHROPATHY (INCLUDING INFECTIVE),MST013,SPINE FUSION,321,CERVICAL SPINAL FUSION & OTHER BACK/NECK PROC EXC DISC EXCIS/DECOMP,08,DISEASES AND DISORDERS OF THE MUSCULOSKELETAL SYSTEM AND CONNECTIVE TISSUE,1,Minor,Minor,Surgical,Miscellaneous/Other,Medicaid,Medicaid,,,true,62725.73,19666.85