Hospital Service Area,Hospital County,Operating Certificate Number,Permanent Facility Id,Facility Name,Age Group,Zip Code - 3 digits,Gender,Race,Ethnicity,Length of Stay,Type of Admission,Patient Disposition,Discharge Year,CCS Diagnosis Code,CCS Diagnosis Description,CCS Procedure Code,CCS Procedure Description,APR DRG Code,APR DRG Description,APR MDC Code,APR MDC Description,APR Severity of Illness Code,APR Severity of Illness Description,APR Risk of Mortality,APR Medical Surgical Description,Payment Typology 1,Payment Typology 2,Payment Typology 3,Birth Weight,Abortion Edit Indicator,Emergency Department Indicator,Total Charges,Total Costs
New York City,Manhattan,7002053,001446,NYU Langone Orthopedic Hospital,70 or Older,119,F,White,Not Span/Hispanic,1,Elective,Home or Self Care,2020,MUS006,OSTEOARTHRITIS,MST008,ARTHROPLASTY OF OTHER JOINT (EXCLUDING KNEE AND HIP),322,SHOULDER & ELBOW JOINT REPLACEMENT,08,DISEASES AND DISORDERS OF THE MUSCULOSKELETAL SYSTEM AND CONNECTIVE TISSUE,1,Minor,Minor,Surgical,Medicare,Private Health Insurance,,,,N,126011.31,19799.17
New York City,Manhattan,7002053,001446,NYU Langone Orthopedic Hospital,50 to 69,100,M,White,Not Span/Hispanic,1,Elective,Home or Self Care,2020,MUS006,OSTEOARTHRITIS,MST008,ARTHROPLASTY OF OTHER JOINT (EXCLUDING KNEE AND HIP),322,SHOULDER & ELBOW JOINT REPLACEMENT,08,DISEASES AND DISORDERS OF THE MUSCULOSKELETAL SYSTEM AND CONNECTIVE TISSUE,1,Minor,Minor,Surgical,Medicare,Medicare,,,,N,157830.8,24092.76
New York City,Manhattan,7002053,001446,NYU Langone Orthopedic Hospital,70 or Older,109,F,White,Not Span/Hispanic,3,Elective,Skilled Nursing Home,2020,MUS006,OSTEOARTHRITIS,MST008,ARTHROPLASTY OF OTHER JOINT (EXCLUDING KNEE AND HIP),322,SHOULDER & ELBOW JOINT REPLACEMENT,08,DISEASES AND DISORDERS OF THE MUSCULOSKELETAL SYSTEM AND CONNECTIVE TISSUE,1,Minor,Minor,Surgical,Medicare,Medicare,,,,N,147092,27380.24
New York City,Manhattan,7002053,001446,NYU Langone Orthopedic Hospital,70 or Older,103,M,White,Not Span/Hispanic,1,Elective,Home or Self Care,2020,MUS006,OSTEOARTHRITIS,MST008,ARTHROPLASTY OF OTHER JOINT (EXCLUDING KNEE AND HIP),322,SHOULDER & ELBOW JOINT REPLACEMENT,08,DISEASES AND DISORDERS OF THE MUSCULOSKELETAL SYSTEM AND CONNECTIVE TISSUE,1,Minor,Minor,Surgical,Medicaid,,,,,N,226946.86,33815.51
New York City,Manhattan,7002053,001446,NYU Langone Orthopedic Hospital,70 or Older,100,F,White,Not Span/Hispanic,1,Elective,Home or Self Care,2020,MUS006,OSTEOARTHRITIS,MST008,ARTHROPLASTY OF OTHER JOINT (EXCLUDING KNEE AND HIP),322,SHOULDER & ELBOW JOINT REPLACEMENT,08,DISEASES AND DISORDERS OF THE MUSCULOSKELETAL SYSTEM AND CONNECTIVE TISSUE,1,Minor,Minor,Surgical,Medicare,Medicare,,,,N,127973.64,20036.39
New York City,Manhattan,7002053,001446,NYU Langone Orthopedic Hospital,50 to 69,115,M,White,Not Span/Hispanic,1,Elective,Home or Self Care,2020,MUS006,OSTEOARTHRITIS,MST008,ARTHROPLASTY OF OTHER JOINT (EXCLUDING KNEE AND HIP),322,SHOULDER & ELBOW JOINT REPLACEMENT,08,DISEASES AND DISORDERS OF THE MUSCULOSKELETAL SYSTEM AND CONNECTIVE TISSUE,1,Minor,Minor,Surgical,Medicare,Blue Cross/Blue Shield,,,,N,197775.13,29705.08
New York City,Manhattan,7002053,001446,NYU Langone Orthopedic Hospital,50 to 69,100,M,White,Not Span/Hispanic,1,Elective,Home or Self Care,2020,MUS006,OSTEOARTHRITIS,MST008,ARTHROPLASTY OF OTHER JOINT (EXCLUDING KNEE AND HIP),322,SHOULDER & ELBOW JOINT REPLACEMENT,08,DISEASES AND DISORDERS OF THE MUSCULOSKELETAL SYSTEM AND CONNECTIVE TISSUE,1,Minor,Minor,Surgical,Private Health Insurance,,,,,N,143167.21,22021.39
New York City,Manhattan,7002053,001446,NYU Langone Orthopedic Hospital,50 to 69,100,F,Other Race,Spanish/Hispanic,2,Elective,Home w/ Home Health Services,2020,MUS006,OSTEOARTHRITIS,MST008,ARTHROPLASTY OF OTHER JOINT (EXCLUDING KNEE AND HIP),322,SHOULDER & ELBOW JOINT REPLACEMENT,08,DISEASES AND DISORDERS OF THE MUSCULOSKELETAL SYSTEM AND CONNECTIVE TISSUE,1,Minor,Minor,Surgical,Medicaid,,,,,N,195685.15,31732.96
New York City,Manhattan,7002053,001446,NYU Langone Orthopedic Hospital,50 to 69,112,F,Black/African American,Not Span/Hispanic,2,Elective,Home w/ Home Health Services,2020,MUS006,OSTEOARTHRITIS,MST008,ARTHROPLASTY OF OTHER JOINT (EXCLUDING KNEE AND HIP),322,SHOULDER & ELBOW JOINT REPLACEMENT,08,DISEASES AND DISORDERS OF THE MUSCULOSKELETAL SYSTEM AND CONNECTIVE TISSUE,2,Moderate,Minor,Surgical,Medicare,,,,,N,136438.77,23512.52
New York City,Manhattan,7002053,001446,NYU Langone Orthopedic Hospital,70 or Older,113,F,Other Race,Spanish/Hispanic,3,Elective,Skilled Nursing Home,2020,MUS009,TENDON AND SYNOVIAL DISORDERS,MST008,ARTHROPLASTY OF OTHER JOINT (EXCLUDING KNEE AND HIP),322,SHOULDER & ELBOW JOINT REPLACEMENT,08,DISEASES AND DISORDERS OF THE MUSCULOSKELETAL SYSTEM AND CONNECTIVE TISSUE,2,Moderate,Minor,Surgical,Medicare,Medicaid,,,,N,224907.14,38143.77
New York City,Manhattan,7002053,001446,NYU Langone Orthopedic Hospital,70 or Older,100,M,White,Not Span/Hispanic,1,Elective,Home or Self Care,2020,MUS006,OSTEOARTHRITIS,MST008,ARTHROPLASTY OF OTHER JOINT (EXCLUDING KNEE AND HIP),322,SHOULDER & ELBOW JOINT REPLACEMENT,08,DISEASES AND DISORDERS OF THE MUSCULOSKELETAL SYSTEM AND CONNECTIVE TISSUE,1,Minor,Minor,Surgical,Medicare,Blue Cross/Blue Shield,,,,N,159402.12,24376.02
New York City,Manhattan,7002053,001446,NYU Langone Orthopedic Hospital,70 or Older,103,F,White,Not Span/Hispanic,1,Elective,Home or Self Care,2020,MUS006,OSTEOARTHRITIS,MST008,ARTHROPLASTY OF OTHER JOINT (EXCLUDING KNEE AND HIP),322,SHOULDER & ELBOW JOINT REPLACEMENT,08,DISEASES AND DISORDERS OF THE MUSCULOSKELETAL SYSTEM AND CONNECTIVE TISSUE,2,Moderate,Minor,Surgical,Medicare,Blue Cross/Blue Shield,,,,N,197769.96,29552.71
New York City,Manhattan,7002053,001446,NYU Langone Orthopedic Hospital,70 or Older,103,F,White,Not Span/Hispanic,1,Elective,Home w/ Home Health Services,2020,MUS006,OSTEOARTHRITIS,MST008,ARTHROPLASTY OF OTHER JOINT (EXCLUDING KNEE AND HIP),322,SHOULDER & ELBOW JOINT REPLACEMENT,08,DISEASES AND DISORDERS OF THE MUSCULOSKELETAL SYSTEM AND CONNECTIVE TISSUE,2,Moderate,Minor,Surgical,Medicare,Blue Cross/Blue Shield,,,,N,258251.05,37982.08
New York City,Manhattan,7002053,001446,NYU Langone Orthopedic Hospital,70 or Older,100,F,White,Not Span/Hispanic,1,Elective,Home or Self Care,2020,INJ004,"FRACTURE OF THE UPPER LIMB, INITIAL ENCOUNTER",MST008,ARTHROPLASTY OF OTHER JOINT (EXCLUDING KNEE AND HIP),322,SHOULDER & ELBOW JOINT REPLACEMENT,08,DISEASES AND DISORDERS OF THE MUSCULOSKELETAL SYSTEM AND CONNECTIVE TISSUE,1,Minor,Minor,Surgical,Medicare,Medicare,,,,N,265724.59,39186.2
New York City,Manhattan,7002053,001446,NYU Langone Orthopedic Hospital,30 to 49,100,M,White,Not Span/Hispanic,1,Elective,Home w/ Home Health Services,2020,MUS006,OSTEOARTHRITIS,MST008,ARTHROPLASTY OF OTHER JOINT (EXCLUDING KNEE AND HIP),322,SHOULDER & ELBOW JOINT REPLACEMENT,08,DISEASES AND DISORDERS OF THE MUSCULOSKELETAL SYSTEM AND CONNECTIVE TISSUE,1,Minor,Minor,Surgical,Private Health Insurance,,,,,N,313724.8,45650.97
New York City,Manhattan,7002053,001446,NYU Langone Orthopedic Hospital,70 or Older,114,F,Other Race,Spanish/Hispanic,2,Elective,Home w/ Home Health Services,2020,MUS006,OSTEOARTHRITIS,MST008,ARTHROPLASTY OF OTHER JOINT (EXCLUDING KNEE AND HIP),322,SHOULDER & ELBOW JOINT REPLACEMENT,08,DISEASES AND DISORDERS OF THE MUSCULOSKELETAL SYSTEM AND CONNECTIVE TISSUE,2,Moderate,Moderate,Surgical,Medicare,Medicaid,,,,N,216417.02,34705.22
New York City,Manhattan,7002053,001446,NYU Langone Orthopedic Hospital,70 or Older,112,F,White,Spanish/Hispanic,3,Elective,Home w/ Home Health Services,2020,MUS006,OSTEOARTHRITIS,MST008,ARTHROPLASTY OF OTHER JOINT (EXCLUDING KNEE AND HIP),322,SHOULDER & ELBOW JOINT REPLACEMENT,08,DISEASES AND DISORDERS OF THE MUSCULOSKELETAL SYSTEM AND CONNECTIVE TISSUE,2,Moderate,Minor,Surgical,Medicare,Private Health Insurance,,,,N,181011.59,32145.82
New York City,Manhattan,7002053,001446,NYU Langone Orthopedic Hospital,70 or Older,OOS,F,White,Not Span/Hispanic,2,Elective,Home or Self Care,2020,MUS006,OSTEOARTHRITIS,MST008,ARTHROPLASTY OF OTHER JOINT (EXCLUDING KNEE AND HIP),322,SHOULDER & ELBOW JOINT REPLACEMENT,08,DISEASES AND DISORDERS OF THE MUSCULOSKELETAL SYSTEM AND CONNECTIVE TISSUE,2,Moderate,Moderate,Surgical,Medicare,Blue Cross/Blue Shield,,,,N,212208.4,34133.77
New York City,Manhattan,7002053,001446,NYU Langone Orthopedic Hospital,70 or Older,100,F,White,Not Span/Hispanic,2,Elective,Home or Self Care,2020,MUS006,OSTEOARTHRITIS,MST008,ARTHROPLASTY OF OTHER JOINT (EXCLUDING KNEE AND HIP),322,SHOULDER & ELBOW JOINT REPLACEMENT,08,DISEASES AND DISORDERS OF THE MUSCULOSKELETAL SYSTEM AND CONNECTIVE TISSUE,1,Minor,Moderate,Surgical,Medicare,Blue Cross/Blue Shield,,,,N,202557.43,32698.58
New York City,Manhattan,7002053,001446,NYU Langone Orthopedic Hospital,70 or Older,125,M,White,Not Span/Hispanic,2,Elective,Home or Self Care,2020,MUS006,OSTEOARTHRITIS,MST008,ARTHROPLASTY OF OTHER JOINT (EXCLUDING KNEE AND HIP),322,SHOULDER & ELBOW JOINT REPLACEMENT,08,DISEASES AND DISORDERS OF THE MUSCULOSKELETAL SYSTEM AND CONNECTIVE TISSUE,1,Minor,Minor,Surgical,Medicare,Blue Cross/Blue Shield,,,,N,266614.42,44297.08
New York City,Manhattan,7002053,001446,NYU Langone Orthopedic Hospital,70 or Older,100,M,White,Not Span/Hispanic,1,Elective,Home or Self Care,2020,MUS006,OSTEOARTHRITIS,MST008,ARTHROPLASTY OF OTHER JOINT (EXCLUDING KNEE AND HIP),322,SHOULDER & ELBOW JOINT REPLACEMENT,08,DISEASES AND DISORDERS OF THE MUSCULOSKELETAL SYSTEM AND CONNECTIVE TISSUE,1,Minor,Minor,Surgical,Medicare,Medicare,,,,N,134926.8,21003.01
New York City,Manhattan,7002053,001446,NYU Langone Orthopedic Hospital,50 to 69,117,M,White,Not Span/Hispanic,1,Elective,Home w/ Home Health Services,2020,MUS009,TENDON AND SYNOVIAL DISORDERS,MST008,ARTHROPLASTY OF OTHER JOINT (EXCLUDING KNEE AND HIP),322,SHOULDER & ELBOW JOINT REPLACEMENT,08,DISEASES AND DISORDERS OF THE MUSCULOSKELETAL SYSTEM AND CONNECTIVE TISSUE,1,Minor,Minor,Surgical,Medicaid,,,,,N,132081.53,20646.07
New York City,Manhattan,7002053,001446,NYU Langone Orthopedic Hospital,50 to 69,117,F,White,Not Span/Hispanic,1,Elective,Home or Self Care,2020,MUS006,OSTEOARTHRITIS,MST008,ARTHROPLASTY OF OTHER JOINT (EXCLUDING KNEE AND HIP),322,SHOULDER & ELBOW JOINT REPLACEMENT,08,DISEASES AND DISORDERS OF THE MUSCULOSKELETAL SYSTEM AND CONNECTIVE TISSUE,1,Minor,Minor,Surgical,Private Health Insurance,,,,,N,162509.55,24869.85
New York City,Manhattan,7002053,001446,NYU Langone Orthopedic Hospital,50 to 69,,M,Black/African American,Not Span/Hispanic,1,Elective,Home or Self Care,2020,MUS006,OSTEOARTHRITIS,MST008,ARTHROPLASTY OF OTHER JOINT (EXCLUDING KNEE AND HIP),322,SHOULDER & ELBOW JOINT REPLACEMENT,08,DISEASES AND DISORDERS OF THE MUSCULOSKELETAL SYSTEM AND CONNECTIVE TISSUE,1,Minor,Minor,Surgical,Private Health Insurance,,,,,N,112649.29,17901.21
New York City,Manhattan,7002053,001446,NYU Langone Orthopedic Hospital,30 to 49,OOS,F,White,Not Span/Hispanic,1,Elective,Home or Self Care,2020,MUS006,OSTEOARTHRITIS,MST008,ARTHROPLASTY OF OTHER JOINT (EXCLUDING KNEE AND HIP),322,SHOULDER & ELBOW JOINT REPLACEMENT,08,DISEASES AND DISORDERS OF THE MUSCULOSKELETAL SYSTEM AND CONNECTIVE TISSUE,1,Minor,Moderate,Surgical,Private Health Insurance,,,,,N,199927.42,30024.53
New York City,Manhattan,7002053,001446,NYU Langone Orthopedic Hospital,70 or Older,103,M,White,Not Span/Hispanic,1,Elective,Home w/ Home Health Services,2020,MUS006,OSTEOARTHRITIS,MST008,ARTHROPLASTY OF OTHER JOINT (EXCLUDING KNEE AND HIP),322,SHOULDER & ELBOW JOINT REPLACEMENT,08,DISEASES AND DISORDERS OF THE MUSCULOSKELETAL SYSTEM AND CONNECTIVE TISSUE,1,Minor,Minor,Surgical,Medicare,Blue Cross/Blue Shield,,,,N,224920.5,33289.39
New York City,Manhattan,7002053,001446,NYU Langone Orthopedic Hospital,70 or Older,124,F,White,Not Span/Hispanic,1,Elective,Home or Self Care,2020,INJ035,"COMPLICATION OF INTERNAL ORTHOPEDIC DEVICE OR IMPLANT, INITIAL ENCOUNTER",MST008,ARTHROPLASTY OF OTHER JOINT (EXCLUDING KNEE AND HIP),322,SHOULDER & ELBOW JOINT REPLACEMENT,08,DISEASES AND DISORDERS OF THE MUSCULOSKELETAL SYSTEM AND CONNECTIVE TISSUE,1,Minor,Minor,Surgical,Medicare,Medicare,,,,N,162382.84,24797.03
New York City,Manhattan,7002053,001446,NYU Langone Orthopedic Hospital,50 to 69,112,F,White,Not Span/Hispanic,1,Elective,Home w/ Home Health Services,2020,INJ007,"DISLOCATIONS, INITIAL ENCOUNTER",MST008,ARTHROPLASTY OF OTHER JOINT (EXCLUDING KNEE AND HIP),322,SHOULDER & ELBOW JOINT REPLACEMENT,08,DISEASES AND DISORDERS OF THE MUSCULOSKELETAL SYSTEM AND CONNECTIVE TISSUE,1,Minor,Minor,Surgical,Medicare,Private Health Insurance,,,,N,157545.99,24047.64
New York City,Manhattan,7002053,001446,NYU Langone Orthopedic Hospital,30 to 49,112,F,Black/African American,Not Span/Hispanic,1,Elective,Home or Self Care,2020,INJ030,DRUG INDUCED OR TOXIC RELATED CONDITION,MST008,ARTHROPLASTY OF OTHER JOINT (EXCLUDING KNEE AND HIP),322,SHOULDER & ELBOW JOINT REPLACEMENT,08,DISEASES AND DISORDERS OF THE MUSCULOSKELETAL SYSTEM AND CONNECTIVE TISSUE,2,Moderate,Moderate,Surgical,Medicare,Medicaid,,,,N,167779.14,25406.89
New York City,Manhattan,7002053,001446,NYU Langone Orthopedic Hospital,50 to 69,OOS,F,Other Race,Not Span/Hispanic,1,Elective,Home or Self Care,2020,MUS006,OSTEOARTHRITIS,MST008,ARTHROPLASTY OF OTHER JOINT (EXCLUDING KNEE AND HIP),322,SHOULDER & ELBOW JOINT REPLACEMENT,08,DISEASES AND DISORDERS OF THE MUSCULOSKELETAL SYSTEM AND CONNECTIVE TISSUE,1,Minor,Minor,Surgical,Blue Cross/Blue Shield,,,,,N,165446.18,25240.74
New York City,Manhattan,7002053,001446,NYU Langone Orthopedic Hospital,50 to 69,OOS,M,White,Not Span/Hispanic,1,Elective,Home or Self Care,2020,MUS006,OSTEOARTHRITIS,MST008,ARTHROPLASTY OF OTHER JOINT (EXCLUDING KNEE AND HIP),322,SHOULDER & ELBOW JOINT REPLACEMENT,08,DISEASES AND DISORDERS OF THE MUSCULOSKELETAL SYSTEM AND CONNECTIVE TISSUE,1,Minor,Minor,Surgical,Blue Cross/Blue Shield,,,,,N,208613.64,31243.65
New York City,Manhattan,7002053,001446,NYU Langone Orthopedic Hospital,70 or Older,OOS,F,White,Not Span/Hispanic,1,Elective,Home or Self Care,2020,MUS006,OSTEOARTHRITIS,MST008,ARTHROPLASTY OF OTHER JOINT (EXCLUDING KNEE AND HIP),322,SHOULDER & ELBOW JOINT REPLACEMENT,08,DISEASES AND DISORDERS OF THE MUSCULOSKELETAL SYSTEM AND CONNECTIVE TISSUE,1,Minor,Minor,Surgical,Medicare,,,,,N,230334.31,34167.61
New York City,Manhattan,7002053,001446,NYU Langone Orthopedic Hospital,70 or Older,100,F,White,Not Span/Hispanic,2,Elective,Home w/ Home Health Services,2020,MUS006,OSTEOARTHRITIS,MST008,ARTHROPLASTY OF OTHER JOINT (EXCLUDING KNEE AND HIP),322,SHOULDER & ELBOW JOINT REPLACEMENT,08,DISEASES AND DISORDERS OF THE MUSCULOSKELETAL SYSTEM AND CONNECTIVE TISSUE,2,Moderate,Minor,Surgical,Blue Cross/Blue Shield,Medicare,,,,N,168387.55,32489.98
New York City,Manhattan,7002053,001446,NYU Langone Orthopedic Hospital,50 to 69,116,F,White,Not Span/Hispanic,3,Elective,Skilled Nursing Home,2020,MUS009,TENDON AND SYNOVIAL DISORDERS,MST008,ARTHROPLASTY OF OTHER JOINT (EXCLUDING KNEE AND HIP),322,SHOULDER & ELBOW JOINT REPLACEMENT,08,DISEASES AND DISORDERS OF THE MUSCULOSKELETAL SYSTEM AND CONNECTIVE TISSUE,2,Moderate,Minor,Surgical,Medicare,Medicaid,,,,N,148251.23,27446.37
New York City,Manhattan,7002053,001446,NYU Langone Orthopedic Hospital,70 or Older,100,F,Other Race,Unknown,2,Elective,Home w/ Home Health Services,2020,MUS006,OSTEOARTHRITIS,MST008,ARTHROPLASTY OF OTHER JOINT (EXCLUDING KNEE AND HIP),322,SHOULDER & ELBOW JOINT REPLACEMENT,08,DISEASES AND DISORDERS OF THE MUSCULOSKELETAL SYSTEM AND CONNECTIVE TISSUE,1,Minor,Moderate,Surgical,Medicare,Private Health Insurance,,,,N,136493.26,23588.97
New York City,Manhattan,7002053,001446,NYU Langone Orthopedic Hospital,70 or Older,112,F,White,Not Span/Hispanic,3,Elective,Skilled Nursing Home,2020,MUS006,OSTEOARTHRITIS,MST008,ARTHROPLASTY OF OTHER JOINT (EXCLUDING KNEE AND HIP),322,SHOULDER & ELBOW JOINT REPLACEMENT,08,DISEASES AND DISORDERS OF THE MUSCULOSKELETAL SYSTEM AND CONNECTIVE TISSUE,1,Minor,Minor,Surgical,Medicare,Medicare,,,,N,144368.87,26954.24
New York City,Manhattan,7002053,001446,NYU Langone Orthopedic Hospital,70 or Older,,M,White,Not Span/Hispanic,1,Elective,Home or Self Care,2020,MUS006,OSTEOARTHRITIS,MST008,ARTHROPLASTY OF OTHER JOINT (EXCLUDING KNEE AND HIP),322,SHOULDER & ELBOW JOINT REPLACEMENT,08,DISEASES AND DISORDERS OF THE MUSCULOSKELETAL SYSTEM AND CONNECTIVE TISSUE,2,Moderate,Minor,Surgical,Medicare,Blue Cross/Blue Shield,,,,N,162200.13,24405.45
New York City,Manhattan,7002053,001446,NYU Langone Orthopedic Hospital,70 or Older,125,M,White,Not Span/Hispanic,2,Urgent,Home or Self Care,2020,INJ035,"COMPLICATION OF INTERNAL ORTHOPEDIC DEVICE OR IMPLANT, INITIAL ENCOUNTER",MST008,ARTHROPLASTY OF OTHER JOINT (EXCLUDING KNEE AND HIP),322,SHOULDER & ELBOW JOINT REPLACEMENT,08,DISEASES AND DISORDERS OF THE MUSCULOSKELETAL SYSTEM AND CONNECTIVE TISSUE,2,Moderate,Minor,Surgical,Medicare,Blue Cross/Blue Shield,,,,N,84597.92,16148.17
New York City,Manhattan,7002053,001446,NYU Langone Orthopedic Hospital,70 or Older,100,F,Other Race,Not Span/Hispanic,9,Elective,Home w/ Home Health Services,2020,MUS006,OSTEOARTHRITIS,MST008,ARTHROPLASTY OF OTHER JOINT (EXCLUDING KNEE AND HIP),322,SHOULDER & ELBOW JOINT REPLACEMENT,08,DISEASES AND DISORDERS OF THE MUSCULOSKELETAL SYSTEM AND CONNECTIVE TISSUE,2,Moderate,Moderate,Surgical,Medicare,,,,,N,244138.21,54515.98
New York City,Manhattan,7002053,001446,NYU Langone Orthopedic Hospital,50 to 69,112,M,White,Not Span/Hispanic,1,Elective,Home or Self Care,2020,MUS006,OSTEOARTHRITIS,MST008,ARTHROPLASTY OF OTHER JOINT (EXCLUDING KNEE AND HIP),322,SHOULDER & ELBOW JOINT REPLACEMENT,08,DISEASES AND DISORDERS OF THE MUSCULOSKELETAL SYSTEM AND CONNECTIVE TISSUE,1,Minor,Minor,Surgical,Medicaid,,,,,N,109883.99,17555.68
New York City,Manhattan,7002053,001446,NYU Langone Orthopedic Hospital,50 to 69,OOS,M,Black/African American,Not Span/Hispanic,1,Elective,Home or Self Care,2020,MUS006,OSTEOARTHRITIS,MST008,ARTHROPLASTY OF OTHER JOINT (EXCLUDING KNEE AND HIP),322,SHOULDER & ELBOW JOINT REPLACEMENT,08,DISEASES AND DISORDERS OF THE MUSCULOSKELETAL SYSTEM AND CONNECTIVE TISSUE,1,Minor,Minor,Surgical,Blue Cross/Blue Shield,,,,,N,219517.05,32817.59
New York City,Manhattan,7002053,001446,NYU Langone Orthopedic Hospital,70 or Older,100,F,White,Not Span/Hispanic,1,Elective,Home or Self Care,2020,MUS006,OSTEOARTHRITIS,MST008,ARTHROPLASTY OF OTHER JOINT (EXCLUDING KNEE AND HIP),322,SHOULDER & ELBOW JOINT REPLACEMENT,08,DISEASES AND DISORDERS OF THE MUSCULOSKELETAL SYSTEM AND CONNECTIVE TISSUE,1,Minor,Minor,Surgical,Medicare,Medicare,,,,N,133520.6,20800.08
New York City,Manhattan,7002053,001446,NYU Langone Orthopedic Hospital,50 to 69,OOS,F,White,Not Span/Hispanic,1,Elective,Home or Self Care,2020,MUS006,OSTEOARTHRITIS,MST008,ARTHROPLASTY OF OTHER JOINT (EXCLUDING KNEE AND HIP),322,SHOULDER & ELBOW JOINT REPLACEMENT,08,DISEASES AND DISORDERS OF THE MUSCULOSKELETAL SYSTEM AND CONNECTIVE TISSUE,2,Moderate,Minor,Surgical,Medicare,Blue Cross/Blue Shield,,,,N,156458.08,23979.95
New York City,Manhattan,7002053,001446,NYU Langone Orthopedic Hospital,70 or Older,115,M,White,Not Span/Hispanic,2,Elective,Home w/ Home Health Services,2020,MUS006,OSTEOARTHRITIS,MST008,ARTHROPLASTY OF OTHER JOINT (EXCLUDING KNEE AND HIP),322,SHOULDER & ELBOW JOINT REPLACEMENT,08,DISEASES AND DISORDERS OF THE MUSCULOSKELETAL SYSTEM AND CONNECTIVE TISSUE,1,Minor,Minor,Surgical,Medicare,Private Health Insurance,,,,N,156071.87,26326.49
New York City,Manhattan,7002053,001446,NYU Langone Orthopedic Hospital,50 to 69,113,M,Other Race,Not Span/Hispanic,1,Elective,Home or Self Care,2020,MUS006,OSTEOARTHRITIS,MST008,ARTHROPLASTY OF OTHER JOINT (EXCLUDING KNEE AND HIP),322,SHOULDER & ELBOW JOINT REPLACEMENT,08,DISEASES AND DISORDERS OF THE MUSCULOSKELETAL SYSTEM AND CONNECTIVE TISSUE,1,Minor,Minor,Surgical,Miscellaneous/Other,,,,,N,148367.69,22863.47
New York City,Manhattan,7002053,001446,NYU Langone Orthopedic Hospital,50 to 69,115,M,White,Not Span/Hispanic,1,Elective,Home or Self Care,2020,MUS006,OSTEOARTHRITIS,MST008,ARTHROPLASTY OF OTHER JOINT (EXCLUDING KNEE AND HIP),322,SHOULDER & ELBOW JOINT REPLACEMENT,08,DISEASES AND DISORDERS OF THE MUSCULOSKELETAL SYSTEM AND CONNECTIVE TISSUE,1,Minor,Moderate,Surgical,Blue Cross/Blue Shield,,,,,N,226328.82,33714.29
New York City,Manhattan,7002053,001446,NYU Langone Orthopedic Hospital,50 to 69,100,F,Other Race,Spanish/Hispanic,1,Elective,Home w/ Home Health Services,2020,MUS006,OSTEOARTHRITIS,MST008,ARTHROPLASTY OF OTHER JOINT (EXCLUDING KNEE AND HIP),322,SHOULDER & ELBOW JOINT REPLACEMENT,08,DISEASES AND DISORDERS OF THE MUSCULOSKELETAL SYSTEM AND CONNECTIVE TISSUE,1,Minor,Minor,Surgical,Blue Cross/Blue Shield,,,,,N,144846.47,22247.3
New York City,Manhattan,7002053,001446,NYU Langone Orthopedic Hospital,50 to 69,,M,Other Race,Unknown,2,Elective,Home or Self Care,2020,MUS006,OSTEOARTHRITIS,MST008,ARTHROPLASTY OF OTHER JOINT (EXCLUDING KNEE AND HIP),322,SHOULDER & ELBOW JOINT REPLACEMENT,08,DISEASES AND DISORDERS OF THE MUSCULOSKELETAL SYSTEM AND CONNECTIVE TISSUE,1,Minor,Moderate,Surgical,Medicaid,,,,,N,202522.33,31537.89
New York City,Manhattan,7002053,001446,NYU Langone Orthopedic Hospital,50 to 69,115,M,White,Not Span/Hispanic,1,Elective,Home or Self Care,2020,MUS006,OSTEOARTHRITIS,MST008,ARTHROPLASTY OF OTHER JOINT (EXCLUDING KNEE AND HIP),322,SHOULDER & ELBOW JOINT REPLACEMENT,08,DISEASES AND DISORDERS OF THE MUSCULOSKELETAL SYSTEM AND CONNECTIVE TISSUE,1,Minor,Minor,Surgical,Blue Cross/Blue Shield,,,,,N,202292.94,30281.58
New York City,Manhattan,7002053,001446,NYU Langone Orthopedic Hospital,70 or Older,105,M,White,Not Span/Hispanic,1,Elective,Home or Self Care,2020,INJ024,"SPRAINS AND STRAINS, INITIAL ENCOUNTER",MST008,ARTHROPLASTY OF OTHER JOINT (EXCLUDING KNEE AND HIP),322,SHOULDER & ELBOW JOINT REPLACEMENT,08,DISEASES AND DISORDERS OF THE MUSCULOSKELETAL SYSTEM AND CONNECTIVE TISSUE,1,Minor,Minor,Surgical,Medicare,Blue Cross/Blue Shield,,,,N,226687.94,33800.32
New York City,Manhattan,7002053,001446,NYU Langone Orthopedic Hospital,70 or Older,100,M,Other Race,Spanish/Hispanic,1,Elective,Home w/ Home Health Services,2020,INJ024,"SPRAINS AND STRAINS, INITIAL ENCOUNTER",MST008,ARTHROPLASTY OF OTHER JOINT (EXCLUDING KNEE AND HIP),322,SHOULDER & ELBOW JOINT REPLACEMENT,08,DISEASES AND DISORDERS OF THE MUSCULOSKELETAL SYSTEM AND CONNECTIVE TISSUE,1,Minor,Minor,Surgical,Medicare,Medicaid,,,,N,170924.86,25472.28
New York City,Manhattan,7002053,001446,NYU Langone Orthopedic Hospital,50 to 69,114,F,White,Not Span/Hispanic,1,Elective,Home or Self Care,2020,MUS006,OSTEOARTHRITIS,MST008,ARTHROPLASTY OF OTHER JOINT (EXCLUDING KNEE AND HIP),322,SHOULDER & ELBOW JOINT REPLACEMENT,08,DISEASES AND DISORDERS OF THE MUSCULOSKELETAL SYSTEM AND CONNECTIVE TISSUE,1,Minor,Minor,Surgical,Medicare,Blue Cross/Blue Shield,,,,N,226910.09,33768.69
New York City,Manhattan,7002053,001446,NYU Langone Orthopedic Hospital,70 or Older,100,F,White,Not Span/Hispanic,1,Elective,Home or Self Care,2020,MUS006,OSTEOARTHRITIS,MST008,ARTHROPLASTY OF OTHER JOINT (EXCLUDING KNEE AND HIP),322,SHOULDER & ELBOW JOINT REPLACEMENT,08,DISEASES AND DISORDERS OF THE MUSCULOSKELETAL SYSTEM AND CONNECTIVE TISSUE,1,Minor,Minor,Surgical,Medicare,Medicare,,,,N,138953.59,21447.27
New York City,Manhattan,7002053,001446,NYU Langone Orthopedic Hospital,70 or Older,116,M,White,Not Span/Hispanic,1,Elective,Home or Self Care,2020,MUS006,OSTEOARTHRITIS,MST008,ARTHROPLASTY OF OTHER JOINT (EXCLUDING KNEE AND HIP),322,SHOULDER & ELBOW JOINT REPLACEMENT,08,DISEASES AND DISORDERS OF THE MUSCULOSKELETAL SYSTEM AND CONNECTIVE TISSUE,1,Minor,Minor,Surgical,Medicare,Medicare,,,,N,447550.38,64498.53