Hospital Service Area,Hospital County,Operating Certificate Number,Permanent Facility Id,Facility Name,Age Group,Zip Code - 3 digits,Gender,Race,Ethnicity,Length of Stay,Type of Admission,Patient Disposition,Discharge Year,CCS Diagnosis Code,CCS Diagnosis Description,CCS Procedure Code,CCS Procedure Description,APR DRG Code,APR DRG Description,APR MDC Code,APR MDC Description,APR Severity of Illness Code,APR Severity of Illness Description,APR Risk of Mortality,APR Medical Surgical Description,Payment Typology 1,Payment Typology 2,Payment Typology 3,Birth Weight,Abortion Edit Indicator,Emergency Department Indicator,Total Charges,Total Costs
New York City,Kings,7002053,001304,NYU Langone Hospital-Brooklyn,70 or Older,112,F,White,Not Span/Hispanic,7,Emergency,Skilled Nursing Home,2019,MUS013,OSTEOPOROSIS,,,340,FRACTURE OF FEMUR,08,DISEASES AND DISORDERS OF THE MUSCULOSKELETAL SYSTEM AND CONNECTIVE TISSUE,3,Major,Major,Medical,Medicare,,,,,true,91484.63,32274.76
New York City,Kings,7002053,001304,NYU Langone Hospital-Brooklyn,70 or Older,112,F,White,Not Span/Hispanic,1,Emergency,Short-term Hospital,2019,INJ006,"FRACTURE OF THE NECK OF THE FEMUR (HIP), INITIAL ENCOUNTER",,,340,FRACTURE OF FEMUR,08,DISEASES AND DISORDERS OF THE MUSCULOSKELETAL SYSTEM AND CONNECTIVE TISSUE,2,Moderate,Moderate,Medical,Medicare,Medicaid,,,,true,21549.03,5458.92
New York City,Kings,7002053,001304,NYU Langone Hospital-Brooklyn,70 or Older,112,F,White,Not Span/Hispanic,10,Emergency,Home w/ Home Health Services,2019,MUS016,"STRESS FRACTURE, INITIAL ENCOUNTER",,,340,FRACTURE OF FEMUR,08,DISEASES AND DISORDERS OF THE MUSCULOSKELETAL SYSTEM AND CONNECTIVE TISSUE,2,Moderate,Moderate,Medical,Medicare,Medicare,,,,true,89640.68,35608.63
New York City,Kings,7002053,001304,NYU Langone Hospital-Brooklyn,70 or Older,112,F,White,Not Span/Hispanic,3,Emergency,Skilled Nursing Home,2019,INJ005,"FRACTURE OF THE LOWER LIMB (EXCEPT HIP), INITIAL ENCOUNTER",PLC001,IMMOBILIZATION BY SPLINT OR OTHER EXTERNAL DEVICE,340,FRACTURE OF FEMUR,08,DISEASES AND DISORDERS OF THE MUSCULOSKELETAL SYSTEM AND CONNECTIVE TISSUE,1,Minor,Minor,Medical,Medicare,Medicaid,,,,true,51242.02,16008.03
New York City,Kings,7002053,001304,NYU Langone Hospital-Brooklyn,70 or Older,112,F,Black/African American,Not Span/Hispanic,18,Emergency,Skilled Nursing Home,2019,INJ005,"FRACTURE OF THE LOWER LIMB (EXCEPT HIP), INITIAL ENCOUNTER",ADM021,"ADMINISTRATION OF THERAPEUTIC SUBSTANCES, NEC",340,FRACTURE OF FEMUR,08,DISEASES AND DISORDERS OF THE MUSCULOSKELETAL SYSTEM AND CONNECTIVE TISSUE,2,Moderate,Minor,Medical,Medicare,,,,,true,146202.03,58596.39
New York City,Kings,7002053,001304,NYU Langone Hospital-Brooklyn,70 or Older,112,F,White,Not Span/Hispanic,3,Emergency,Skilled Nursing Home,2019,MUS013,OSTEOPOROSIS,,,340,FRACTURE OF FEMUR,08,DISEASES AND DISORDERS OF THE MUSCULOSKELETAL SYSTEM AND CONNECTIVE TISSUE,2,Moderate,Moderate,Medical,Medicare,Medicaid,,,,true,45911.15,15380.95
New York City,Kings,7002053,001304,NYU Langone Hospital-Brooklyn,70 or Older,112,F,White,Not Span/Hispanic,3,Emergency,Skilled Nursing Home,2019,INJ005,"FRACTURE OF THE LOWER LIMB (EXCEPT HIP), INITIAL ENCOUNTER",,,340,FRACTURE OF FEMUR,08,DISEASES AND DISORDERS OF THE MUSCULOSKELETAL SYSTEM AND CONNECTIVE TISSUE,3,Major,Major,Medical,Medicare,Medicaid,,,,true,67280.88,24570.5
New York City,Kings,7002053,001304,NYU Langone Hospital-Brooklyn,70 or Older,112,F,Other Race,Spanish/Hispanic,1,Emergency,Skilled Nursing Home,2019,MUS013,OSTEOPOROSIS,,,340,FRACTURE OF FEMUR,08,DISEASES AND DISORDERS OF THE MUSCULOSKELETAL SYSTEM AND CONNECTIVE TISSUE,2,Moderate,Minor,Medical,Medicare,,,,,true,37450.43,10137.71
New York City,Kings,7002053,001304,NYU Langone Hospital-Brooklyn,70 or Older,112,F,White,Not Span/Hispanic,3,Emergency,Inpatient Rehabilitation Facility,2019,INJ006,"FRACTURE OF THE NECK OF THE FEMUR (HIP), INITIAL ENCOUNTER",,,340,FRACTURE OF FEMUR,08,DISEASES AND DISORDERS OF THE MUSCULOSKELETAL SYSTEM AND CONNECTIVE TISSUE,2,Moderate,Moderate,Medical,Medicare,Medicaid,,,,true,60150.36,21057.33
New York City,Kings,7002053,001304,NYU Langone Hospital-Brooklyn,70 or Older,112,F,White,Not Span/Hispanic,12,Emergency,Hospice - Medical Facility,2019,INJ006,"FRACTURE OF THE NECK OF THE FEMUR (HIP), INITIAL ENCOUNTER",,,340,FRACTURE OF FEMUR,08,DISEASES AND DISORDERS OF THE MUSCULOSKELETAL SYSTEM AND CONNECTIVE TISSUE,3,Major,Major,Medical,Medicare,Medicaid,,,,true,132447.12,50769.71
New York City,Kings,7002053,001304,NYU Langone Hospital-Brooklyn,70 or Older,112,F,White,Not Span/Hispanic,17,Emergency,Hospice - Medical Facility,2019,INJ006,"FRACTURE OF THE NECK OF THE FEMUR (HIP), INITIAL ENCOUNTER",,,340,FRACTURE OF FEMUR,08,DISEASES AND DISORDERS OF THE MUSCULOSKELETAL SYSTEM AND CONNECTIVE TISSUE,3,Major,Major,Medical,Private Health Insurance,,,,,true,216469.61,103999.45
New York City,Kings,7002053,001304,NYU Langone Hospital-Brooklyn,70 or Older,112,F,White,Not Span/Hispanic,11,Emergency,Skilled Nursing Home,2019,INJ006,"FRACTURE OF THE NECK OF THE FEMUR (HIP), INITIAL ENCOUNTER",,,340,FRACTURE OF FEMUR,08,DISEASES AND DISORDERS OF THE MUSCULOSKELETAL SYSTEM AND CONNECTIVE TISSUE,4,Extreme,Major,Medical,Medicare,Blue Cross/Blue Shield,,,,true,205760.3,77721.73
New York City,Kings,7002053,001304,NYU Langone Hospital-Brooklyn,50 to 69,112,M,White,Spanish/Hispanic,4,Emergency,Home w/ Home Health Services,2019,INJ005,"FRACTURE OF THE LOWER LIMB (EXCEPT HIP), INITIAL ENCOUNTER",,,340,FRACTURE OF FEMUR,08,DISEASES AND DISORDERS OF THE MUSCULOSKELETAL SYSTEM AND CONNECTIVE TISSUE,3,Major,Moderate,Medical,Medicaid,,,,,true,65548.31,15449.42
New York City,Kings,7002053,001304,NYU Langone Hospital-Brooklyn,70 or Older,112,F,White,Not Span/Hispanic,5,Emergency,Skilled Nursing Home,2019,INJ005,"FRACTURE OF THE LOWER LIMB (EXCEPT HIP), INITIAL ENCOUNTER",ADM021,"ADMINISTRATION OF THERAPEUTIC SUBSTANCES, NEC",340,FRACTURE OF FEMUR,08,DISEASES AND DISORDERS OF THE MUSCULOSKELETAL SYSTEM AND CONNECTIVE TISSUE,2,Moderate,Major,Medical,Medicare,Blue Cross/Blue Shield,,,,true,56623.14,19049.19
New York City,Kings,7002053,001304,NYU Langone Hospital-Brooklyn,70 or Older,112,F,White,Not Span/Hispanic,5,Emergency,Skilled Nursing Home,2019,INJ005,"FRACTURE OF THE LOWER LIMB (EXCEPT HIP), INITIAL ENCOUNTER",PLC001,IMMOBILIZATION BY SPLINT OR OTHER EXTERNAL DEVICE,340,FRACTURE OF FEMUR,08,DISEASES AND DISORDERS OF THE MUSCULOSKELETAL SYSTEM AND CONNECTIVE TISSUE,2,Moderate,Moderate,Medical,Medicare,Medicaid,,,,true,77085.02,19777.23
New York City,Kings,7002053,001304,NYU Langone Hospital-Brooklyn,70 or Older,112,F,Other Race,Not Span/Hispanic,2,Emergency,Home or Self Care,2019,INJ006,"FRACTURE OF THE NECK OF THE FEMUR (HIP), INITIAL ENCOUNTER",,,340,FRACTURE OF FEMUR,08,DISEASES AND DISORDERS OF THE MUSCULOSKELETAL SYSTEM AND CONNECTIVE TISSUE,1,Minor,Minor,Medical,Medicare,,,,,true,36402.54,10000.63
New York City,Kings,7002053,001304,NYU Langone Hospital-Brooklyn,50 to 69,112,M,Other Race,Not Span/Hispanic,6,Emergency,Home or Self Care,2019,INJ006,"FRACTURE OF THE NECK OF THE FEMUR (HIP), INITIAL ENCOUNTER",,,340,FRACTURE OF FEMUR,08,DISEASES AND DISORDERS OF THE MUSCULOSKELETAL SYSTEM AND CONNECTIVE TISSUE,3,Major,Moderate,Medical,Medicaid,,,,,true,64933.81,27194.78
New York City,Kings,7002053,001304,NYU Langone Hospital-Brooklyn,70 or Older,112,F,White,Not Span/Hispanic,3,Emergency,Skilled Nursing Home,2019,INJ005,"FRACTURE OF THE LOWER LIMB (EXCEPT HIP), INITIAL ENCOUNTER",,,340,FRACTURE OF FEMUR,08,DISEASES AND DISORDERS OF THE MUSCULOSKELETAL SYSTEM AND CONNECTIVE TISSUE,3,Major,Moderate,Medical,Medicare,Medicare,Medicaid,,,true,60407.3,20398.15
New York City,Kings,7002053,001304,NYU Langone Hospital-Brooklyn,70 or Older,112,F,Other Race,Spanish/Hispanic,2,Emergency,Home w/ Home Health Services,2019,INJ005,"FRACTURE OF THE LOWER LIMB (EXCEPT HIP), INITIAL ENCOUNTER",IMG006,COMPUTERIZED TOMOGRAPHY (CT) WITH CONTRAST,340,FRACTURE OF FEMUR,08,DISEASES AND DISORDERS OF THE MUSCULOSKELETAL SYSTEM AND CONNECTIVE TISSUE,3,Major,Major,Medical,Medicaid,Medicaid,,,,true,70378.48,15277.3
New York City,Kings,7002053,001304,NYU Langone Hospital-Brooklyn,70 or Older,112,F,White,Not Span/Hispanic,3,Emergency,Skilled Nursing Home,2019,INJ006,"FRACTURE OF THE NECK OF THE FEMUR (HIP), INITIAL ENCOUNTER",,,340,FRACTURE OF FEMUR,08,DISEASES AND DISORDERS OF THE MUSCULOSKELETAL SYSTEM AND CONNECTIVE TISSUE,2,Moderate,Moderate,Medical,Medicare,Private Health Insurance,,,,true,56672.09,18203.05
New York City,Kings,7002053,001304,NYU Langone Hospital-Brooklyn,70 or Older,103,F,White,Not Span/Hispanic,3,Emergency,Skilled Nursing Home,2019,INJ005,"FRACTURE OF THE LOWER LIMB (EXCEPT HIP), INITIAL ENCOUNTER",,,340,FRACTURE OF FEMUR,08,DISEASES AND DISORDERS OF THE MUSCULOSKELETAL SYSTEM AND CONNECTIVE TISSUE,2,Moderate,Minor,Medical,Medicare,Blue Cross/Blue Shield,,,,true,71699.89,19749.11
New York City,Kings,7002053,001304,NYU Langone Hospital-Brooklyn,70 or Older,112,F,White,Not Span/Hispanic,8,Emergency,Skilled Nursing Home,2019,MUS013,OSTEOPOROSIS,ADM001,TRANSFUSION OF BLOOD AND BLOOD PRODUCTS,340,FRACTURE OF FEMUR,08,DISEASES AND DISORDERS OF THE MUSCULOSKELETAL SYSTEM AND CONNECTIVE TISSUE,3,Major,Moderate,Medical,Medicare,,,,,true,83595.05,32268.15
New York City,Kings,7002053,001304,NYU Langone Hospital-Brooklyn,30 to 49,112,M,Other Race,Not Span/Hispanic,3,Emergency,Home or Self Care,2019,INJ006,"FRACTURE OF THE NECK OF THE FEMUR (HIP), INITIAL ENCOUNTER",MAM011,ELECTROENCEPHALOGRAM (EEG),340,FRACTURE OF FEMUR,08,DISEASES AND DISORDERS OF THE MUSCULOSKELETAL SYSTEM AND CONNECTIVE TISSUE,2,Moderate,Moderate,Medical,Medicaid,,,,,true,146681.85,24873.54
New York City,Kings,7002053,001304,NYU Langone Hospital-Brooklyn,70 or Older,112,M,White,Not Span/Hispanic,3,Emergency,Skilled Nursing Home,2019,INJ006,"FRACTURE OF THE NECK OF THE FEMUR (HIP), INITIAL ENCOUNTER",,,340,FRACTURE OF FEMUR,08,DISEASES AND DISORDERS OF THE MUSCULOSKELETAL SYSTEM AND CONNECTIVE TISSUE,3,Major,Moderate,Medical,Medicare,,,,,true,77383.01,14063.58
