Hospital Service Area,Hospital County,Operating Certificate Number,Permanent Facility Id,Facility Name,Age Group,Zip Code - 3 digits,Gender,Race,Ethnicity,Length of Stay,Type of Admission,Patient Disposition,Discharge Year,CCS Diagnosis Code,CCS Diagnosis Description,CCS Procedure Code,CCS Procedure Description,APR DRG Code,APR DRG Description,APR MDC Code,APR MDC Description,APR Severity of Illness Code,APR Severity of Illness Description,APR Risk of Mortality,APR Medical Surgical Description,Payment Typology 1,Payment Typology 2,Payment Typology 3,Birth Weight,Abortion Edit Indicator,Emergency Department Indicator,Total Charges,Total Costs
Long Island,Suffolk,5123000,000885,Brookhaven Memorial Hospital Medical Center Inc,50 to 69,117,M,White,Not Span/Hispanic,4,Emergency,Skilled Nursing Home,2017,231,Other fractures,000,NO PROC,341,Fracture of pelvis or dislocation of hip,08,Diseases and Disorders of the Musculoskeletal System and Conn Tissue,2,Moderate,Minor,Medical,Medicare,Medicare,Blue Cross/Blue Shield,,N,Y,41892.45,6441.89
Long Island,Suffolk,5123000,000885,Brookhaven Memorial Hospital Medical Center Inc,30 to 49,117,M,Other Race,Not Span/Hispanic,6,Emergency,Home or Self Care,2017,231,Other fractures,000,NO PROC,341,Fracture of pelvis or dislocation of hip,08,Diseases and Disorders of the Musculoskeletal System and Conn Tissue,2,Moderate,Minor,Medical,Private Health Insurance,Private Health Insurance,,,N,Y,55490.36,7883.45
Long Island,Suffolk,5123000,000885,Brookhaven Memorial Hospital Medical Center Inc,70 or Older,117,F,White,Not Span/Hispanic,3,Emergency,Skilled Nursing Home,2017,231,Other fractures,000,NO PROC,341,Fracture of pelvis or dislocation of hip,08,Diseases and Disorders of the Musculoskeletal System and Conn Tissue,3,Major,Moderate,Medical,Medicare,,,,N,Y,22240.32,4000.14
Long Island,Suffolk,5123000,000885,Brookhaven Memorial Hospital Medical Center Inc,70 or Older,117,M,White,Not Span/Hispanic,8,Emergency,Skilled Nursing Home,2017,231,Other fractures,000,NO PROC,341,Fracture of pelvis or dislocation of hip,08,Diseases and Disorders of the Musculoskeletal System and Conn Tissue,4,Extreme,Extreme,Medical,Medicare,Medicare,Private Health Insurance,,N,Y,78525.70,15009.36
Long Island,Suffolk,5123000,000885,Brookhaven Memorial Hospital Medical Center Inc,70 or Older,117,F,Other Race,Not Span/Hispanic,2,Emergency,Home w/ Home Health Services,2017,231,Other fractures,000,NO PROC,341,Fracture of pelvis or dislocation of hip,08,Diseases and Disorders of the Musculoskeletal System and Conn Tissue,1,Minor,Minor,Medical,Self-Pay,,,,N,Y,13803.49,2930.35
Long Island,Suffolk,5123000,000885,Brookhaven Memorial Hospital Medical Center Inc,70 or Older,117,F,White,Not Span/Hispanic,4,Emergency,Skilled Nursing Home,2017,231,Other fractures,000,NO PROC,341,Fracture of pelvis or dislocation of hip,08,Diseases and Disorders of the Musculoskeletal System and Conn Tissue,2,Moderate,Moderate,Medical,Medicare,Medicare,Blue Cross/Blue Shield,,N,Y,39401.77,6056.82
Long Island,Suffolk,5123000,000885,Brookhaven Memorial Hospital Medical Center Inc,70 or Older,117,F,White,Not Span/Hispanic,3,Emergency,Skilled Nursing Home,2017,231,Other fractures,000,NO PROC,341,Fracture of pelvis or dislocation of hip,08,Diseases and Disorders of the Musculoskeletal System and Conn Tissue,2,Moderate,Moderate,Medical,Medicare,Medicare,Private Health Insurance,,N,Y,48275.35,4953.29
Long Island,Suffolk,5123000,000885,Brookhaven Memorial Hospital Medical Center Inc,70 or Older,117,F,White,Not Span/Hispanic,4,Emergency,Skilled Nursing Home,2017,231,Other fractures,000,NO PROC,341,Fracture of pelvis or dislocation of hip,08,Diseases and Disorders of the Musculoskeletal System and Conn Tissue,1,Minor,Minor,Medical,Medicare,Medicare,Private Health Insurance,,N,Y,47678.37,5725.61
Long Island,Suffolk,5123000,000885,Brookhaven Memorial Hospital Medical Center Inc,70 or Older,117,F,White,Not Span/Hispanic,5,Emergency,Skilled Nursing Home,2017,231,Other fractures,198,MAG RESONANCE IMAGING,341,Fracture of pelvis or dislocation of hip,08,Diseases and Disorders of the Musculoskeletal System and Conn Tissue,2,Moderate,Moderate,Medical,Medicare,Medicare,Private Health Insurance,,N,Y,68948.11,7830.34
Long Island,Suffolk,5123000,000885,Brookhaven Memorial Hospital Medical Center Inc,70 or Older,117,F,White,Not Span/Hispanic,2,Emergency,Home or Self Care,2017,225,Joint disorders and dislocations; trauma-related,146,"TRTMNT,FRAC HIP/FEMUR",341,Fracture of pelvis or dislocation of hip,08,Diseases and Disorders of the Musculoskeletal System and Conn Tissue,2,Moderate,Moderate,Medical,Medicare,,,,N,Y,58057.70,4334.69
Long Island,Suffolk,5123000,000885,Brookhaven Memorial Hospital Medical Center Inc,70 or Older,117,F,White,Not Span/Hispanic,4,Emergency,Home w/ Home Health Services,2017,231,Other fractures,000,NO PROC,341,Fracture of pelvis or dislocation of hip,08,Diseases and Disorders of the Musculoskeletal System and Conn Tissue,2,Moderate,Minor,Medical,Private Health Insurance,,,,N,Y,47981.14,5715.44
Long Island,Suffolk,5123000,000885,Brookhaven Memorial Hospital Medical Center Inc,70 or Older,119,F,Other Race,Not Span/Hispanic,6,Emergency,Skilled Nursing Home,2017,231,Other fractures,000,NO PROC,341,Fracture of pelvis or dislocation of hip,08,Diseases and Disorders of the Musculoskeletal System and Conn Tissue,1,Minor,Minor,Medical,Medicare,Medicare,,,N,Y,61265.09,8466.99
Long Island,Suffolk,5123000,000885,Brookhaven Memorial Hospital Medical Center Inc,70 or Older,117,M,White,Not Span/Hispanic,5,Emergency,Skilled Nursing Home,2017,231,Other fractures,000,NO PROC,341,Fracture of pelvis or dislocation of hip,08,Diseases and Disorders of the Musculoskeletal System and Conn Tissue,3,Major,Major,Medical,Medicare,,,,N,Y,64102.64,8639.20
Long Island,Suffolk,5123000,000885,Brookhaven Memorial Hospital Medical Center Inc,70 or Older,117,F,White,Not Span/Hispanic,2,Emergency,Skilled Nursing Home,2017,231,Other fractures,171,SUTURE SKIN/SUBCUT TISS,341,Fracture of pelvis or dislocation of hip,08,Diseases and Disorders of the Musculoskeletal System and Conn Tissue,3,Major,Moderate,Medical,Medicare,Medicare,Private Health Insurance,,N,Y,36271.32,3853.79
Long Island,Suffolk,5123000,000885,Brookhaven Memorial Hospital Medical Center Inc,70 or Older,117,F,White,Not Span/Hispanic,3,Emergency,Expired,2017,225,Joint disorders and dislocations; trauma-related,146,"TRTMNT,FRAC HIP/FEMUR",341,Fracture of pelvis or dislocation of hip,08,Diseases and Disorders of the Musculoskeletal System and Conn Tissue,2,Moderate,Moderate,Medical,Medicare,Medicare,Private Health Insurance,,N,Y,42432.74,4714.92
Long Island,Suffolk,5123000,000885,Brookhaven Memorial Hospital Medical Center Inc,70 or Older,117,F,White,Not Span/Hispanic,7,Emergency,Skilled Nursing Home,2017,231,Other fractures,000,NO PROC,341,Fracture of pelvis or dislocation of hip,08,Diseases and Disorders of the Musculoskeletal System and Conn Tissue,2,Moderate,Moderate,Medical,Medicare,Medicare,,,N,Y,85186.46,10123.95
Long Island,Suffolk,5123000,000885,Brookhaven Memorial Hospital Medical Center Inc,70 or Older,117,F,White,Not Span/Hispanic,3,Emergency,Skilled Nursing Home,2017,231,Other fractures,000,NO PROC,341,Fracture of pelvis or dislocation of hip,08,Diseases and Disorders of the Musculoskeletal System and Conn Tissue,1,Minor,Minor,Medical,Medicare,Medicare,Blue Cross/Blue Shield,,N,Y,48898.17,4775.24
Long Island,Suffolk,5123000,000885,Brookhaven Memorial Hospital Medical Center Inc,70 or Older,117,F,White,Not Span/Hispanic,5,Emergency,Skilled Nursing Home,2017,231,Other fractures,000,NO PROC,341,Fracture of pelvis or dislocation of hip,08,Diseases and Disorders of the Musculoskeletal System and Conn Tissue,2,Moderate,Moderate,Medical,Medicare,Medicare,Blue Cross/Blue Shield,,N,Y,59241.72,7503.01
Long Island,Suffolk,5123000,000885,Brookhaven Memorial Hospital Medical Center Inc,70 or Older,117,F,White,Not Span/Hispanic,2,Emergency,Expired,2017,231,Other fractures,171,SUTURE SKIN/SUBCUT TISS,341,Fracture of pelvis or dislocation of hip,08,Diseases and Disorders of the Musculoskeletal System and Conn Tissue,4,Extreme,Major,Medical,Medicare,Medicare,Private Health Insurance,,N,Y,59141.34,5151.51
Long Island,Suffolk,5123000,000885,Brookhaven Memorial Hospital Medical Center Inc,70 or Older,119,M,White,Not Span/Hispanic,11,Emergency,Skilled Nursing Home,2017,231,Other fractures,000,NO PROC,341,Fracture of pelvis or dislocation of hip,08,Diseases and Disorders of the Musculoskeletal System and Conn Tissue,3,Major,Major,Medical,Medicare,Medicare,Blue Cross/Blue Shield,,N,Y,124475.35,16308.80
Long Island,Suffolk,5123000,000885,Brookhaven Memorial Hospital Medical Center Inc,70 or Older,119,F,White,Not Span/Hispanic,4,Emergency,Skilled Nursing Home,2017,231,Other fractures,000,NO PROC,341,Fracture of pelvis or dislocation of hip,08,Diseases and Disorders of the Musculoskeletal System and Conn Tissue,3,Major,Major,Medical,Medicare,Medicare,Medicaid,,N,Y,59681.96,6899.09
