Hospital Service Area,Hospital County,Operating Certificate Number,Permanent Facility Id,Facility Name,Age Group,Zip Code - 3 digits,Gender,Race,Ethnicity,Length of Stay,Type of Admission,Patient Disposition,Discharge Year,CCS Diagnosis Code,CCS Diagnosis Description,CCS Procedure Code,CCS Procedure Description,APR DRG Code,APR DRG Description,APR MDC Code,APR MDC Description,APR Severity of Illness Code,APR Severity of Illness Description,APR Risk of Mortality,APR Medical Surgical Description,Payment Typology 1,Payment Typology 2,Payment Typology 3,Birth Weight,Abortion Edit Indicator,Emergency Department Indicator,Total Charges,Total Costs
New York City,Kings,7002053,001304,NYU Langone Hospital-Brooklyn,50 to 69,112,M,Other Race,Not Span/Hispanic,4,Emergency,Home w/ Home Health Services,2019,INJ003,"FRACTURE OF TORSO, INITIAL ENCOUNTER",SKB006,SKIN LACERATION REPAIR (EXCLUDING PERINEUM),341,FRACTURE OF PELVIS OR DISLOCATION OF HIP,08,DISEASES AND DISORDERS OF THE MUSCULOSKELETAL SYSTEM AND CONNECTIVE TISSUE,2,Moderate,Moderate,Medical,Miscellaneous/Other,,,,,true,91623.91,29265.8
New York City,Kings,7002053,001304,NYU Langone Hospital-Brooklyn,18 to 29,112,M,Black/African American,Not Span/Hispanic,2,Emergency,Home or Self Care,2019,INJ003,"FRACTURE OF TORSO, INITIAL ENCOUNTER",,,341,FRACTURE OF PELVIS OR DISLOCATION OF HIP,08,DISEASES AND DISORDERS OF THE MUSCULOSKELETAL SYSTEM AND CONNECTIVE TISSUE,2,Moderate,Minor,Medical,Miscellaneous/Other,,,,,true,57655.91,13108.88
New York City,Kings,7002053,001304,NYU Langone Hospital-Brooklyn,70 or Older,112,F,Other Race,Spanish/Hispanic,3,Emergency,Skilled Nursing Home,2019,INJ003,"FRACTURE OF TORSO, INITIAL ENCOUNTER",,,341,FRACTURE OF PELVIS OR DISLOCATION OF HIP,08,DISEASES AND DISORDERS OF THE MUSCULOSKELETAL SYSTEM AND CONNECTIVE TISSUE,1,Minor,Moderate,Medical,Medicare,Blue Cross/Blue Shield,,,,true,36146.58,12306.77
New York City,Kings,7002053,001304,NYU Langone Hospital-Brooklyn,70 or Older,112,F,Other Race,Not Span/Hispanic,3,Emergency,Skilled Nursing Home,2019,INJ003,"FRACTURE OF TORSO, INITIAL ENCOUNTER",ADM001,TRANSFUSION OF BLOOD AND BLOOD PRODUCTS,341,FRACTURE OF PELVIS OR DISLOCATION OF HIP,08,DISEASES AND DISORDERS OF THE MUSCULOSKELETAL SYSTEM AND CONNECTIVE TISSUE,4,Extreme,Major,Medical,Medicare,Blue Cross/Blue Shield,,,,true,87362.15,21845.07
New York City,Kings,7002053,001304,NYU Langone Hospital-Brooklyn,70 or Older,112,F,White,Not Span/Hispanic,3,Emergency,Skilled Nursing Home,2019,INJ003,"FRACTURE OF TORSO, INITIAL ENCOUNTER",,,341,FRACTURE OF PELVIS OR DISLOCATION OF HIP,08,DISEASES AND DISORDERS OF THE MUSCULOSKELETAL SYSTEM AND CONNECTIVE TISSUE,3,Major,Major,Medical,Medicare,Medicare,,,,true,50700.77,18954.85
New York City,Kings,7002053,001304,NYU Langone Hospital-Brooklyn,70 or Older,112,F,White,Not Span/Hispanic,2,Emergency,Skilled Nursing Home,2019,INJ003,"FRACTURE OF TORSO, INITIAL ENCOUNTER",,,341,FRACTURE OF PELVIS OR DISLOCATION OF HIP,08,DISEASES AND DISORDERS OF THE MUSCULOSKELETAL SYSTEM AND CONNECTIVE TISSUE,2,Moderate,Moderate,Medical,Medicare,Medicaid,,,,true,47344.23,16070.36
New York City,Kings,7002053,001304,NYU Langone Hospital-Brooklyn,70 or Older,112,F,White,Not Span/Hispanic,3,Emergency,Skilled Nursing Home,2019,INJ003,"FRACTURE OF TORSO, INITIAL ENCOUNTER",,,341,FRACTURE OF PELVIS OR DISLOCATION OF HIP,08,DISEASES AND DISORDERS OF THE MUSCULOSKELETAL SYSTEM AND CONNECTIVE TISSUE,3,Major,Major,Medical,Medicare,Blue Cross/Blue Shield,,,,true,40157.8,13136.8
New York City,Kings,7002053,001304,NYU Langone Hospital-Brooklyn,70 or Older,112,F,Other Race,Not Span/Hispanic,3,Emergency,Skilled Nursing Home,2019,INJ003,"FRACTURE OF TORSO, INITIAL ENCOUNTER",,,341,FRACTURE OF PELVIS OR DISLOCATION OF HIP,08,DISEASES AND DISORDERS OF THE MUSCULOSKELETAL SYSTEM AND CONNECTIVE TISSUE,2,Moderate,Minor,Medical,Medicare,Medicaid,,,,true,85879.47,21173.89
New York City,Kings,7002053,001304,NYU Langone Hospital-Brooklyn,70 or Older,112,F,White,Not Span/Hispanic,2,Emergency,Home w/ Home Health Services,2019,INJ003,"FRACTURE OF TORSO, INITIAL ENCOUNTER",,,341,FRACTURE OF PELVIS OR DISLOCATION OF HIP,08,DISEASES AND DISORDERS OF THE MUSCULOSKELETAL SYSTEM AND CONNECTIVE TISSUE,1,Minor,Minor,Medical,Medicare,Blue Cross/Blue Shield,,,,true,40154.75,9877.11
New York City,Kings,7002053,001304,NYU Langone Hospital-Brooklyn,70 or Older,112,M,White,Not Span/Hispanic,3,Emergency,Skilled Nursing Home,2019,INJ003,"FRACTURE OF TORSO, INITIAL ENCOUNTER",ADM010,VACCINATIONS,341,FRACTURE OF PELVIS OR DISLOCATION OF HIP,08,DISEASES AND DISORDERS OF THE MUSCULOSKELETAL SYSTEM AND CONNECTIVE TISSUE,4,Extreme,Major,Medical,Medicare,Medicare,,,,true,52386.28,16487.41
New York City,Kings,7002053,001304,NYU Langone Hospital-Brooklyn,70 or Older,112,F,White,Not Span/Hispanic,3,Emergency,Skilled Nursing Home,2019,INJ003,"FRACTURE OF TORSO, INITIAL ENCOUNTER",ADM021,"ADMINISTRATION OF THERAPEUTIC SUBSTANCES, NEC",341,FRACTURE OF PELVIS OR DISLOCATION OF HIP,08,DISEASES AND DISORDERS OF THE MUSCULOSKELETAL SYSTEM AND CONNECTIVE TISSUE,3,Major,Minor,Medical,Medicaid,,,,,true,34851.1,11780.82
New York City,Kings,7002053,001304,NYU Langone Hospital-Brooklyn,70 or Older,112,F,White,Not Span/Hispanic,4,Emergency,Skilled Nursing Home,2019,INJ003,"FRACTURE OF TORSO, INITIAL ENCOUNTER",,,341,FRACTURE OF PELVIS OR DISLOCATION OF HIP,08,DISEASES AND DISORDERS OF THE MUSCULOSKELETAL SYSTEM AND CONNECTIVE TISSUE,2,Moderate,Minor,Medical,Medicare,Medicaid,,,,true,47074.83,15699.49
New York City,Kings,7002053,001304,NYU Langone Hospital-Brooklyn,70 or Older,112,F,White,Not Span/Hispanic,3,Emergency,Skilled Nursing Home,2019,INJ003,"FRACTURE OF TORSO, INITIAL ENCOUNTER",SKB006,SKIN LACERATION REPAIR (EXCLUDING PERINEUM),341,FRACTURE OF PELVIS OR DISLOCATION OF HIP,08,DISEASES AND DISORDERS OF THE MUSCULOSKELETAL SYSTEM AND CONNECTIVE TISSUE,3,Major,Moderate,Medical,Medicare,,,,,true,60486.64,22722.44
New York City,Kings,7002053,001304,NYU Langone Hospital-Brooklyn,50 to 69,112,F,Black/African American,Not Span/Hispanic,4,Emergency,Home w/ Home Health Services,2019,INJ003,"FRACTURE OF TORSO, INITIAL ENCOUNTER",,,341,FRACTURE OF PELVIS OR DISLOCATION OF HIP,08,DISEASES AND DISORDERS OF THE MUSCULOSKELETAL SYSTEM AND CONNECTIVE TISSUE,3,Major,Major,Medical,Medicare,,,,,true,58134.99,16393.83
New York City,Kings,7002053,001304,NYU Langone Hospital-Brooklyn,50 to 69,112,M,White,Not Span/Hispanic,11,Emergency,Skilled Nursing Home,2019,INJ003,"FRACTURE OF TORSO, INITIAL ENCOUNTER",CAR024,VENOUS AND ARTERIAL CATHETER PLACEMENT,341,FRACTURE OF PELVIS OR DISLOCATION OF HIP,08,DISEASES AND DISORDERS OF THE MUSCULOSKELETAL SYSTEM AND CONNECTIVE TISSUE,3,Major,Major,Medical,Medicaid,,,,,true,142566.53,49272.96
New York City,Kings,7002053,001304,NYU Langone Hospital-Brooklyn,0 to 17,112,M,Other Race,Not Span/Hispanic,5,Emergency,Inpatient Rehabilitation Facility,2019,INJ003,"FRACTURE OF TORSO, INITIAL ENCOUNTER",,,341,FRACTURE OF PELVIS OR DISLOCATION OF HIP,08,DISEASES AND DISORDERS OF THE MUSCULOSKELETAL SYSTEM AND CONNECTIVE TISSUE,2,Moderate,Minor,Medical,Miscellaneous/Other,,,,,true,81606.28,24185.73
New York City,Kings,7002053,001304,NYU Langone Hospital-Brooklyn,70 or Older,112,F,White,Not Span/Hispanic,2,Emergency,Skilled Nursing Home,2019,INJ003,"FRACTURE OF TORSO, INITIAL ENCOUNTER",,,341,FRACTURE OF PELVIS OR DISLOCATION OF HIP,08,DISEASES AND DISORDERS OF THE MUSCULOSKELETAL SYSTEM AND CONNECTIVE TISSUE,1,Minor,Minor,Medical,Medicare,Medicaid,,,,true,40930.27,10883.86
New York City,Kings,7002053,001304,NYU Langone Hospital-Brooklyn,70 or Older,112,F,White,Not Span/Hispanic,6,Emergency,Skilled Nursing Home,2019,INJ003,"FRACTURE OF TORSO, INITIAL ENCOUNTER",,,341,FRACTURE OF PELVIS OR DISLOCATION OF HIP,08,DISEASES AND DISORDERS OF THE MUSCULOSKELETAL SYSTEM AND CONNECTIVE TISSUE,3,Major,Minor,Medical,Private Health Insurance,,,,,true,50758.38,20794.54
New York City,Kings,7002053,001304,NYU Langone Hospital-Brooklyn,70 or Older,112,F,White,Not Span/Hispanic,8,Emergency,Skilled Nursing Home,2019,INJ003,"FRACTURE OF TORSO, INITIAL ENCOUNTER",ADM001,TRANSFUSION OF BLOOD AND BLOOD PRODUCTS,341,FRACTURE OF PELVIS OR DISLOCATION OF HIP,08,DISEASES AND DISORDERS OF THE MUSCULOSKELETAL SYSTEM AND CONNECTIVE TISSUE,3,Major,Moderate,Medical,Medicare,Medicaid,,,,true,92828.9,31234.66
New York City,Kings,7002053,001304,NYU Langone Hospital-Brooklyn,30 to 49,112,M,Other Race,Not Span/Hispanic,1,Emergency,Home or Self Care,2019,INJ003,"FRACTURE OF TORSO, INITIAL ENCOUNTER",,,341,FRACTURE OF PELVIS OR DISLOCATION OF HIP,08,DISEASES AND DISORDERS OF THE MUSCULOSKELETAL SYSTEM AND CONNECTIVE TISSUE,2,Moderate,Minor,Medical,Private Health Insurance,,,,,true,26440.99,6576.97
New York City,Kings,7002053,001304,NYU Langone Hospital-Brooklyn,70 or Older,112,M,White,Not Span/Hispanic,3,Emergency,Skilled Nursing Home,2019,INJ003,"FRACTURE OF TORSO, INITIAL ENCOUNTER",,,341,FRACTURE OF PELVIS OR DISLOCATION OF HIP,08,DISEASES AND DISORDERS OF THE MUSCULOSKELETAL SYSTEM AND CONNECTIVE TISSUE,3,Major,Major,Medical,Medicare,Blue Cross/Blue Shield,,,,true,53498.07,13929.02
New York City,Kings,7002053,001304,NYU Langone Hospital-Brooklyn,70 or Older,112,F,Other Race,Spanish/Hispanic,5,Emergency,Skilled Nursing Home,2019,INJ003,"FRACTURE OF TORSO, INITIAL ENCOUNTER",,,341,FRACTURE OF PELVIS OR DISLOCATION OF HIP,08,DISEASES AND DISORDERS OF THE MUSCULOSKELETAL SYSTEM AND CONNECTIVE TISSUE,3,Major,Major,Medical,Medicare,Medicaid,,,,true,64745.36,19156.99
New York City,Kings,7002053,001304,NYU Langone Hospital-Brooklyn,30 to 49,116,F,White,Not Span/Hispanic,1,Trauma,Home w/ Home Health Services,2019,INJ003,"FRACTURE OF TORSO, INITIAL ENCOUNTER",,,341,FRACTURE OF PELVIS OR DISLOCATION OF HIP,08,DISEASES AND DISORDERS OF THE MUSCULOSKELETAL SYSTEM AND CONNECTIVE TISSUE,3,Major,Minor,Medical,Miscellaneous/Other,Blue Cross/Blue Shield,,,,true,24578.77,5738.84
New York City,Kings,7002053,001304,NYU Langone Hospital-Brooklyn,30 to 49,112,F,Other Race,Not Span/Hispanic,8,Emergency,Inpatient Rehabilitation Facility,2019,INJ003,"FRACTURE OF TORSO, INITIAL ENCOUNTER",ADM015,ADMINISTRATION OF ANTIBIOTICS,341,FRACTURE OF PELVIS OR DISLOCATION OF HIP,08,DISEASES AND DISORDERS OF THE MUSCULOSKELETAL SYSTEM AND CONNECTIVE TISSUE,2,Moderate,Moderate,Medical,Miscellaneous/Other,Medicaid,,,,true,121357.67,32862.7
New York City,Kings,7002053,001304,NYU Langone Hospital-Brooklyn,70 or Older,112,F,Other Race,Not Span/Hispanic,4,Emergency,Left Against Medical Advice,2019,INJ003,"FRACTURE OF TORSO, INITIAL ENCOUNTER",ADM001,TRANSFUSION OF BLOOD AND BLOOD PRODUCTS,341,FRACTURE OF PELVIS OR DISLOCATION OF HIP,08,DISEASES AND DISORDERS OF THE MUSCULOSKELETAL SYSTEM AND CONNECTIVE TISSUE,3,Major,Moderate,Medical,Medicare,Medicaid,,,,true,67057.04,19315.56
New York City,Kings,7002053,001304,NYU Langone Hospital-Brooklyn,70 or Older,112,F,Other Race,Not Span/Hispanic,2,Emergency,Skilled Nursing Home,2019,INJ003,"FRACTURE OF TORSO, INITIAL ENCOUNTER",IMG008,ULTRASONOGRAPHY,341,FRACTURE OF PELVIS OR DISLOCATION OF HIP,08,DISEASES AND DISORDERS OF THE MUSCULOSKELETAL SYSTEM AND CONNECTIVE TISSUE,3,Major,Moderate,Medical,Medicare,Medicaid,,,,true,23445.93,7994.78
New York City,Kings,7002053,001304,NYU Langone Hospital-Brooklyn,70 or Older,112,F,White,Not Span/Hispanic,2,Emergency,Skilled Nursing Home,2019,INJ003,"FRACTURE OF TORSO, INITIAL ENCOUNTER",,,341,FRACTURE OF PELVIS OR DISLOCATION OF HIP,08,DISEASES AND DISORDERS OF THE MUSCULOSKELETAL SYSTEM AND CONNECTIVE TISSUE,2,Moderate,Moderate,Medical,Private Health Insurance,,,,,true,50149.86,13924.22
New York City,Kings,7002053,001304,NYU Langone Hospital-Brooklyn,70 or Older,112,F,White,Not Span/Hispanic,9,Emergency,Skilled Nursing Home,2019,INJ003,"FRACTURE OF TORSO, INITIAL ENCOUNTER",ADM015,ADMINISTRATION OF ANTIBIOTICS,341,FRACTURE OF PELVIS OR DISLOCATION OF HIP,08,DISEASES AND DISORDERS OF THE MUSCULOSKELETAL SYSTEM AND CONNECTIVE TISSUE,4,Extreme,Extreme,Medical,Medicare,Medicaid,,,,true,110806.65,35064.37
New York City,Kings,7002053,001304,NYU Langone Hospital-Brooklyn,70 or Older,112,F,White,Not Span/Hispanic,3,Emergency,Skilled Nursing Home,2019,INJ003,"FRACTURE OF TORSO, INITIAL ENCOUNTER",,,341,FRACTURE OF PELVIS OR DISLOCATION OF HIP,08,DISEASES AND DISORDERS OF THE MUSCULOSKELETAL SYSTEM AND CONNECTIVE TISSUE,1,Minor,Minor,Medical,Medicare,Blue Cross/Blue Shield,,,,true,34818.82,11237.78
New York City,Kings,7002053,001304,NYU Langone Hospital-Brooklyn,70 or Older,112,F,Other Race,Spanish/Hispanic,3,Emergency,Skilled Nursing Home,2019,INJ003,"FRACTURE OF TORSO, INITIAL ENCOUNTER",,,341,FRACTURE OF PELVIS OR DISLOCATION OF HIP,08,DISEASES AND DISORDERS OF THE MUSCULOSKELETAL SYSTEM AND CONNECTIVE TISSUE,1,Minor,Minor,Medical,Medicare,Medicare,,,,true,31813.96,11158.17
New York City,Kings,7002053,001304,NYU Langone Hospital-Brooklyn,70 or Older,112,F,White,Not Span/Hispanic,10,Emergency,Skilled Nursing Home,2019,INJ003,"FRACTURE OF TORSO, INITIAL ENCOUNTER",ADM006,INFUSION OF VASOPRESSOR,341,FRACTURE OF PELVIS OR DISLOCATION OF HIP,08,DISEASES AND DISORDERS OF THE MUSCULOSKELETAL SYSTEM AND CONNECTIVE TISSUE,4,Extreme,Extreme,Medical,Medicare,Blue Cross/Blue Shield,,,,true,287207.81,53237.17
New York City,Kings,7002053,001304,NYU Langone Hospital-Brooklyn,70 or Older,112,F,White,Not Span/Hispanic,3,Emergency,Skilled Nursing Home,2019,INJ003,"FRACTURE OF TORSO, INITIAL ENCOUNTER",ADM021,"ADMINISTRATION OF THERAPEUTIC SUBSTANCES, NEC",341,FRACTURE OF PELVIS OR DISLOCATION OF HIP,08,DISEASES AND DISORDERS OF THE MUSCULOSKELETAL SYSTEM AND CONNECTIVE TISSUE,3,Major,Major,Medical,Medicare,Blue Cross/Blue Shield,,,,true,45781.27,12910.97
New York City,Kings,7002053,001304,NYU Langone Hospital-Brooklyn,70 or Older,112,F,White,Not Span/Hispanic,5,Emergency,Inpatient Rehabilitation Facility,2019,INJ003,"FRACTURE OF TORSO, INITIAL ENCOUNTER",ADM021,"ADMINISTRATION OF THERAPEUTIC SUBSTANCES, NEC",341,FRACTURE OF PELVIS OR DISLOCATION OF HIP,08,DISEASES AND DISORDERS OF THE MUSCULOSKELETAL SYSTEM AND CONNECTIVE TISSUE,2,Moderate,Minor,Medical,Blue Cross/Blue Shield,,,,,true,58121.67,19411.69
New York City,Kings,7002053,001304,NYU Langone Hospital-Brooklyn,70 or Older,112,F,Other Race,Spanish/Hispanic,6,Emergency,Skilled Nursing Home,2019,INJ003,"FRACTURE OF TORSO, INITIAL ENCOUNTER",ADM021,"ADMINISTRATION OF THERAPEUTIC SUBSTANCES, NEC",341,FRACTURE OF PELVIS OR DISLOCATION OF HIP,08,DISEASES AND DISORDERS OF THE MUSCULOSKELETAL SYSTEM AND CONNECTIVE TISSUE,3,Major,Moderate,Medical,Medicare,Medicaid,,,,true,87735.5,23382.84
New York City,Kings,7002053,001304,NYU Langone Hospital-Brooklyn,70 or Older,112,F,White,Not Span/Hispanic,10,Emergency,Skilled Nursing Home,2019,INJ003,"FRACTURE OF TORSO, INITIAL ENCOUNTER",ADM021,"ADMINISTRATION OF THERAPEUTIC SUBSTANCES, NEC",341,FRACTURE OF PELVIS OR DISLOCATION OF HIP,08,DISEASES AND DISORDERS OF THE MUSCULOSKELETAL SYSTEM AND CONNECTIVE TISSUE,2,Moderate,Moderate,Medical,Medicare,Medicaid,,,,true,130008.56,38560.27
New York City,Kings,7002053,001304,NYU Langone Hospital-Brooklyn,70 or Older,112,F,Other Race,Not Span/Hispanic,2,Emergency,Home or Self Care,2019,INJ003,"FRACTURE OF TORSO, INITIAL ENCOUNTER",,,341,FRACTURE OF PELVIS OR DISLOCATION OF HIP,08,DISEASES AND DISORDERS OF THE MUSCULOSKELETAL SYSTEM AND CONNECTIVE TISSUE,2,Moderate,Moderate,Medical,Medicare,Medicaid,,,,true,27438.86,8792.82
New York City,Kings,7002053,001304,NYU Langone Hospital-Brooklyn,70 or Older,112,F,White,Not Span/Hispanic,2,Emergency,Inpatient Rehabilitation Facility,2019,INJ003,"FRACTURE OF TORSO, INITIAL ENCOUNTER",ADM010,VACCINATIONS,341,FRACTURE OF PELVIS OR DISLOCATION OF HIP,08,DISEASES AND DISORDERS OF THE MUSCULOSKELETAL SYSTEM AND CONNECTIVE TISSUE,3,Major,Moderate,Medical,Medicare,Medicaid,,,,true,50382.09,12071.67
New York City,Kings,7002053,001304,NYU Langone Hospital-Brooklyn,70 or Older,112,F,Other Race,Spanish/Hispanic,5,Emergency,Inpatient Rehabilitation Facility,2019,INJ003,"FRACTURE OF TORSO, INITIAL ENCOUNTER",,,341,FRACTURE OF PELVIS OR DISLOCATION OF HIP,08,DISEASES AND DISORDERS OF THE MUSCULOSKELETAL SYSTEM AND CONNECTIVE TISSUE,2,Moderate,Minor,Medical,Medicaid,,,,,true,50062.34,18827.77
New York City,Kings,7002053,001304,NYU Langone Hospital-Brooklyn,70 or Older,112,F,White,Not Span/Hispanic,3,Emergency,Skilled Nursing Home,2019,INJ003,"FRACTURE OF TORSO, INITIAL ENCOUNTER",,,341,FRACTURE OF PELVIS OR DISLOCATION OF HIP,08,DISEASES AND DISORDERS OF THE MUSCULOSKELETAL SYSTEM AND CONNECTIVE TISSUE,3,Major,Moderate,Medical,Medicare,,,,,true,40925.9,12769.18
New York City,Kings,7002053,001304,NYU Langone Hospital-Brooklyn,70 or Older,112,F,Other Race,Not Span/Hispanic,2,Emergency,Skilled Nursing Home,2019,INJ003,"FRACTURE OF TORSO, INITIAL ENCOUNTER",SKB006,SKIN LACERATION REPAIR (EXCLUDING PERINEUM),341,FRACTURE OF PELVIS OR DISLOCATION OF HIP,08,DISEASES AND DISORDERS OF THE MUSCULOSKELETAL SYSTEM AND CONNECTIVE TISSUE,2,Moderate,Minor,Medical,Medicare,,,,,true,35232.79,9766.42
New York City,Kings,7002053,001304,NYU Langone Hospital-Brooklyn,50 to 69,100,M,Other Race,Not Span/Hispanic,18,Emergency,Home or Self Care,2019,INJ003,"FRACTURE OF TORSO, INITIAL ENCOUNTER",,,341,FRACTURE OF PELVIS OR DISLOCATION OF HIP,08,DISEASES AND DISORDERS OF THE MUSCULOSKELETAL SYSTEM AND CONNECTIVE TISSUE,3,Major,Moderate,Medical,Miscellaneous/Other,Medicaid,,,,true,205211.36,66252.93
