Hospital Service Area,Hospital County,Operating Certificate Number,Permanent Facility Id,Facility Name,Age Group,Zip Code - 3 digits,Gender,Race,Ethnicity,Length of Stay,Type of Admission,Patient Disposition,Discharge Year,CCS Diagnosis Code,CCS Diagnosis Description,CCS Procedure Code,CCS Procedure Description,APR DRG Code,APR DRG Description,APR MDC Code,APR MDC Description,APR Severity of Illness Code,APR Severity of Illness Description,APR Risk of Mortality,APR Medical Surgical Description,Payment Typology 1,Payment Typology 2,Payment Typology 3,Birth Weight,Abortion Edit Indicator,Emergency Department Indicator,Total Charges,Total Costs
Hudson Valley,Westchester,5902001,001045,White Plains Hospital Center,70 or Older,108,F,Other Race,Not Span/Hispanic,3,Emergency,Skilled Nursing Home,2019,INJ005,"FRACTURE OF THE LOWER LIMB (EXCEPT HIP), INITIAL ENCOUNTER",,,342,"FRACTURES & DISLOCATIONS EXCEPT FEMUR, PELVIS & BACK",08,DISEASES AND DISORDERS OF THE MUSCULOSKELETAL SYSTEM AND CONNECTIVE TISSUE,4,Extreme,Major,Medical,Medicare,Private Health Insurance,,,,true,32160,6991.97
Long Island,Suffolk,5151001,000245,Stony Brook University Hospital,70 or Older,119,F,White,Not Span/Hispanic,3,Emergency,Skilled Nursing Home,2019,INJ005,"FRACTURE OF THE LOWER LIMB (EXCEPT HIP), INITIAL ENCOUNTER",IMG008,ULTRASONOGRAPHY,342,"FRACTURES & DISLOCATIONS EXCEPT FEMUR, PELVIS & BACK",08,DISEASES AND DISORDERS OF THE MUSCULOSKELETAL SYSTEM AND CONNECTIVE TISSUE,2,Moderate,Moderate,Medical,Medicare,Blue Cross/Blue Shield,,,,true,51925.64,11106.19
Long Island,Suffolk,5151001,000245,Stony Brook University Hospital,70 or Older,117,F,White,Not Span/Hispanic,3,Emergency,Skilled Nursing Home,2019,INJ004,"FRACTURE OF THE UPPER LIMB, INITIAL ENCOUNTER",,,342,"FRACTURES & DISLOCATIONS EXCEPT FEMUR, PELVIS & BACK",08,DISEASES AND DISORDERS OF THE MUSCULOSKELETAL SYSTEM AND CONNECTIVE TISSUE,2,Moderate,Minor,Medical,Medicare,Blue Cross/Blue Shield,,,,true,44748.92,10288.95
New York City,Kings,7001016,001301,Kings County Hospital Center,18 to 29,112,M,Other Race,Not Span/Hispanic,1,Emergency,Home or Self Care,2019,INJ005,"FRACTURE OF THE LOWER LIMB (EXCEPT HIP), INITIAL ENCOUNTER",PLC001,IMMOBILIZATION BY SPLINT OR OTHER EXTERNAL DEVICE,342,"FRACTURES & DISLOCATIONS EXCEPT FEMUR, PELVIS & BACK",08,DISEASES AND DISORDERS OF THE MUSCULOSKELETAL SYSTEM AND CONNECTIVE TISSUE,1,Minor,Minor,Medical,Medicaid,,,,,true,12122.66,8611.46
Hudson Valley,Westchester,5932000,001129,Phelps Hospital,70 or Older,105,M,White,Not Span/Hispanic,2,Emergency,Home w/ Home Health Services,2019,MUS014,"PATHOLOGICAL FRACTURE, INITIAL ENCOUNTER",,,342,"FRACTURES & DISLOCATIONS EXCEPT FEMUR, PELVIS & BACK",08,DISEASES AND DISORDERS OF THE MUSCULOSKELETAL SYSTEM AND CONNECTIVE TISSUE,3,Major,Moderate,Medical,Medicare,Blue Cross/Blue Shield,,,,true,18954.65,6521.35
Long Island,Suffolk,5151001,000889,Stony Brook Southampton Hospital,70 or Older,119,F,White,Not Span/Hispanic,4,Emergency,Home or Self Care,2019,INJ004,"FRACTURE OF THE UPPER LIMB, INITIAL ENCOUNTER",,,342,"FRACTURES & DISLOCATIONS EXCEPT FEMUR, PELVIS & BACK",08,DISEASES AND DISORDERS OF THE MUSCULOSKELETAL SYSTEM AND CONNECTIVE TISSUE,2,Moderate,Minor,Medical,Medicare,Blue Cross/Blue Shield,,,,true,33845.1,9307.91
New York City,Manhattan,7002054,001458,New York-Presbyterian Hospital - New York Weill Cornell Center,30 to 49,104,M,White,Not Span/Hispanic,2,Emergency,Home or Self Care,2019,INJ005,"FRACTURE OF THE LOWER LIMB (EXCEPT HIP), INITIAL ENCOUNTER",MST015,CLOSED REDUCTION OF BONES AND JOINTS,342,"FRACTURES & DISLOCATIONS EXCEPT FEMUR, PELVIS & BACK",08,DISEASES AND DISORDERS OF THE MUSCULOSKELETAL SYSTEM AND CONNECTIVE TISSUE,1,Minor,Minor,Medical,Miscellaneous/Other,Blue Cross/Blue Shield,Self-Pay,,,true,28336.16,6736.42
Hudson Valley,Rockland,4329000,000779,Good Samaritan Hospital of Suffern,50 to 69,109,F,White,Not Span/Hispanic,4,Emergency,Inpatient Rehabilitation Facility,2019,INJ005,"FRACTURE OF THE LOWER LIMB (EXCEPT HIP), INITIAL ENCOUNTER",PLC001,IMMOBILIZATION BY SPLINT OR OTHER EXTERNAL DEVICE,342,"FRACTURES & DISLOCATIONS EXCEPT FEMUR, PELVIS & BACK",08,DISEASES AND DISORDERS OF THE MUSCULOSKELETAL SYSTEM AND CONNECTIVE TISSUE,3,Major,Moderate,Medical,Medicare,,,,,true,83488.53,12356.7
Western NY,Erie,1401005,000210,Erie County Medical Center,70 or Older,142,M,White,Not Span/Hispanic,3,Emergency,Skilled Nursing Home,2019,INJ004,"FRACTURE OF THE UPPER LIMB, INITIAL ENCOUNTER",,,342,"FRACTURES & DISLOCATIONS EXCEPT FEMUR, PELVIS & BACK",08,DISEASES AND DISORDERS OF THE MUSCULOSKELETAL SYSTEM AND CONNECTIVE TISSUE,3,Major,Moderate,Medical,Federal/State/Local/VA,,,,,true,35377.16,9100.83
New York City,Manhattan,7002054,001458,New York-Presbyterian Hospital - New York Weill Cornell Center,70 or Older,100,F,White,Not Span/Hispanic,4,Emergency,Skilled Nursing Home,2019,INJ004,"FRACTURE OF THE UPPER LIMB, INITIAL ENCOUNTER",,,342,"FRACTURES & DISLOCATIONS EXCEPT FEMUR, PELVIS & BACK",08,DISEASES AND DISORDERS OF THE MUSCULOSKELETAL SYSTEM AND CONNECTIVE TISSUE,2,Moderate,Minor,Medical,Medicare,Medicaid,Self-Pay,,,true,48664.07,10995.28
Long Island,Suffolk,5154001,000925,Good Samaritan Hospital Medical Center,50 to 69,117,M,White,Not Span/Hispanic,3,Emergency,Skilled Nursing Home,2019,INJ005,"FRACTURE OF THE LOWER LIMB (EXCEPT HIP), INITIAL ENCOUNTER",,,342,"FRACTURES & DISLOCATIONS EXCEPT FEMUR, PELVIS & BACK",08,DISEASES AND DISORDERS OF THE MUSCULOSKELETAL SYSTEM AND CONNECTIVE TISSUE,1,Minor,Minor,Medical,Medicare,Private Health Insurance,,,,true,30238,5251.56
Long Island,Nassau,2952005,000552,Plainview Hospital,70 or Older,115,F,White,Not Span/Hispanic,5,Emergency,Skilled Nursing Home,2019,INJ004,"FRACTURE OF THE UPPER LIMB, INITIAL ENCOUNTER",,,342,"FRACTURES & DISLOCATIONS EXCEPT FEMUR, PELVIS & BACK",08,DISEASES AND DISORDERS OF THE MUSCULOSKELETAL SYSTEM AND CONNECTIVE TISSUE,2,Moderate,Moderate,Medical,Medicare,Medicare,,,,true,31306.47,13527.09
Hudson Valley,Dutchess,1302001,000181,Vassar Brothers Medical Center,70 or Older,125,F,White,Not Span/Hispanic,1,Emergency,Home w/ Home Health Services,2019,INJ004,"FRACTURE OF THE UPPER LIMB, INITIAL ENCOUNTER",MST015,CLOSED REDUCTION OF BONES AND JOINTS,342,"FRACTURES & DISLOCATIONS EXCEPT FEMUR, PELVIS & BACK",08,DISEASES AND DISORDERS OF THE MUSCULOSKELETAL SYSTEM AND CONNECTIVE TISSUE,1,Minor,Minor,Medical,Medicare,,,,,true,10221.8,3369.44
Southern Tier,Broome,0303001,000058,United Health Services Hospitals Inc. - Wilson Medical Center,70 or Older,137,F,White,Not Span/Hispanic,4,Emergency,Skilled Nursing Home,2019,INJ005,"FRACTURE OF THE LOWER LIMB (EXCEPT HIP), INITIAL ENCOUNTER",,,342,"FRACTURES & DISLOCATIONS EXCEPT FEMUR, PELVIS & BACK",08,DISEASES AND DISORDERS OF THE MUSCULOSKELETAL SYSTEM AND CONNECTIVE TISSUE,2,Moderate,Minor,Medical,Medicare,Medicare,,,,true,9697.4,5444.47
New York City,Kings,7002053,001304,NYU Langone Hospital-Brooklyn,70 or Older,112,M,White,Not Span/Hispanic,3,Emergency,Home w/ Home Health Services,2019,INJ004,"FRACTURE OF THE UPPER LIMB, INITIAL ENCOUNTER",PLC001,IMMOBILIZATION BY SPLINT OR OTHER EXTERNAL DEVICE,342,"FRACTURES & DISLOCATIONS EXCEPT FEMUR, PELVIS & BACK",08,DISEASES AND DISORDERS OF THE MUSCULOSKELETAL SYSTEM AND CONNECTIVE TISSUE,1,Minor,Minor,Medical,Medicare,Medicare,,,,true,37790.43,12345.68
Central NY,Tompkins,5401001,000977,Cayuga Medical Center at Ithaca,70 or Older,148,M,White,Not Span/Hispanic,3,Emergency,Home w/ Home Health Services,2019,INJ005,"FRACTURE OF THE LOWER LIMB (EXCEPT HIP), INITIAL ENCOUNTER",MST015,CLOSED REDUCTION OF BONES AND JOINTS,342,"FRACTURES & DISLOCATIONS EXCEPT FEMUR, PELVIS & BACK",08,DISEASES AND DISORDERS OF THE MUSCULOSKELETAL SYSTEM AND CONNECTIVE TISSUE,2,Moderate,Moderate,Medical,Medicare,Self-Pay,Self-Pay,,,true,9042.79,6861.77
Long Island,Suffolk,5154001,000925,Good Samaritan Hospital Medical Center,30 to 49,117,F,Black/African American,Not Span/Hispanic,3,Emergency,Home w/ Home Health Services,2019,INJ005,"FRACTURE OF THE LOWER LIMB (EXCEPT HIP), INITIAL ENCOUNTER",ESA001,HEMODIALYSIS,342,"FRACTURES & DISLOCATIONS EXCEPT FEMUR, PELVIS & BACK",08,DISEASES AND DISORDERS OF THE MUSCULOSKELETAL SYSTEM AND CONNECTIVE TISSUE,3,Major,Major,Medical,Medicare,Medicaid,,,,true,32957,5591.68
New York City,Kings,7001020,001305,Maimonides Medical Center,70 or Older,112,F,White,Not Span/Hispanic,3,Emergency,Skilled Nursing Home,2019,INJ004,"FRACTURE OF THE UPPER LIMB, INITIAL ENCOUNTER",,,342,"FRACTURES & DISLOCATIONS EXCEPT FEMUR, PELVIS & BACK",08,DISEASES AND DISORDERS OF THE MUSCULOSKELETAL SYSTEM AND CONNECTIVE TISSUE,2,Moderate,Minor,Medical,Medicare,Medicaid,Self-Pay,,,false,22043.01,5958.81
Hudson Valley,Ulster,5501001,000990,HealthAlliance Hospital Broadway Campus,70 or Older,124,F,White,Not Span/Hispanic,3,Emergency,Skilled Nursing Home,2019,INJ005,"FRACTURE OF THE LOWER LIMB (EXCEPT HIP), INITIAL ENCOUNTER",,,342,"FRACTURES & DISLOCATIONS EXCEPT FEMUR, PELVIS & BACK",08,DISEASES AND DISORDERS OF THE MUSCULOSKELETAL SYSTEM AND CONNECTIVE TISSUE,3,Major,Major,Medical,Medicare,Private Health Insurance,,,,true,42161.62,6242.25
New York City,Kings,7002002,001324,Mount Sinai Brooklyn,70 or Older,112,F,White,Not Span/Hispanic,2,Emergency,Skilled Nursing Home,2019,INJ005,"FRACTURE OF THE LOWER LIMB (EXCEPT HIP), INITIAL ENCOUNTER",PLC001,IMMOBILIZATION BY SPLINT OR OTHER EXTERNAL DEVICE,342,"FRACTURES & DISLOCATIONS EXCEPT FEMUR, PELVIS & BACK",08,DISEASES AND DISORDERS OF THE MUSCULOSKELETAL SYSTEM AND CONNECTIVE TISSUE,1,Minor,Minor,Medical,Medicare,Self-Pay,,,,true,28747.31,5172.42
Finger Lakes,Monroe,2701003,000411,Rochester General Hospital,70 or Older,146,F,White,Not Span/Hispanic,3,Emergency,Skilled Nursing Home,2019,INJ004,"FRACTURE OF THE UPPER LIMB, INITIAL ENCOUNTER",,,342,"FRACTURES & DISLOCATIONS EXCEPT FEMUR, PELVIS & BACK",08,DISEASES AND DISORDERS OF THE MUSCULOSKELETAL SYSTEM AND CONNECTIVE TISSUE,1,Minor,Moderate,Medical,Medicare,,,,,true,9946.31,3597.91
New York City,Kings,7001020,001305,Maimonides Medical Center,0 to 17,112,M,Other Race,Unknown,1,Emergency,Home or Self Care,2019,INJ005,"FRACTURE OF THE LOWER LIMB (EXCEPT HIP), INITIAL ENCOUNTER",MST015,CLOSED REDUCTION OF BONES AND JOINTS,342,"FRACTURES & DISLOCATIONS EXCEPT FEMUR, PELVIS & BACK",08,DISEASES AND DISORDERS OF THE MUSCULOSKELETAL SYSTEM AND CONNECTIVE TISSUE,1,Minor,Minor,Medical,Miscellaneous/Other,Medicaid,Self-Pay,,,true,30793.59,9605.35
Long Island,Suffolk,5154001,000925,Good Samaritan Hospital Medical Center,70 or Older,117,F,White,Not Span/Hispanic,1,Emergency,Skilled Nursing Home,2019,INJ005,"FRACTURE OF THE LOWER LIMB (EXCEPT HIP), INITIAL ENCOUNTER",PLC001,IMMOBILIZATION BY SPLINT OR OTHER EXTERNAL DEVICE,342,"FRACTURES & DISLOCATIONS EXCEPT FEMUR, PELVIS & BACK",08,DISEASES AND DISORDERS OF THE MUSCULOSKELETAL SYSTEM AND CONNECTIVE TISSUE,2,Moderate,Moderate,Medical,Medicare,Medicare,,,,true,24889,3502.96
Western NY,Erie,1401014,003067,Millard Fillmore Suburban Hospital,70 or Older,140,M,White,Not Span/Hispanic,9,Emergency,Skilled Nursing Home,2019,INJ005,"FRACTURE OF THE LOWER LIMB (EXCEPT HIP), INITIAL ENCOUNTER",,,342,"FRACTURES & DISLOCATIONS EXCEPT FEMUR, PELVIS & BACK",08,DISEASES AND DISORDERS OF THE MUSCULOSKELETAL SYSTEM AND CONNECTIVE TISSUE,3,Major,Major,Medical,Medicare,Self-Pay,,,,true,26511.29,12576.45
Southern Tier,Broome,0301001,000043,Our Lady of Lourdes Memorial Hospital,50 to 69,138,F,White,Not Span/Hispanic,4,Emergency,Skilled Nursing Home,2019,INJ005,"FRACTURE OF THE LOWER LIMB (EXCEPT HIP), INITIAL ENCOUNTER",MST001,ARTHROCENTESIS,342,"FRACTURES & DISLOCATIONS EXCEPT FEMUR, PELVIS & BACK",08,DISEASES AND DISORDERS OF THE MUSCULOSKELETAL SYSTEM AND CONNECTIVE TISSUE,3,Major,Moderate,Medical,Medicaid,Self-Pay,Self-Pay,,,true,13950.36,4897.34
Southern Tier,Broome,0301001,000043,Our Lady of Lourdes Memorial Hospital,50 to 69,138,F,White,Not Span/Hispanic,7,Elective,Skilled Nursing Home,2019,INJ005,"FRACTURE OF THE LOWER LIMB (EXCEPT HIP), INITIAL ENCOUNTER",,,342,"FRACTURES & DISLOCATIONS EXCEPT FEMUR, PELVIS & BACK",08,DISEASES AND DISORDERS OF THE MUSCULOSKELETAL SYSTEM AND CONNECTIVE TISSUE,3,Major,Major,Medical,Medicaid,Self-Pay,Self-Pay,,,true,22236.99,7943.94
Capital/Adirond,Schenectady,4601001,000829,Ellis Hospital,70 or Older,123,F,White,Not Span/Hispanic,7,Emergency,Skilled Nursing Home,2019,INJ005,"FRACTURE OF THE LOWER LIMB (EXCEPT HIP), INITIAL ENCOUNTER",,,342,"FRACTURES & DISLOCATIONS EXCEPT FEMUR, PELVIS & BACK",08,DISEASES AND DISORDERS OF THE MUSCULOSKELETAL SYSTEM AND CONNECTIVE TISSUE,3,Major,Major,Medical,Medicare,Medicare,Medicaid,,,true,31409.65,10299.41
Long Island,Nassau,2950001,000527,Mount Sinai South Nassau,70 or Older,115,F,Other Race,Not Span/Hispanic,3,Emergency,Skilled Nursing Home,2019,INJ004,"FRACTURE OF THE UPPER LIMB, INITIAL ENCOUNTER",,,342,"FRACTURES & DISLOCATIONS EXCEPT FEMUR, PELVIS & BACK",08,DISEASES AND DISORDERS OF THE MUSCULOSKELETAL SYSTEM AND CONNECTIVE TISSUE,2,Moderate,Major,Medical,Medicare,Blue Cross/Blue Shield,,,,true,47432.71,6197.43
New York City,Bronx,7000002,001165,Jacobi Medical Center,50 to 69,105,M,Other Race,Spanish/Hispanic,2,Emergency,Home or Self Care,2019,INJ004,"FRACTURE OF THE UPPER LIMB, INITIAL ENCOUNTER",SKB006,SKIN LACERATION REPAIR (EXCLUDING PERINEUM),342,"FRACTURES & DISLOCATIONS EXCEPT FEMUR, PELVIS & BACK",08,DISEASES AND DISORDERS OF THE MUSCULOSKELETAL SYSTEM AND CONNECTIVE TISSUE,1,Minor,Minor,Medical,Medicaid,Medicaid,,,,true,15350.46,9082.1
Hudson Valley,Ulster,5501001,000990,HealthAlliance Hospital Broadway Campus,70 or Older,124,F,White,Not Span/Hispanic,3,Emergency,Skilled Nursing Home,2019,INJ005,"FRACTURE OF THE LOWER LIMB (EXCEPT HIP), INITIAL ENCOUNTER",,,342,"FRACTURES & DISLOCATIONS EXCEPT FEMUR, PELVIS & BACK",08,DISEASES AND DISORDERS OF THE MUSCULOSKELETAL SYSTEM AND CONNECTIVE TISSUE,2,Moderate,Minor,Medical,Medicare,Private Health Insurance,,,,true,39318.02,5771.9
New York City,Manhattan,7002054,001464,New York-Presbyterian Hospital - Columbia Presbyterian Center,70 or Older,100,F,Other Race,Not Span/Hispanic,3,Emergency,Skilled Nursing Home,2019,INJ004,"FRACTURE OF THE UPPER LIMB, INITIAL ENCOUNTER",IMG009,PLAIN RADIOGRAPHY,342,"FRACTURES & DISLOCATIONS EXCEPT FEMUR, PELVIS & BACK",08,DISEASES AND DISORDERS OF THE MUSCULOSKELETAL SYSTEM AND CONNECTIVE TISSUE,2,Moderate,Moderate,Medical,Medicare,Private Health Insurance,Self-Pay,,,true,42417.7,9876.35
Capital/Adirond,Albany,0101004,000005,St. Peter's Hospital,70 or Older,121,F,White,Not Span/Hispanic,5,Emergency,Skilled Nursing Home,2019,INJ005,"FRACTURE OF THE LOWER LIMB (EXCEPT HIP), INITIAL ENCOUNTER",,,342,"FRACTURES & DISLOCATIONS EXCEPT FEMUR, PELVIS & BACK",08,DISEASES AND DISORDERS OF THE MUSCULOSKELETAL SYSTEM AND CONNECTIVE TISSUE,2,Moderate,Minor,Medical,Medicare,Medicare,,,,true,26670.25,9154.25
Capital/Adirond,Albany,0101004,000005,St. Peter's Hospital,70 or Older,123,F,White,Not Span/Hispanic,4,Emergency,Skilled Nursing Home,2019,INJ004,"FRACTURE OF THE UPPER LIMB, INITIAL ENCOUNTER",,,342,"FRACTURES & DISLOCATIONS EXCEPT FEMUR, PELVIS & BACK",08,DISEASES AND DISORDERS OF THE MUSCULOSKELETAL SYSTEM AND CONNECTIVE TISSUE,2,Moderate,Minor,Medical,Medicare,Medicare,,,,true,31163.25,9237.06
Hudson Valley,Westchester,5932000,001129,Phelps Hospital,70 or Older,105,F,White,Not Span/Hispanic,3,Emergency,Skilled Nursing Home,2019,INJ007,"DISLOCATIONS, INITIAL ENCOUNTER",,,342,"FRACTURES & DISLOCATIONS EXCEPT FEMUR, PELVIS & BACK",08,DISEASES AND DISORDERS OF THE MUSCULOSKELETAL SYSTEM AND CONNECTIVE TISSUE,1,Minor,Minor,Medical,Medicare,Private Health Insurance,,,,true,21007.12,9603.14
Hudson Valley,Dutchess,5957001,000180,Mid-Hudson Valley Division of Westchester Medical Center,70 or Older,125,M,White,Not Span/Hispanic,1,Emergency,Home w/ Home Health Services,2019,INJ004,"FRACTURE OF THE UPPER LIMB, INITIAL ENCOUNTER",,,342,"FRACTURES & DISLOCATIONS EXCEPT FEMUR, PELVIS & BACK",08,DISEASES AND DISORDERS OF THE MUSCULOSKELETAL SYSTEM AND CONNECTIVE TISSUE,1,Minor,Minor,Medical,Medicare,Blue Cross/Blue Shield,,,,true,35382.07,4799.25
Southern Tier,Broome,0303001,000042,United Health Services Hospitals Inc. - Binghamton General Hospital,70 or Older,139,F,White,Not Span/Hispanic,4,Emergency,Skilled Nursing Home,2019,INJ004,"FRACTURE OF THE UPPER LIMB, INITIAL ENCOUNTER",MST015,CLOSED REDUCTION OF BONES AND JOINTS,342,"FRACTURES & DISLOCATIONS EXCEPT FEMUR, PELVIS & BACK",08,DISEASES AND DISORDERS OF THE MUSCULOSKELETAL SYSTEM AND CONNECTIVE TISSUE,2,Moderate,Minor,Medical,Medicare,Medicare,Private Health Insurance,,,true,11772.8,7907.54
Capital/Adirond,Albany,0101004,000005,St. Peter's Hospital,50 to 69,121,F,White,Not Span/Hispanic,3,Emergency,Home or Self Care,2019,INJ004,"FRACTURE OF THE UPPER LIMB, INITIAL ENCOUNTER",,,342,"FRACTURES & DISLOCATIONS EXCEPT FEMUR, PELVIS & BACK",08,DISEASES AND DISORDERS OF THE MUSCULOSKELETAL SYSTEM AND CONNECTIVE TISSUE,2,Moderate,Minor,Medical,Medicare,Blue Cross/Blue Shield,,,,true,13810.35,5255.14
New York City,Bronx,7000002,001165,Jacobi Medical Center,30 to 49,104,M,Other Race,Unknown,1,Emergency,Home or Self Care,2019,INJ005,"FRACTURE OF THE LOWER LIMB (EXCEPT HIP), INITIAL ENCOUNTER",,,342,"FRACTURES & DISLOCATIONS EXCEPT FEMUR, PELVIS & BACK",08,DISEASES AND DISORDERS OF THE MUSCULOSKELETAL SYSTEM AND CONNECTIVE TISSUE,1,Minor,Minor,Medical,Blue Cross/Blue Shield,,,,,true,8659.04,5123.12
Capital/Adirond,Albany,0101004,000005,St. Peter's Hospital,70 or Older,122,M,White,Not Span/Hispanic,2,Emergency,Skilled Nursing Home,2019,INJ005,"FRACTURE OF THE LOWER LIMB (EXCEPT HIP), INITIAL ENCOUNTER",,,342,"FRACTURES & DISLOCATIONS EXCEPT FEMUR, PELVIS & BACK",08,DISEASES AND DISORDERS OF THE MUSCULOSKELETAL SYSTEM AND CONNECTIVE TISSUE,2,Moderate,Moderate,Medical,Medicare,Blue Cross/Blue Shield,,,,true,13050.6,3843.89
Hudson Valley,Westchester,5957001,001139,Westchester Medical Center,50 to 69,126,M,Black/African American,Not Span/Hispanic,8,Emergency,Home or Self Care,2019,INJ004,"FRACTURE OF THE UPPER LIMB, INITIAL ENCOUNTER",ESA001,HEMODIALYSIS,342,"FRACTURES & DISLOCATIONS EXCEPT FEMUR, PELVIS & BACK",08,DISEASES AND DISORDERS OF THE MUSCULOSKELETAL SYSTEM AND CONNECTIVE TISSUE,3,Major,Moderate,Medical,Medicare,Medicaid,,,,true,145211.57,26174.34
New York City,Kings,7001002,001286,Brookdale Hospital Medical Center,18 to 29,112,F,Other Race,Spanish/Hispanic,1,Trauma,Home or Self Care,2019,INJ007,"DISLOCATIONS, INITIAL ENCOUNTER",,,342,"FRACTURES & DISLOCATIONS EXCEPT FEMUR, PELVIS & BACK",08,DISEASES AND DISORDERS OF THE MUSCULOSKELETAL SYSTEM AND CONNECTIVE TISSUE,2,Moderate,Minor,Medical,Medicaid,,,,,true,14441.95,6478.91
Finger Lakes,Steuben,5002001,000870,St. James Hospital,70 or Older,148,F,White,Not Span/Hispanic,4,Emergency,Expired,2019,INJ004,"FRACTURE OF THE UPPER LIMB, INITIAL ENCOUNTER",,,342,"FRACTURES & DISLOCATIONS EXCEPT FEMUR, PELVIS & BACK",08,DISEASES AND DISORDERS OF THE MUSCULOSKELETAL SYSTEM AND CONNECTIVE TISSUE,3,Major,Major,Medical,Miscellaneous/Other,Medicare,Blue Cross/Blue Shield,,,true,9948,6105.58
New York City,Manhattan,7002054,001458,New York-Presbyterian Hospital - New York Weill Cornell Center,50 to 69,OOS,M,White,Not Span/Hispanic,4,Emergency,Skilled Nursing Home,2019,INJ005,"FRACTURE OF THE LOWER LIMB (EXCEPT HIP), INITIAL ENCOUNTER",ADM014,REGIONAL ANESTHESIA,342,"FRACTURES & DISLOCATIONS EXCEPT FEMUR, PELVIS & BACK",08,DISEASES AND DISORDERS OF THE MUSCULOSKELETAL SYSTEM AND CONNECTIVE TISSUE,1,Minor,Minor,Medical,Medicare,Self-Pay,,,,true,62978.05,14063.37
New York City,Kings,7001033,001315,Kingsbrook Jewish Medical Center,50 to 69,112,M,Black/African American,Not Span/Hispanic,1,Emergency,Left Against Medical Advice,2019,INJ004,"FRACTURE OF THE UPPER LIMB, INITIAL ENCOUNTER",,,342,"FRACTURES & DISLOCATIONS EXCEPT FEMUR, PELVIS & BACK",08,DISEASES AND DISORDERS OF THE MUSCULOSKELETAL SYSTEM AND CONNECTIVE TISSUE,1,Minor,Minor,Medical,Medicaid,Self-Pay,,,,true,11029,3079.99
Finger Lakes,Ontario,3402000,000671,Geneva General Hospital,70 or Older,144,F,White,Not Span/Hispanic,5,Emergency,Skilled Nursing Home,2019,INJ005,"FRACTURE OF THE LOWER LIMB (EXCEPT HIP), INITIAL ENCOUNTER",PLC001,IMMOBILIZATION BY SPLINT OR OTHER EXTERNAL DEVICE,342,"FRACTURES & DISLOCATIONS EXCEPT FEMUR, PELVIS & BACK",08,DISEASES AND DISORDERS OF THE MUSCULOSKELETAL SYSTEM AND CONNECTIVE TISSUE,2,Moderate,Minor,Medical,Medicare,Blue Cross/Blue Shield,,,,true,10200.01,4148.76
Finger Lakes,Ontario,3402000,000671,Geneva General Hospital,50 to 69,148,F,White,Not Span/Hispanic,1,Elective,Home or Self Care,2019,INJ004,"FRACTURE OF THE UPPER LIMB, INITIAL ENCOUNTER",MST015,CLOSED REDUCTION OF BONES AND JOINTS,342,"FRACTURES & DISLOCATIONS EXCEPT FEMUR, PELVIS & BACK",08,DISEASES AND DISORDERS OF THE MUSCULOSKELETAL SYSTEM AND CONNECTIVE TISSUE,1,Minor,Minor,Medical,Medicare,,,,,false,7846.73,3012.05
Capital/Adirond,Albany,0101004,000005,St. Peter's Hospital,70 or Older,122,F,White,Not Span/Hispanic,5,Emergency,Skilled Nursing Home,2019,INJ005,"FRACTURE OF THE LOWER LIMB (EXCEPT HIP), INITIAL ENCOUNTER",,,342,"FRACTURES & DISLOCATIONS EXCEPT FEMUR, PELVIS & BACK",08,DISEASES AND DISORDERS OF THE MUSCULOSKELETAL SYSTEM AND CONNECTIVE TISSUE,3,Major,Major,Medical,Medicare,Medicare,,,,true,28352.11,9791.58
Southern Tier,Broome,0301001,000043,Our Lady of Lourdes Memorial Hospital,70 or Older,137,F,White,Not Span/Hispanic,3,Emergency,Home or Self Care,2019,INJ004,"FRACTURE OF THE UPPER LIMB, INITIAL ENCOUNTER",SKB006,SKIN LACERATION REPAIR (EXCLUDING PERINEUM),342,"FRACTURES & DISLOCATIONS EXCEPT FEMUR, PELVIS & BACK",08,DISEASES AND DISORDERS OF THE MUSCULOSKELETAL SYSTEM AND CONNECTIVE TISSUE,4,Extreme,Extreme,Medical,Medicare,Medicaid,Self-Pay,,,true,16255.77,4033.75
Hudson Valley,Rockland,4324000,000776,Montefiore Nyack,50 to 69,109,M,Other Race,Spanish/Hispanic,10,Emergency,Skilled Nursing Home,2019,INJ004,"FRACTURE OF THE UPPER LIMB, INITIAL ENCOUNTER",MST015,CLOSED REDUCTION OF BONES AND JOINTS,342,"FRACTURES & DISLOCATIONS EXCEPT FEMUR, PELVIS & BACK",08,DISEASES AND DISORDERS OF THE MUSCULOSKELETAL SYSTEM AND CONNECTIVE TISSUE,2,Moderate,Moderate,Medical,Medicaid,,,,,false,100052.4,19767.39
Hudson Valley,Putnam,3950000,000752,Putnam Hospital,70 or Older,105,F,White,Not Span/Hispanic,9,Emergency,Hospice - Medical Facility,2019,INJ004,"FRACTURE OF THE UPPER LIMB, INITIAL ENCOUNTER",,,342,"FRACTURES & DISLOCATIONS EXCEPT FEMUR, PELVIS & BACK",08,DISEASES AND DISORDERS OF THE MUSCULOSKELETAL SYSTEM AND CONNECTIVE TISSUE,3,Major,Major,Medical,Medicare,Federal/State/Local/VA,,,,true,34407.38,14880.43
Hudson Valley,Putnam,3950000,000752,Putnam Hospital,70 or Older,105,F,White,Not Span/Hispanic,3,Emergency,Skilled Nursing Home,2019,INJ005,"FRACTURE OF THE LOWER LIMB (EXCEPT HIP), INITIAL ENCOUNTER",MST015,CLOSED REDUCTION OF BONES AND JOINTS,342,"FRACTURES & DISLOCATIONS EXCEPT FEMUR, PELVIS & BACK",08,DISEASES AND DISORDERS OF THE MUSCULOSKELETAL SYSTEM AND CONNECTIVE TISSUE,2,Moderate,Moderate,Medical,Medicare,Blue Cross/Blue Shield,,,,true,26950.45,9057.7
New York City,Kings,7001020,001305,Maimonides Medical Center,70 or Older,112,M,White,Not Span/Hispanic,3,Emergency,Skilled Nursing Home,2019,INJ004,"FRACTURE OF THE UPPER LIMB, INITIAL ENCOUNTER",,,342,"FRACTURES & DISLOCATIONS EXCEPT FEMUR, PELVIS & BACK",08,DISEASES AND DISORDERS OF THE MUSCULOSKELETAL SYSTEM AND CONNECTIVE TISSUE,1,Minor,Minor,Medical,Medicare,Medicaid,Self-Pay,,,false,19274.01,5400.83