Hospital Service Area,Hospital County,Operating Certificate Number,Permanent Facility Id,Facility Name,Age Group,Zip Code - 3 digits,Gender,Race,Ethnicity,Length of Stay,Type of Admission,Patient Disposition,Discharge Year,CCS Diagnosis Code,CCS Diagnosis Description,CCS Procedure Code,CCS Procedure Description,APR DRG Code,APR DRG Description,APR MDC Code,APR MDC Description,APR Severity of Illness Code,APR Severity of Illness Description,APR Risk of Mortality,APR Medical Surgical Description,Payment Typology 1,Payment Typology 2,Payment Typology 3,Birth Weight,Abortion Edit Indicator,Emergency Department Indicator,Total Charges,Total Costs
Long Island,Suffolk,5123000,000885,Long Island Community Hospital,70 or Older,117,M,White,Not Span/Hispanic,5,Emergency,Skilled Nursing Home,2019,INJ005,"FRACTURE OF THE LOWER LIMB (EXCEPT HIP), INITIAL ENCOUNTER",PLC001,IMMOBILIZATION BY SPLINT OR OTHER EXTERNAL DEVICE,342,"FRACTURES & DISLOCATIONS EXCEPT FEMUR, PELVIS & BACK",08,DISEASES AND DISORDERS OF THE MUSCULOSKELETAL SYSTEM AND CONNECTIVE TISSUE,2,Moderate,Moderate,Medical,Medicare,Medicare,Medicaid,,,true,66059.34,7628.38
Long Island,Suffolk,5123000,000885,Long Island Community Hospital,70 or Older,117,F,White,Not Span/Hispanic,12,Emergency,Home w/ Home Health Services,2019,INJ005,"FRACTURE OF THE LOWER LIMB (EXCEPT HIP), INITIAL ENCOUNTER",PLC001,IMMOBILIZATION BY SPLINT OR OTHER EXTERNAL DEVICE,342,"FRACTURES & DISLOCATIONS EXCEPT FEMUR, PELVIS & BACK",08,DISEASES AND DISORDERS OF THE MUSCULOSKELETAL SYSTEM AND CONNECTIVE TISSUE,2,Moderate,Moderate,Medical,Medicare,Medicare,,,,true,120895.15,17480.41
Long Island,Suffolk,5123000,000885,Long Island Community Hospital,50 to 69,117,M,Black/African American,Not Span/Hispanic,2,Emergency,Home w/ Home Health Services,2019,INJ005,"FRACTURE OF THE LOWER LIMB (EXCEPT HIP), INITIAL ENCOUNTER",PLC001,IMMOBILIZATION BY SPLINT OR OTHER EXTERNAL DEVICE,342,"FRACTURES & DISLOCATIONS EXCEPT FEMUR, PELVIS & BACK",08,DISEASES AND DISORDERS OF THE MUSCULOSKELETAL SYSTEM AND CONNECTIVE TISSUE,2,Moderate,Minor,Medical,Private Health Insurance,Private Health Insurance,Blue Cross/Blue Shield,,,true,58714.51,4864.52
Long Island,Suffolk,5123000,000885,Long Island Community Hospital,70 or Older,119,F,White,Not Span/Hispanic,4,Emergency,Skilled Nursing Home,2019,INJ004,"FRACTURE OF THE UPPER LIMB, INITIAL ENCOUNTER",PLC001,IMMOBILIZATION BY SPLINT OR OTHER EXTERNAL DEVICE,342,"FRACTURES & DISLOCATIONS EXCEPT FEMUR, PELVIS & BACK",08,DISEASES AND DISORDERS OF THE MUSCULOSKELETAL SYSTEM AND CONNECTIVE TISSUE,2,Moderate,Moderate,Medical,Medicare,Medicare,Private Health Insurance,,,true,32029.85,5556.98
Long Island,Suffolk,5123000,000885,Long Island Community Hospital,50 to 69,119,F,Black/African American,Not Span/Hispanic,1,Emergency,Home or Self Care,2019,INJ005,"FRACTURE OF THE LOWER LIMB (EXCEPT HIP), INITIAL ENCOUNTER",PLC001,IMMOBILIZATION BY SPLINT OR OTHER EXTERNAL DEVICE,342,"FRACTURES & DISLOCATIONS EXCEPT FEMUR, PELVIS & BACK",08,DISEASES AND DISORDERS OF THE MUSCULOSKELETAL SYSTEM AND CONNECTIVE TISSUE,2,Moderate,Minor,Medical,Private Health Insurance,Medicaid,,,,true,14060,2014.82
Long Island,Suffolk,5123000,000885,Long Island Community Hospital,70 or Older,117,F,White,Not Span/Hispanic,5,Emergency,Skilled Nursing Home,2019,INJ004,"FRACTURE OF THE UPPER LIMB, INITIAL ENCOUNTER",PLC001,IMMOBILIZATION BY SPLINT OR OTHER EXTERNAL DEVICE,342,"FRACTURES & DISLOCATIONS EXCEPT FEMUR, PELVIS & BACK",08,DISEASES AND DISORDERS OF THE MUSCULOSKELETAL SYSTEM AND CONNECTIVE TISSUE,2,Moderate,Minor,Medical,Medicare,Medicare,Blue Cross/Blue Shield,,,true,84034.52,9806.96
Long Island,Suffolk,5123000,000885,Long Island Community Hospital,70 or Older,117,F,White,Not Span/Hispanic,1,Emergency,Home w/ Home Health Services,2019,INJ004,"FRACTURE OF THE UPPER LIMB, INITIAL ENCOUNTER",MST015,CLOSED REDUCTION OF BONES AND JOINTS,342,"FRACTURES & DISLOCATIONS EXCEPT FEMUR, PELVIS & BACK",08,DISEASES AND DISORDERS OF THE MUSCULOSKELETAL SYSTEM AND CONNECTIVE TISSUE,2,Moderate,Minor,Medical,Medicare,Medicare,Private Health Insurance,,,true,36066.32,2573.71
Long Island,Suffolk,5123000,000885,Long Island Community Hospital,30 to 49,117,M,White,Not Span/Hispanic,1,Emergency,Short-term Hospital,2019,INJ005,"FRACTURE OF THE LOWER LIMB (EXCEPT HIP), INITIAL ENCOUNTER",MST015,CLOSED REDUCTION OF BONES AND JOINTS,342,"FRACTURES & DISLOCATIONS EXCEPT FEMUR, PELVIS & BACK",08,DISEASES AND DISORDERS OF THE MUSCULOSKELETAL SYSTEM AND CONNECTIVE TISSUE,2,Moderate,Minor,Medical,Private Health Insurance,,,,,true,49302.44,2866.97
Long Island,Suffolk,5123000,000885,Long Island Community Hospital,50 to 69,OOS,M,White,Not Span/Hispanic,5,Emergency,Home or Self Care,2019,INJ005,"FRACTURE OF THE LOWER LIMB (EXCEPT HIP), INITIAL ENCOUNTER",ESA004,NON-INVASIVE VENTILATION,342,"FRACTURES & DISLOCATIONS EXCEPT FEMUR, PELVIS & BACK",08,DISEASES AND DISORDERS OF THE MUSCULOSKELETAL SYSTEM AND CONNECTIVE TISSUE,3,Major,Minor,Medical,Private Health Insurance,Private Health Insurance,,,,true,34880.3,7251.9
Long Island,Suffolk,5123000,000885,Long Island Community Hospital,70 or Older,117,F,White,Not Span/Hispanic,3,Emergency,Skilled Nursing Home,2019,INJ005,"FRACTURE OF THE LOWER LIMB (EXCEPT HIP), INITIAL ENCOUNTER",,,342,"FRACTURES & DISLOCATIONS EXCEPT FEMUR, PELVIS & BACK",08,DISEASES AND DISORDERS OF THE MUSCULOSKELETAL SYSTEM AND CONNECTIVE TISSUE,1,Minor,Minor,Medical,Medicare,Medicare,,,,true,41439.33,4661.11
Long Island,Suffolk,5123000,000885,Long Island Community Hospital,70 or Older,117,F,White,Not Span/Hispanic,3,Emergency,Skilled Nursing Home,2019,INJ005,"FRACTURE OF THE LOWER LIMB (EXCEPT HIP), INITIAL ENCOUNTER",PLC001,IMMOBILIZATION BY SPLINT OR OTHER EXTERNAL DEVICE,342,"FRACTURES & DISLOCATIONS EXCEPT FEMUR, PELVIS & BACK",08,DISEASES AND DISORDERS OF THE MUSCULOSKELETAL SYSTEM AND CONNECTIVE TISSUE,3,Major,Major,Medical,Medicare,Medicare,Blue Cross/Blue Shield,,,true,69467.37,7190.11
Long Island,Suffolk,5123000,000885,Long Island Community Hospital,70 or Older,117,F,White,Not Span/Hispanic,3,Emergency,Skilled Nursing Home,2019,INJ004,"FRACTURE OF THE UPPER LIMB, INITIAL ENCOUNTER",PLC001,IMMOBILIZATION BY SPLINT OR OTHER EXTERNAL DEVICE,342,"FRACTURES & DISLOCATIONS EXCEPT FEMUR, PELVIS & BACK",08,DISEASES AND DISORDERS OF THE MUSCULOSKELETAL SYSTEM AND CONNECTIVE TISSUE,2,Moderate,Minor,Medical,Medicare,Medicare,Private Health Insurance,,,true,45337.69,4897.29
Long Island,Suffolk,5123000,000885,Long Island Community Hospital,50 to 69,119,F,White,Not Span/Hispanic,7,Emergency,Skilled Nursing Home,2019,INJ005,"FRACTURE OF THE LOWER LIMB (EXCEPT HIP), INITIAL ENCOUNTER",,,342,"FRACTURES & DISLOCATIONS EXCEPT FEMUR, PELVIS & BACK",08,DISEASES AND DISORDERS OF THE MUSCULOSKELETAL SYSTEM AND CONNECTIVE TISSUE,2,Moderate,Minor,Medical,Private Health Insurance,,,,,true,38656.84,9037.84
Long Island,Suffolk,5123000,000885,Long Island Community Hospital,70 or Older,117,F,White,Not Span/Hispanic,3,Emergency,Skilled Nursing Home,2019,INJ005,"FRACTURE OF THE LOWER LIMB (EXCEPT HIP), INITIAL ENCOUNTER",PLC001,IMMOBILIZATION BY SPLINT OR OTHER EXTERNAL DEVICE,342,"FRACTURES & DISLOCATIONS EXCEPT FEMUR, PELVIS & BACK",08,DISEASES AND DISORDERS OF THE MUSCULOSKELETAL SYSTEM AND CONNECTIVE TISSUE,2,Moderate,Major,Medical,Medicare,Medicare,Medicaid,,,true,53725.1,5068.76
Long Island,Suffolk,5123000,000885,Long Island Community Hospital,70 or Older,117,M,White,Not Span/Hispanic,3,Emergency,Skilled Nursing Home,2019,INJ004,"FRACTURE OF THE UPPER LIMB, INITIAL ENCOUNTER",PLC001,IMMOBILIZATION BY SPLINT OR OTHER EXTERNAL DEVICE,342,"FRACTURES & DISLOCATIONS EXCEPT FEMUR, PELVIS & BACK",08,DISEASES AND DISORDERS OF THE MUSCULOSKELETAL SYSTEM AND CONNECTIVE TISSUE,2,Moderate,Moderate,Medical,Medicare,Medicare,,,,true,43614.07,4756.66
Long Island,Suffolk,5123000,000885,Long Island Community Hospital,70 or Older,117,F,White,Not Span/Hispanic,10,Emergency,Home or Self Care,2019,INJ004,"FRACTURE OF THE UPPER LIMB, INITIAL ENCOUNTER",,,342,"FRACTURES & DISLOCATIONS EXCEPT FEMUR, PELVIS & BACK",08,DISEASES AND DISORDERS OF THE MUSCULOSKELETAL SYSTEM AND CONNECTIVE TISSUE,3,Major,Moderate,Medical,Medicare,,,,,true,107092.62,16057.25
Long Island,Suffolk,5123000,000885,Long Island Community Hospital,70 or Older,117,F,Other Race,Not Span/Hispanic,3,Emergency,Skilled Nursing Home,2019,INJ004,"FRACTURE OF THE UPPER LIMB, INITIAL ENCOUNTER",PLC001,IMMOBILIZATION BY SPLINT OR OTHER EXTERNAL DEVICE,342,"FRACTURES & DISLOCATIONS EXCEPT FEMUR, PELVIS & BACK",08,DISEASES AND DISORDERS OF THE MUSCULOSKELETAL SYSTEM AND CONNECTIVE TISSUE,1,Minor,Moderate,Medical,Medicare,Medicare,,,,true,27329.58,4486.1
Long Island,Suffolk,5123000,000885,Long Island Community Hospital,50 to 69,117,F,White,Not Span/Hispanic,3,Emergency,Skilled Nursing Home,2019,INJ004,"FRACTURE OF THE UPPER LIMB, INITIAL ENCOUNTER",MST015,CLOSED REDUCTION OF BONES AND JOINTS,342,"FRACTURES & DISLOCATIONS EXCEPT FEMUR, PELVIS & BACK",08,DISEASES AND DISORDERS OF THE MUSCULOSKELETAL SYSTEM AND CONNECTIVE TISSUE,2,Moderate,Minor,Medical,Medicare,Medicare,Medicaid,,,true,34966.19,5462.4
Long Island,Suffolk,5123000,000885,Long Island Community Hospital,70 or Older,117,F,White,Not Span/Hispanic,3,Emergency,Skilled Nursing Home,2019,INJ004,"FRACTURE OF THE UPPER LIMB, INITIAL ENCOUNTER",PLC001,IMMOBILIZATION BY SPLINT OR OTHER EXTERNAL DEVICE,342,"FRACTURES & DISLOCATIONS EXCEPT FEMUR, PELVIS & BACK",08,DISEASES AND DISORDERS OF THE MUSCULOSKELETAL SYSTEM AND CONNECTIVE TISSUE,2,Moderate,Minor,Medical,Medicare,Medicare,Blue Cross/Blue Shield,,,true,46438.03,5170.92
Long Island,Suffolk,5123000,000885,Long Island Community Hospital,70 or Older,117,F,White,Not Span/Hispanic,3,Emergency,Skilled Nursing Home,2019,INJ004,"FRACTURE OF THE UPPER LIMB, INITIAL ENCOUNTER",PLC001,IMMOBILIZATION BY SPLINT OR OTHER EXTERNAL DEVICE,342,"FRACTURES & DISLOCATIONS EXCEPT FEMUR, PELVIS & BACK",08,DISEASES AND DISORDERS OF THE MUSCULOSKELETAL SYSTEM AND CONNECTIVE TISSUE,2,Moderate,Moderate,Medical,Medicare,Medicare,Blue Cross/Blue Shield,,,true,45895.36,5057.67
Long Island,Suffolk,5123000,000885,Long Island Community Hospital,70 or Older,117,M,White,Not Span/Hispanic,7,Emergency,Skilled Nursing Home,2019,MUS014,"PATHOLOGICAL FRACTURE, INITIAL ENCOUNTER",ADM001,TRANSFUSION OF BLOOD AND BLOOD PRODUCTS,342,"FRACTURES & DISLOCATIONS EXCEPT FEMUR, PELVIS & BACK",08,DISEASES AND DISORDERS OF THE MUSCULOSKELETAL SYSTEM AND CONNECTIVE TISSUE,3,Major,Moderate,Medical,Medicare,Medicaid,,,,true,82855.31,11295
Long Island,Suffolk,5123000,000885,Long Island Community Hospital,70 or Older,119,M,White,Not Span/Hispanic,3,Emergency,Skilled Nursing Home,2019,INJ007,"DISLOCATIONS, INITIAL ENCOUNTER",MST015,CLOSED REDUCTION OF BONES AND JOINTS,342,"FRACTURES & DISLOCATIONS EXCEPT FEMUR, PELVIS & BACK",08,DISEASES AND DISORDERS OF THE MUSCULOSKELETAL SYSTEM AND CONNECTIVE TISSUE,2,Moderate,Minor,Medical,Private Health Insurance,Medicare,Medicare,,,true,44445.51,5331.11
Long Island,Suffolk,5123000,000885,Long Island Community Hospital,70 or Older,117,F,White,Not Span/Hispanic,4,Emergency,Home w/ Home Health Services,2019,INJ005,"FRACTURE OF THE LOWER LIMB (EXCEPT HIP), INITIAL ENCOUNTER",PLC001,IMMOBILIZATION BY SPLINT OR OTHER EXTERNAL DEVICE,342,"FRACTURES & DISLOCATIONS EXCEPT FEMUR, PELVIS & BACK",08,DISEASES AND DISORDERS OF THE MUSCULOSKELETAL SYSTEM AND CONNECTIVE TISSUE,3,Major,Major,Medical,Medicare,Medicare,Private Health Insurance,,,true,30397.23,6132.68
Long Island,Suffolk,5123000,000885,Long Island Community Hospital,70 or Older,117,F,White,Not Span/Hispanic,8,Emergency,Skilled Nursing Home,2019,INJ004,"FRACTURE OF THE UPPER LIMB, INITIAL ENCOUNTER",,,342,"FRACTURES & DISLOCATIONS EXCEPT FEMUR, PELVIS & BACK",08,DISEASES AND DISORDERS OF THE MUSCULOSKELETAL SYSTEM AND CONNECTIVE TISSUE,1,Minor,Minor,Medical,Medicare,,,,,true,74167.7,11846.83
Long Island,Suffolk,5123000,000885,Long Island Community Hospital,50 to 69,119,M,White,Not Span/Hispanic,5,Emergency,Home or Self Care,2019,INJ004,"FRACTURE OF THE UPPER LIMB, INITIAL ENCOUNTER",,,342,"FRACTURES & DISLOCATIONS EXCEPT FEMUR, PELVIS & BACK",08,DISEASES AND DISORDERS OF THE MUSCULOSKELETAL SYSTEM AND CONNECTIVE TISSUE,3,Major,Moderate,Medical,Private Health Insurance,Private Health Insurance,Medicare,,,true,68163.56,8370.5
Long Island,Suffolk,5123000,000885,Long Island Community Hospital,70 or Older,117,F,White,Not Span/Hispanic,8,Emergency,Skilled Nursing Home,2019,INJ004,"FRACTURE OF THE UPPER LIMB, INITIAL ENCOUNTER",PLC001,IMMOBILIZATION BY SPLINT OR OTHER EXTERNAL DEVICE,342,"FRACTURES & DISLOCATIONS EXCEPT FEMUR, PELVIS & BACK",08,DISEASES AND DISORDERS OF THE MUSCULOSKELETAL SYSTEM AND CONNECTIVE TISSUE,3,Major,Minor,Medical,Private Health Insurance,Medicare,Medicare,,,true,131492.82,19762.26
Long Island,Suffolk,5123000,000885,Long Island Community Hospital,50 to 69,117,M,White,Not Span/Hispanic,3,Emergency,Skilled Nursing Home,2019,INJ005,"FRACTURE OF THE LOWER LIMB (EXCEPT HIP), INITIAL ENCOUNTER",PLC001,IMMOBILIZATION BY SPLINT OR OTHER EXTERNAL DEVICE,342,"FRACTURES & DISLOCATIONS EXCEPT FEMUR, PELVIS & BACK",08,DISEASES AND DISORDERS OF THE MUSCULOSKELETAL SYSTEM AND CONNECTIVE TISSUE,1,Minor,Minor,Medical,Medicare,Medicare,Medicaid,,,true,23822.83,4797.83
Long Island,Suffolk,5123000,000885,Long Island Community Hospital,70 or Older,117,F,White,Not Span/Hispanic,4,Emergency,Skilled Nursing Home,2019,INJ004,"FRACTURE OF THE UPPER LIMB, INITIAL ENCOUNTER",MST015,CLOSED REDUCTION OF BONES AND JOINTS,342,"FRACTURES & DISLOCATIONS EXCEPT FEMUR, PELVIS & BACK",08,DISEASES AND DISORDERS OF THE MUSCULOSKELETAL SYSTEM AND CONNECTIVE TISSUE,2,Moderate,Moderate,Medical,Medicare,Medicare,Private Health Insurance,,,true,46178.12,5968.61
Long Island,Suffolk,5123000,000885,Long Island Community Hospital,18 to 29,119,M,Other Race,Not Span/Hispanic,3,Emergency,Home or Self Care,2019,INJ004,"FRACTURE OF THE UPPER LIMB, INITIAL ENCOUNTER",,,342,"FRACTURES & DISLOCATIONS EXCEPT FEMUR, PELVIS & BACK",08,DISEASES AND DISORDERS OF THE MUSCULOSKELETAL SYSTEM AND CONNECTIVE TISSUE,3,Major,Moderate,Medical,Private Health Insurance,Private Health Insurance,,,,true,82550.78,7160.26
Long Island,Suffolk,5123000,000885,Long Island Community Hospital,70 or Older,117,F,White,Not Span/Hispanic,1,Emergency,Home or Self Care,2019,INJ004,"FRACTURE OF THE UPPER LIMB, INITIAL ENCOUNTER",PLC001,IMMOBILIZATION BY SPLINT OR OTHER EXTERNAL DEVICE,342,"FRACTURES & DISLOCATIONS EXCEPT FEMUR, PELVIS & BACK",08,DISEASES AND DISORDERS OF THE MUSCULOSKELETAL SYSTEM AND CONNECTIVE TISSUE,3,Major,Moderate,Medical,Medicare,Medicare,Private Health Insurance,,,true,47439.9,3690.06
Long Island,Suffolk,5123000,000885,Long Island Community Hospital,70 or Older,117,F,White,Not Span/Hispanic,3,Emergency,Skilled Nursing Home,2019,INJ004,"FRACTURE OF THE UPPER LIMB, INITIAL ENCOUNTER",MST015,CLOSED REDUCTION OF BONES AND JOINTS,342,"FRACTURES & DISLOCATIONS EXCEPT FEMUR, PELVIS & BACK",08,DISEASES AND DISORDERS OF THE MUSCULOSKELETAL SYSTEM AND CONNECTIVE TISSUE,3,Major,Moderate,Medical,Medicare,,,,,true,42845.76,5030.85
Long Island,Suffolk,5123000,000885,Long Island Community Hospital,70 or Older,117,F,White,Not Span/Hispanic,3,Emergency,Skilled Nursing Home,2019,INJ004,"FRACTURE OF THE UPPER LIMB, INITIAL ENCOUNTER",SKB006,SKIN LACERATION REPAIR (EXCLUDING PERINEUM),342,"FRACTURES & DISLOCATIONS EXCEPT FEMUR, PELVIS & BACK",08,DISEASES AND DISORDERS OF THE MUSCULOSKELETAL SYSTEM AND CONNECTIVE TISSUE,2,Moderate,Moderate,Medical,Medicare,Medicare,Private Health Insurance,,,true,51019.08,4793.39
Long Island,Suffolk,5123000,000885,Long Island Community Hospital,70 or Older,117,M,White,Not Span/Hispanic,3,Emergency,Skilled Nursing Home,2019,INJ005,"FRACTURE OF THE LOWER LIMB (EXCEPT HIP), INITIAL ENCOUNTER",PLC001,IMMOBILIZATION BY SPLINT OR OTHER EXTERNAL DEVICE,342,"FRACTURES & DISLOCATIONS EXCEPT FEMUR, PELVIS & BACK",08,DISEASES AND DISORDERS OF THE MUSCULOSKELETAL SYSTEM AND CONNECTIVE TISSUE,2,Moderate,Moderate,Medical,Medicare,Medicare,,,,true,90797.34,8809.71
Long Island,Suffolk,5123000,000885,Long Island Community Hospital,50 to 69,117,F,White,Not Span/Hispanic,10,Emergency,Skilled Nursing Home,2019,INJ004,"FRACTURE OF THE UPPER LIMB, INITIAL ENCOUNTER",PLC001,IMMOBILIZATION BY SPLINT OR OTHER EXTERNAL DEVICE,342,"FRACTURES & DISLOCATIONS EXCEPT FEMUR, PELVIS & BACK",08,DISEASES AND DISORDERS OF THE MUSCULOSKELETAL SYSTEM AND CONNECTIVE TISSUE,2,Moderate,Minor,Medical,Private Health Insurance,Medicaid,,,,true,107402.39,16812.08
Long Island,Suffolk,5123000,000885,Long Island Community Hospital,70 or Older,117,M,White,Not Span/Hispanic,3,Emergency,Skilled Nursing Home,2019,INJ005,"FRACTURE OF THE LOWER LIMB (EXCEPT HIP), INITIAL ENCOUNTER",,,342,"FRACTURES & DISLOCATIONS EXCEPT FEMUR, PELVIS & BACK",08,DISEASES AND DISORDERS OF THE MUSCULOSKELETAL SYSTEM AND CONNECTIVE TISSUE,3,Major,Moderate,Medical,Medicare,Medicare,Private Health Insurance,,,true,63654.54,5985.59
Long Island,Suffolk,5123000,000885,Long Island Community Hospital,18 to 29,117,F,White,Not Span/Hispanic,2,Emergency,Home or Self Care,2019,INJ004,"FRACTURE OF THE UPPER LIMB, INITIAL ENCOUNTER",PLC001,IMMOBILIZATION BY SPLINT OR OTHER EXTERNAL DEVICE,342,"FRACTURES & DISLOCATIONS EXCEPT FEMUR, PELVIS & BACK",08,DISEASES AND DISORDERS OF THE MUSCULOSKELETAL SYSTEM AND CONNECTIVE TISSUE,2,Moderate,Minor,Medical,Private Health Insurance,Medicaid,,,,true,51495.17,3870.03
Long Island,Suffolk,5123000,000885,Long Island Community Hospital,70 or Older,117,F,Other Race,Not Span/Hispanic,3,Emergency,Skilled Nursing Home,2019,INJ004,"FRACTURE OF THE UPPER LIMB, INITIAL ENCOUNTER",PLC001,IMMOBILIZATION BY SPLINT OR OTHER EXTERNAL DEVICE,342,"FRACTURES & DISLOCATIONS EXCEPT FEMUR, PELVIS & BACK",08,DISEASES AND DISORDERS OF THE MUSCULOSKELETAL SYSTEM AND CONNECTIVE TISSUE,2,Moderate,Moderate,Medical,Medicare,Medicare,,,,true,55933.2,5520.67
Long Island,Suffolk,5123000,000885,Long Island Community Hospital,70 or Older,117,F,Other Race,Not Span/Hispanic,3,Emergency,Home w/ Home Health Services,2019,INJ004,"FRACTURE OF THE UPPER LIMB, INITIAL ENCOUNTER",SKB006,SKIN LACERATION REPAIR (EXCLUDING PERINEUM),342,"FRACTURES & DISLOCATIONS EXCEPT FEMUR, PELVIS & BACK",08,DISEASES AND DISORDERS OF THE MUSCULOSKELETAL SYSTEM AND CONNECTIVE TISSUE,2,Moderate,Moderate,Medical,Medicaid,,,,,true,55672.59,5695.68
Long Island,Suffolk,5123000,000885,Long Island Community Hospital,70 or Older,119,F,White,Not Span/Hispanic,4,Emergency,Skilled Nursing Home,2019,INJ004,"FRACTURE OF THE UPPER LIMB, INITIAL ENCOUNTER",,,342,"FRACTURES & DISLOCATIONS EXCEPT FEMUR, PELVIS & BACK",08,DISEASES AND DISORDERS OF THE MUSCULOSKELETAL SYSTEM AND CONNECTIVE TISSUE,3,Major,Major,Medical,Medicare,,,,,true,26360.42,5538.04
Long Island,Suffolk,5123000,000885,Long Island Community Hospital,70 or Older,117,F,White,Not Span/Hispanic,13,Emergency,Skilled Nursing Home,2019,INJ005,"FRACTURE OF THE LOWER LIMB (EXCEPT HIP), INITIAL ENCOUNTER",PLC001,IMMOBILIZATION BY SPLINT OR OTHER EXTERNAL DEVICE,342,"FRACTURES & DISLOCATIONS EXCEPT FEMUR, PELVIS & BACK",08,DISEASES AND DISORDERS OF THE MUSCULOSKELETAL SYSTEM AND CONNECTIVE TISSUE,2,Moderate,Moderate,Medical,Medicare,Medicare,Blue Cross/Blue Shield,,,true,77023.91,17973.85
Long Island,Suffolk,5123000,000885,Long Island Community Hospital,50 to 69,117,M,White,Not Span/Hispanic,5,Emergency,Skilled Nursing Home,2019,INJ004,"FRACTURE OF THE UPPER LIMB, INITIAL ENCOUNTER",,,342,"FRACTURES & DISLOCATIONS EXCEPT FEMUR, PELVIS & BACK",08,DISEASES AND DISORDERS OF THE MUSCULOSKELETAL SYSTEM AND CONNECTIVE TISSUE,2,Moderate,Minor,Medical,Medicare,Medicare,Blue Cross/Blue Shield,,,true,63252.49,7251.44
Long Island,Suffolk,5123000,000885,Long Island Community Hospital,50 to 69,117,F,White,Not Span/Hispanic,8,Emergency,Skilled Nursing Home,2019,INJ004,"FRACTURE OF THE UPPER LIMB, INITIAL ENCOUNTER",ESA001,HEMODIALYSIS,342,"FRACTURES & DISLOCATIONS EXCEPT FEMUR, PELVIS & BACK",08,DISEASES AND DISORDERS OF THE MUSCULOSKELETAL SYSTEM AND CONNECTIVE TISSUE,3,Major,Major,Medical,Medicare,Medicaid,,,,true,86860.89,13534.97
Long Island,Suffolk,5123000,000885,Long Island Community Hospital,50 to 69,119,F,White,Not Span/Hispanic,6,Emergency,Skilled Nursing Home,2019,INJ024,"SPRAINS AND STRAINS, INITIAL ENCOUNTER",ESA001,HEMODIALYSIS,342,"FRACTURES & DISLOCATIONS EXCEPT FEMUR, PELVIS & BACK",08,DISEASES AND DISORDERS OF THE MUSCULOSKELETAL SYSTEM AND CONNECTIVE TISSUE,3,Major,Moderate,Medical,Medicare,Medicare,Private Health Insurance,,,true,51467.91,10698.02
Long Island,Suffolk,5123000,000885,Long Island Community Hospital,70 or Older,117,F,White,Not Span/Hispanic,5,Emergency,Skilled Nursing Home,2019,INJ004,"FRACTURE OF THE UPPER LIMB, INITIAL ENCOUNTER",PLC001,IMMOBILIZATION BY SPLINT OR OTHER EXTERNAL DEVICE,342,"FRACTURES & DISLOCATIONS EXCEPT FEMUR, PELVIS & BACK",08,DISEASES AND DISORDERS OF THE MUSCULOSKELETAL SYSTEM AND CONNECTIVE TISSUE,2,Moderate,Moderate,Medical,Medicare,,,,,true,71975.48,8852.93
Long Island,Suffolk,5123000,000885,Long Island Community Hospital,50 to 69,117,M,White,Not Span/Hispanic,6,Emergency,Skilled Nursing Home,2019,MUS014,"PATHOLOGICAL FRACTURE, INITIAL ENCOUNTER",,,342,"FRACTURES & DISLOCATIONS EXCEPT FEMUR, PELVIS & BACK",08,DISEASES AND DISORDERS OF THE MUSCULOSKELETAL SYSTEM AND CONNECTIVE TISSUE,2,Moderate,Moderate,Medical,Medicare,Medicare,Medicaid,,,true,59131.36,8213.59
Long Island,Suffolk,5123000,000885,Long Island Community Hospital,50 to 69,117,F,White,Not Span/Hispanic,3,Emergency,Skilled Nursing Home,2019,INJ004,"FRACTURE OF THE UPPER LIMB, INITIAL ENCOUNTER",ESA001,HEMODIALYSIS,342,"FRACTURES & DISLOCATIONS EXCEPT FEMUR, PELVIS & BACK",08,DISEASES AND DISORDERS OF THE MUSCULOSKELETAL SYSTEM AND CONNECTIVE TISSUE,2,Moderate,Moderate,Medical,Medicare,Medicare,Blue Cross/Blue Shield,,,true,48994.49,6601.32
Long Island,Suffolk,5123000,000885,Long Island Community Hospital,50 to 69,117,F,White,Not Span/Hispanic,2,Emergency,Home w/ Home Health Services,2019,INJ005,"FRACTURE OF THE LOWER LIMB (EXCEPT HIP), INITIAL ENCOUNTER",PLC001,IMMOBILIZATION BY SPLINT OR OTHER EXTERNAL DEVICE,342,"FRACTURES & DISLOCATIONS EXCEPT FEMUR, PELVIS & BACK",08,DISEASES AND DISORDERS OF THE MUSCULOSKELETAL SYSTEM AND CONNECTIVE TISSUE,1,Minor,Minor,Medical,Private Health Insurance,Medicaid,,,,true,20873.9,4217.9
Long Island,Suffolk,5123000,000885,Long Island Community Hospital,30 to 49,117,F,Black/African American,Not Span/Hispanic,12,Emergency,Skilled Nursing Home,2019,INJ005,"FRACTURE OF THE LOWER LIMB (EXCEPT HIP), INITIAL ENCOUNTER",ADM017,ADMINISTRATION OF NUTRITIONAL AND ELECTROLYTIC SUBSTANCES,342,"FRACTURES & DISLOCATIONS EXCEPT FEMUR, PELVIS & BACK",08,DISEASES AND DISORDERS OF THE MUSCULOSKELETAL SYSTEM AND CONNECTIVE TISSUE,2,Moderate,Minor,Medical,Medicare,Medicare,Medicaid,,,true,79877.09,15663.29
Long Island,Suffolk,5123000,000885,Long Island Community Hospital,50 to 69,117,M,White,Not Span/Hispanic,6,Emergency,Home or Self Care,2019,INJ004,"FRACTURE OF THE UPPER LIMB, INITIAL ENCOUNTER",PLC001,IMMOBILIZATION BY SPLINT OR OTHER EXTERNAL DEVICE,342,"FRACTURES & DISLOCATIONS EXCEPT FEMUR, PELVIS & BACK",08,DISEASES AND DISORDERS OF THE MUSCULOSKELETAL SYSTEM AND CONNECTIVE TISSUE,2,Moderate,Minor,Medical,Private Health Insurance,,,,,true,71420.86,9964.69