Hospital Service Area,Hospital County,Operating Certificate Number,Permanent Facility Id,Facility Name,Age Group,Zip Code - 3 digits,Gender,Race,Ethnicity,Length of Stay,Type of Admission,Patient Disposition,Discharge Year,CCS Diagnosis Code,CCS Diagnosis Description,CCS Procedure Code,CCS Procedure Description,APR DRG Code,APR DRG Description,APR MDC Code,APR MDC Description,APR Severity of Illness Code,APR Severity of Illness Description,APR Risk of Mortality,APR Medical Surgical Description,Payment Typology 1,Payment Typology 2,Payment Typology 3,Birth Weight,Abortion Edit Indicator,Emergency Department Indicator,Total Charges,Total Costs
New York City,Bronx,7000006,001169,Montefiore Medical Center - Henry & Lucy Moses Div,70 or Older,104,M,Other Race,Not Span/Hispanic,9,Emergency,Skilled Nursing Home,2017,042,Secondary malignancies,180,OTHER CT SCAN,343,Musculoskeletal malignancy & pathol fracture d/t muscskel malig,08,Diseases and Disorders of the Musculoskeletal System and Conn Tissue,3,Major,Major,Medical,Medicare,Medicaid,,,N,N,198779.00,38313.34
New York City,Bronx,7000006,001169,Montefiore Medical Center - Henry & Lucy Moses Div,30 to 49,104,M,Black/African American,Not Span/Hispanic,8,Emergency,Home w/ Home Health Services,2017,042,Secondary malignancies,211,THERAPEUTIC RADIOLOGY,343,Musculoskeletal malignancy & pathol fracture d/t muscskel malig,08,Diseases and Disorders of the Musculoskeletal System and Conn Tissue,3,Major,Moderate,Medical,Private Health Insurance,,,,N,Y,127941.34,20578.44
New York City,Kings,7001033,001315,Kingsbrook Jewish Medical Center,70 or Older,112,M,Black/African American,Not Span/Hispanic,1,Emergency,Home or Self Care,2017,042,Secondary malignancies,000,NO PROC,343,Musculoskeletal malignancy & pathol fracture d/t muscskel malig,08,Diseases and Disorders of the Musculoskeletal System and Conn Tissue,2,Moderate,Moderate,Medical,Medicare,Medicare,Self-Pay,,N,Y,10625.00,2576.30
New York City,Kings,7002002,001324,Mount Sinai Brooklyn,70 or Older,112,F,Black/African American,Not Span/Hispanic,4,Emergency,Home w/ Home Health Services,2017,042,Secondary malignancies,231,OTHER THERAPEUTIC PRCS,343,Musculoskeletal malignancy & pathol fracture d/t muscskel malig,08,Diseases and Disorders of the Musculoskeletal System and Conn Tissue,1,Minor,Moderate,Medical,Medicare,Miscellaneous/Other,Medicaid,,N,N,37064.12,5977.70
New York City,Manhattan,7002024,001456,Mount Sinai Hospital,50 to 69,100,M,Black/African American,Not Span/Hispanic,16,Emergency,Hospice - Home,2017,042,Secondary malignancies,198,MAG RESONANCE IMAGING,343,Musculoskeletal malignancy & pathol fracture d/t muscskel malig,08,Diseases and Disorders of the Musculoskeletal System and Conn Tissue,3,Major,Moderate,Medical,Medicare,Private Health Insurance,Self-Pay,,N,Y,107985.20,37660.43
New York City,Manhattan,7002024,001456,Mount Sinai Hospital,30 to 49,112,F,Black/African American,Not Span/Hispanic,7,Emergency,Home w/ Home Health Services,2017,021,Cancer of bone and connective tissue,222,BLOOD TRANSFUSION,343,Musculoskeletal malignancy & pathol fracture d/t muscskel malig,08,Diseases and Disorders of the Musculoskeletal System and Conn Tissue,3,Major,Moderate,Medical,Medicaid,Medicaid,Self-Pay,,N,Y,60699.87,20619.73
New York City,Manhattan,7002032,001466,Mount Sinai West,50 to 69,104,M,White,Spanish/Hispanic,10,Emergency,Skilled Nursing Home,2017,207,Pathological fracture,179,CT SCAN ABDOMEN,343,Musculoskeletal malignancy & pathol fracture d/t muscskel malig,08,Diseases and Disorders of the Musculoskeletal System and Conn Tissue,3,Major,Moderate,Medical,Medicaid,Medicaid,Self-Pay,,N,Y,82992.29,22170.38
Hudson Valley,Orange,3523000,000699,Orange Regional Medical Center,50 to 69,109,M,White,Not Span/Hispanic,13,Emergency,Home w/ Home Health Services,2017,042,Secondary malignancies,083,BIOPSY OF LIVER,343,Musculoskeletal malignancy & pathol fracture d/t muscskel malig,08,Diseases and Disorders of the Musculoskeletal System and Conn Tissue,3,Major,Moderate,Medical,Medicaid,,,,N,Y,119163.18,24189.94
Hudson Valley,Orange,3523000,000699,Orange Regional Medical Center,50 to 69,127,F,White,Not Span/Hispanic,12,Emergency,Home w/ Home Health Services,2017,042,Secondary malignancies,211,THERAPEUTIC RADIOLOGY,343,Musculoskeletal malignancy & pathol fracture d/t muscskel malig,08,Diseases and Disorders of the Musculoskeletal System and Conn Tissue,3,Major,Moderate,Medical,Medicare,,,,N,Y,95398.21,19873.18
Hudson Valley,Orange,3523000,000699,Orange Regional Medical Center,50 to 69,124,M,White,Not Span/Hispanic,5,Emergency,Home or Self Care,2017,042,Secondary malignancies,000,NO PROC,343,Musculoskeletal malignancy & pathol fracture d/t muscskel malig,08,Diseases and Disorders of the Musculoskeletal System and Conn Tissue,3,Major,Major,Medical,Blue Cross/Blue Shield,,,,N,Y,30501.71,7338.60
Hudson Valley,Orange,3535001,000708,Bon Secours Community Hospital,70 or Older,127,M,White,Not Span/Hispanic,5,Emergency,Skilled Nursing Home,2017,042,Secondary malignancies,000,NO PROC,343,Musculoskeletal malignancy & pathol fracture d/t muscskel malig,08,Diseases and Disorders of the Musculoskeletal System and Conn Tissue,2,Moderate,Moderate,Medical,Medicare,Private Health Insurance,,,N,Y,61362.12,15638.88
New York City,Bronx,7000006,001169,Montefiore Medical Center - Henry & Lucy Moses Div,50 to 69,104,M,Black/African American,Not Span/Hispanic,15,Emergency,Home w/ Home Health Services,2017,231,Other fractures,005,INS CATHETER/SPNL STIM,343,Musculoskeletal malignancy & pathol fracture d/t muscskel malig,08,Diseases and Disorders of the Musculoskeletal System and Conn Tissue,4,Extreme,Major,Medical,Private Health Insurance,,,,N,Y,194194.37,38645.63
New York City,Bronx,7000006,001169,Montefiore Medical Center - Henry & Lucy Moses Div,50 to 69,104,F,Other Race,Not Span/Hispanic,8,Emergency,Home w/ Home Health Services,2017,042,Secondary malignancies,211,THERAPEUTIC RADIOLOGY,343,Musculoskeletal malignancy & pathol fracture d/t muscskel malig,08,Diseases and Disorders of the Musculoskeletal System and Conn Tissue,3,Major,Major,Medical,Medicare,Medicaid,,,N,Y,133990.20,25348.27
New York City,Manhattan,7002002,001439,Mount Sinai Beth Israel,70 or Older,113,F,White,Not Span/Hispanic,2,Emergency,Expired,2017,042,Secondary malignancies,216,RESP INTUB/MECH VENTIL,343,Musculoskeletal malignancy & pathol fracture d/t muscskel malig,08,Diseases and Disorders of the Musculoskeletal System and Conn Tissue,3,Major,Major,Medical,Medicare,Miscellaneous/Other,Self-Pay,,N,Y,17823.12,5481.55
New York City,Manhattan,7002024,001456,Mount Sinai Hospital,70 or Older,113,F,White,Not Span/Hispanic,6,Emergency,Home w/ Home Health Services,2017,207,Pathological fracture,108,INDWELLING CATHETER,343,Musculoskeletal malignancy & pathol fracture d/t muscskel malig,08,Diseases and Disorders of the Musculoskeletal System and Conn Tissue,3,Major,Major,Medical,Medicare,Private Health Insurance,Medicaid,,N,Y,56478.44,16817.19
New York City,Manhattan,7002032,001466,Mount Sinai West,70 or Older,100,M,White,Not Span/Hispanic,13,Emergency,Skilled Nursing Home,2017,207,Pathological fracture,211,THERAPEUTIC RADIOLOGY,343,Musculoskeletal malignancy & pathol fracture d/t muscskel malig,08,Diseases and Disorders of the Musculoskeletal System and Conn Tissue,3,Major,Major,Medical,Medicare,Private Health Insurance,Self-Pay,,N,Y,119605.59,29692.10
New York City,Manhattan,7002032,001466,Mount Sinai West,70 or Older,100,F,White,Not Span/Hispanic,5,Emergency,Home w/ Home Health Services,2017,042,Secondary malignancies,198,MAG RESONANCE IMAGING,343,Musculoskeletal malignancy & pathol fracture d/t muscskel malig,08,Diseases and Disorders of the Musculoskeletal System and Conn Tissue,2,Moderate,Moderate,Medical,Medicare,Private Health Insurance,Self-Pay,,N,Y,38663.57,10384.92
Capital/Adirond,Delaware,1229700,000174,Delaware Valley Hospital Inc,70 or Older,138,M,White,Not Span/Hispanic,4,Emergency,Short-term Hospital,2017,042,Secondary malignancies,222,BLOOD TRANSFUSION,343,Musculoskeletal malignancy & pathol fracture d/t muscskel malig,08,Diseases and Disorders of the Musculoskeletal System and Conn Tissue,3,Major,Major,Medical,Medicare,,,,N,Y,26691.00,19093.73
New York City,Bronx,7000006,001169,Montefiore Medical Center - Henry & Lucy Moses Div,50 to 69,104,F,Black/African American,Not Span/Hispanic,5,Emergency,Home w/ Home Health Services,2017,042,Secondary malignancies,231,OTHER THERAPEUTIC PRCS,343,Musculoskeletal malignancy & pathol fracture d/t muscskel malig,08,Diseases and Disorders of the Musculoskeletal System and Conn Tissue,3,Major,Major,Medical,Medicare,,,,N,Y,81263.28,15091.21
New York City,Bronx,7000006,001169,Montefiore Medical Center - Henry & Lucy Moses Div,50 to 69,104,M,Other Race,Spanish/Hispanic,4,Emergency,Home or Self Care,2017,042,Secondary malignancies,222,BLOOD TRANSFUSION,343,Musculoskeletal malignancy & pathol fracture d/t muscskel malig,08,Diseases and Disorders of the Musculoskeletal System and Conn Tissue,4,Extreme,Major,Medical,Medicare,Medicaid,,,N,Y,53985.21,10917.99
New York City,Bronx,7000006,001169,Montefiore Medical Center - Henry & Lucy Moses Div,70 or Older,104,F,Black/African American,Not Span/Hispanic,3,Emergency,Home w/ Home Health Services,2017,021,Cancer of bone and connective tissue,173,OT DX PRC SKIN/SUBCUTAN,343,Musculoskeletal malignancy & pathol fracture d/t muscskel malig,08,Diseases and Disorders of the Musculoskeletal System and Conn Tissue,3,Major,Major,Medical,Medicaid,,,,N,N,58291.18,8391.25
New York City,Bronx,7000006,003058,Montefiore Med Center - Jack D Weiler Hosp of A Einstein College Div,70 or Older,104,M,Black/African American,Not Span/Hispanic,5,Emergency,Home or Self Care,2017,042,Secondary malignancies,180,OTHER CT SCAN,343,Musculoskeletal malignancy & pathol fracture d/t muscskel malig,08,Diseases and Disorders of the Musculoskeletal System and Conn Tissue,2,Moderate,Moderate,Medical,Medicare,,,,N,Y,90107.15,14478.64
New York City,Kings,7001003,001288,Brooklyn Hospital Center - Downtown Campus,50 to 69,112,M,Black/African American,Unknown,12,Emergency,Expired,2017,042,Secondary malignancies,222,BLOOD TRANSFUSION,343,Musculoskeletal malignancy & pathol fracture d/t muscskel malig,08,Diseases and Disorders of the Musculoskeletal System and Conn Tissue,4,Extreme,Extreme,Medical,Private Health Insurance,Self-Pay,,,N,Y,90046.33,17873.28
New York City,Kings,7001003,001288,Brooklyn Hospital Center - Downtown Campus,70 or Older,112,F,Black/African American,Not Span/Hispanic,2,Emergency,Home w/ Home Health Services,2017,021,Cancer of bone and connective tissue,000,NO PROC,343,Musculoskeletal malignancy & pathol fracture d/t muscskel malig,08,Diseases and Disorders of the Musculoskeletal System and Conn Tissue,2,Moderate,Moderate,Medical,Medicare,Medicare,Self-Pay,,N,Y,13191.99,2633.31
New York City,Kings,7001037,001320,University Hospital of Brooklyn,30 to 49,112,F,Black/African American,Not Span/Hispanic,2,Urgent,Home or Self Care,2017,021,Cancer of bone and connective tissue,175,OT OR THER PRC SKN/BRST,343,Musculoskeletal malignancy & pathol fracture d/t muscskel malig,08,Diseases and Disorders of the Musculoskeletal System and Conn Tissue,2,Moderate,Minor,Medical,Federal/State/Local/VA,Self-Pay,,,N,N,64924.00,33907.21
New York City,Manhattan,7002024,001456,Mount Sinai Hospital,70 or Older,114,M,Other Race,Not Span/Hispanic,20,Emergency,Expired,2017,013,Cancer of stomach,216,RESP INTUB/MECH VENTIL,343,Musculoskeletal malignancy & pathol fracture d/t muscskel malig,08,Diseases and Disorders of the Musculoskeletal System and Conn Tissue,4,Extreme,Extreme,Medical,Medicare,Medicare,Self-Pay,,N,Y,151959.40,51768.66
New York City,Kings,7001021,001306,New York - Presbyterian Brooklyn Methodist Hospital,50 to 69,114,M,Black/African American,Not Span/Hispanic,18,Emergency,Skilled Nursing Home,2017,042,Secondary malignancies,000,NO PROC,343,Musculoskeletal malignancy & pathol fracture d/t muscskel malig,08,Diseases and Disorders of the Musculoskeletal System and Conn Tissue,4,Extreme,Extreme,Medical,Blue Cross/Blue Shield,Self-Pay,,,N,Y,154168.97,63302.33
New York City,Kings,7001021,001306,New York - Presbyterian Brooklyn Methodist Hospital,50 to 69,112,M,Black/African American,Not Span/Hispanic,10,Emergency,Skilled Nursing Home,2017,042,Secondary malignancies,222,BLOOD TRANSFUSION,343,Musculoskeletal malignancy & pathol fracture d/t muscskel malig,08,Diseases and Disorders of the Musculoskeletal System and Conn Tissue,4,Extreme,Major,Medical,Blue Cross/Blue Shield,Self-Pay,,,N,Y,66614.53,25288.98
New York City,Kings,7001021,001306,New York - Presbyterian Brooklyn Methodist Hospital,50 to 69,112,F,Black/African American,Not Span/Hispanic,11,Emergency,Skilled Nursing Home,2017,042,Secondary malignancies,000,NO PROC,343,Musculoskeletal malignancy & pathol fracture d/t muscskel malig,08,Diseases and Disorders of the Musculoskeletal System and Conn Tissue,3,Major,Major,Medical,Medicare,Medicare,Self-Pay,,N,Y,83010.33,43893.34
New York City,Kings,7001021,001306,New York - Presbyterian Brooklyn Methodist Hospital,50 to 69,112,M,White,Not Span/Hispanic,5,Emergency,Home or Self Care,2017,042,Secondary malignancies,054,OT VASC CATH; NOT HEART,343,Musculoskeletal malignancy & pathol fracture d/t muscskel malig,08,Diseases and Disorders of the Musculoskeletal System and Conn Tissue,2,Moderate,Major,Medical,Medicare,Blue Cross/Blue Shield,Self-Pay,,N,Y,42142.49,19000.24
New York City,Kings,7001021,001306,New York - Presbyterian Brooklyn Methodist Hospital,70 or Older,112,M,Black/African American,Not Span/Hispanic,2,Emergency,Skilled Nursing Home,2017,042,Secondary malignancies,070,UP GASTRO ENDOSC/BIOPSY,343,Musculoskeletal malignancy & pathol fracture d/t muscskel malig,08,Diseases and Disorders of the Musculoskeletal System and Conn Tissue,3,Major,Major,Medical,Medicare,Medicaid,Self-Pay,,N,Y,16878.46,5789.17
New York City,Manhattan,7002054,001437,New York-Presbyterian/Lower Manhattan Hospital,50 to 69,100,F,Other Race,Not Span/Hispanic,9,Emergency,Skilled Nursing Home,2017,042,Secondary malignancies,222,BLOOD TRANSFUSION,343,Musculoskeletal malignancy & pathol fracture d/t muscskel malig,08,Diseases and Disorders of the Musculoskeletal System and Conn Tissue,3,Major,Major,Medical,Medicaid,Medicaid,Self-Pay,,N,Y,104898.72,25617.90
New York City,Manhattan,7002002,001439,Mount Sinai Beth Israel,50 to 69,100,M,Other Race,Not Span/Hispanic,24,Emergency,Home w/ Home Health Services,2017,042,Secondary malignancies,222,BLOOD TRANSFUSION,343,Musculoskeletal malignancy & pathol fracture d/t muscskel malig,08,Diseases and Disorders of the Musculoskeletal System and Conn Tissue,3,Major,Moderate,Medical,Private Health Insurance,Medicare,Self-Pay,,N,Y,178983.55,57904.96
New York City,Manhattan,7002024,001456,Mount Sinai Hospital,70 or Older,113,M,White,Not Span/Hispanic,22,Emergency,Expired,2017,042,Secondary malignancies,211,THERAPEUTIC RADIOLOGY,343,Musculoskeletal malignancy & pathol fracture d/t muscskel malig,08,Diseases and Disorders of the Musculoskeletal System and Conn Tissue,3,Major,Major,Medical,Medicare,Private Health Insurance,Self-Pay,,N,Y,198050.91,61268.05
New York City,Manhattan,7002024,001456,Mount Sinai Hospital,50 to 69,112,F,Black/African American,Not Span/Hispanic,6,Emergency,Home w/ Home Health Services,2017,042,Secondary malignancies,223,ENTERAL/PARENTERAL NUTR,343,Musculoskeletal malignancy & pathol fracture d/t muscskel malig,08,Diseases and Disorders of the Musculoskeletal System and Conn Tissue,3,Major,Major,Medical,Medicaid,Medicaid,Self-Pay,,N,Y,62883.77,18792.26
New York City,Manhattan,7002054,001464,New York Presbyterian Hospital - Columbia Presbyterian Center,30 to 49,105,F,White,Not Span/Hispanic,7,Urgent,Hospice - Medical Facility,2017,041,Cancer; other and unspecified primary,000,NO PROC,343,Musculoskeletal malignancy & pathol fracture d/t muscskel malig,08,Diseases and Disorders of the Musculoskeletal System and Conn Tissue,3,Major,Major,Medical,Private Health Insurance,Self-Pay,,,N,N,66450.79,16668.34
New York City,Manhattan,7002054,001464,New York Presbyterian Hospital - Columbia Presbyterian Center,70 or Older,OOS,M,White,Not Span/Hispanic,6,Emergency,Home w/ Home Health Services,2017,021,Cancer of bone and connective tissue,222,BLOOD TRANSFUSION,343,Musculoskeletal malignancy & pathol fracture d/t muscskel malig,08,Diseases and Disorders of the Musculoskeletal System and Conn Tissue,3,Major,Major,Medical,Medicare,Blue Cross/Blue Shield,Self-Pay,,N,Y,67289.35,16666.65
New York City,Manhattan,7002054,001464,New York Presbyterian Hospital - Columbia Presbyterian Center,70 or Older,100,M,Multi-racial,Not Span/Hispanic,13,Emergency,Skilled Nursing Home,2017,042,Secondary malignancies,211,THERAPEUTIC RADIOLOGY,343,Musculoskeletal malignancy & pathol fracture d/t muscskel malig,08,Diseases and Disorders of the Musculoskeletal System and Conn Tissue,3,Major,Major,Medical,Medicare,Medicare,Medicaid,,N,Y,156306.74,38366.61
New York City,Queens,7003010,001637,New York - Presbyterian/Queens,50 to 69,113,M,White,Not Span/Hispanic,7,Emergency,Expired,2017,042,Secondary malignancies,222,BLOOD TRANSFUSION,343,Musculoskeletal malignancy & pathol fracture d/t muscskel malig,08,Diseases and Disorders of the Musculoskeletal System and Conn Tissue,3,Major,Extreme,Medical,Private Health Insurance,,,,N,Y,55177.70,15969.32
New York City,Queens,7003010,001637,New York - Presbyterian/Queens,70 or Older,110,F,Other Race,Not Span/Hispanic,4,Emergency,Home or Self Care,2017,013,Cancer of stomach,074,GASTRECTOMY; PART/TOTAL,343,Musculoskeletal malignancy & pathol fracture d/t muscskel malig,08,Diseases and Disorders of the Musculoskeletal System and Conn Tissue,2,Moderate,Moderate,Medical,Medicare,Medicare,Self-Pay,,N,Y,50417.01,18297.64
New York City,Queens,7003010,001637,New York - Presbyterian/Queens,50 to 69,113,M,White,Not Span/Hispanic,4,Emergency,Home or Self Care,2017,042,Secondary malignancies,037,DX BRONCHOSCOPY & BIOPS,343,Musculoskeletal malignancy & pathol fracture d/t muscskel malig,08,Diseases and Disorders of the Musculoskeletal System and Conn Tissue,2,Moderate,Moderate,Medical,Private Health Insurance,,,,N,Y,41581.09,10264.69
Central NY,Onondaga,3301008,000636,Crouse Hospital,70 or Older,130,F,White,Not Span/Hispanic,6,Emergency,Hospice - Home,2017,207,Pathological fracture,231,OTHER THERAPEUTIC PRCS,343,Musculoskeletal malignancy & pathol fracture d/t muscskel malig,08,Diseases and Disorders of the Musculoskeletal System and Conn Tissue,3,Major,Major,Medical,Medicare,Medicare,,,N,Y,17025.45,8314.51
Hudson Valley,Rockland,4329000,000779,Good Samaritan Hospital of Suffern,70 or Older,109,M,Black/African American,Not Span/Hispanic,5,Emergency,Skilled Nursing Home,2017,042,Secondary malignancies,000,NO PROC,343,Musculoskeletal malignancy & pathol fracture d/t muscskel malig,08,Diseases and Disorders of the Musculoskeletal System and Conn Tissue,2,Moderate,Moderate,Medical,Medicare,Federal/State/Local/VA,,,N,Y,50997.82,12169.45
Hudson Valley,Sullivan,5263000,000971,Catskill Regional Medical Center,50 to 69,127,M,Other Race,Spanish/Hispanic,5,Emergency,Short-term Hospital,2017,207,Pathological fracture,000,NO PROC,343,Musculoskeletal malignancy & pathol fracture d/t muscskel malig,08,Diseases and Disorders of the Musculoskeletal System and Conn Tissue,3,Major,Moderate,Medical,Medicaid,,,,N,Y,38421.95,13465.38
Hudson Valley,Westchester,5907001,001097,SJRH - St Johns Division,50 to 69,107,M,White,Spanish/Hispanic,7,Emergency,Skilled Nursing Home,2017,042,Secondary malignancies,000,NO PROC,343,Musculoskeletal malignancy & pathol fracture d/t muscskel malig,08,Diseases and Disorders of the Musculoskeletal System and Conn Tissue,3,Major,Major,Medical,Medicare,Medicare,Self-Pay,,N,Y,39097.53,16048.69
Hudson Valley,Westchester,5907001,001097,SJRH - St Johns Division,70 or Older,107,F,Other Race,Not Span/Hispanic,22,Emergency,Skilled Nursing Home,2017,042,Secondary malignancies,000,NO PROC,343,Musculoskeletal malignancy & pathol fracture d/t muscskel malig,08,Diseases and Disorders of the Musculoskeletal System and Conn Tissue,3,Major,Major,Medical,Medicare,Private Health Insurance,Self-Pay,,N,Y,144221.26,58159.28
New York City,Kings,7002002,001324,Mount Sinai Brooklyn,70 or Older,112,F,White,Unknown,7,Emergency,Home w/ Home Health Services,2017,042,Secondary malignancies,065,BONE MARROW BIOPSY,343,Musculoskeletal malignancy & pathol fracture d/t muscskel malig,08,Diseases and Disorders of the Musculoskeletal System and Conn Tissue,2,Moderate,Moderate,Medical,Medicare,Miscellaneous/Other,Medicaid,,N,Y,73119.80,14919.55
New York City,Manhattan,7002002,001439,Mount Sinai Beth Israel,30 to 49,112,M,White,Not Span/Hispanic,5,Emergency,Home or Self Care,2017,042,Secondary malignancies,198,MAG RESONANCE IMAGING,343,Musculoskeletal malignancy & pathol fracture d/t muscskel malig,08,Diseases and Disorders of the Musculoskeletal System and Conn Tissue,3,Major,Moderate,Medical,Medicaid,Medicaid,Self-Pay,,N,Y,54077.44,12795.52
New York City,Manhattan,7002024,001456,Mount Sinai Hospital,50 to 69,100,F,Other Race,Not Span/Hispanic,16,Urgent,Home w/ Home Health Services,2017,042,Secondary malignancies,211,THERAPEUTIC RADIOLOGY,343,Musculoskeletal malignancy & pathol fracture d/t muscskel malig,08,Diseases and Disorders of the Musculoskeletal System and Conn Tissue,3,Major,Moderate,Medical,Private Health Insurance,Self-Pay,,,N,N,184726.46,50432.70
New York City,Manhattan,7002053,001463,NYU Langone Hospitals,50 to 69,125,M,White,Not Span/Hispanic,6,Emergency,Skilled Nursing Home,2017,042,Secondary malignancies,211,THERAPEUTIC RADIOLOGY,343,Musculoskeletal malignancy & pathol fracture d/t muscskel malig,08,Diseases and Disorders of the Musculoskeletal System and Conn Tissue,3,Major,Major,Medical,Private Health Insurance,,,,N,Y,80123.06,30487.30
New York City,Manhattan,7002053,001463,NYU Langone Hospitals,70 or Older,OOS,M,White,Not Span/Hispanic,10,Emergency,Skilled Nursing Home,2017,042,Secondary malignancies,000,NO PROC,343,Musculoskeletal malignancy & pathol fracture d/t muscskel malig,08,Diseases and Disorders of the Musculoskeletal System and Conn Tissue,2,Moderate,Moderate,Medical,Medicare,,,,N,Y,120267.97,63368.75
New York City,Manhattan,7002032,001469,Mount Sinai St. Luke's,70 or Older,100,M,Other Race,Not Span/Hispanic,7,Emergency,Home w/ Home Health Services,2017,042,Secondary malignancies,159,OT DX PRCS ON MUSC/SKEL,343,Musculoskeletal malignancy & pathol fracture d/t muscskel malig,08,Diseases and Disorders of the Musculoskeletal System and Conn Tissue,4,Extreme,Major,Medical,Medicare,Medicare,Medicaid,,N,Y,85247.65,24259.85
Long Island,Suffolk,5123000,000885,Brookhaven Memorial Hospital Medical Center Inc,50 to 69,117,F,White,Not Span/Hispanic,7,Emergency,Skilled Nursing Home,2017,207,Pathological fracture,000,NO PROC,343,Musculoskeletal malignancy & pathol fracture d/t muscskel malig,08,Diseases and Disorders of the Musculoskeletal System and Conn Tissue,3,Major,Moderate,Medical,Medicare,Medicare,Medicaid,,N,Y,104128.41,14363.01
Western NY,Erie,1401014,000207,Buffalo General Medical Center,50 to 69,141,M,White,Not Span/Hispanic,3,Elective,Home or Self Care,2017,021,Cancer of bone and connective tissue,159,OT DX PRCS ON MUSC/SKEL,343,Musculoskeletal malignancy & pathol fracture d/t muscskel malig,08,Diseases and Disorders of the Musculoskeletal System and Conn Tissue,1,Minor,Minor,Medical,Medicaid,Self-Pay,,,N,N,37157.37,12493.48
Western NY,Erie,1401014,000207,Buffalo General Medical Center,70 or Older,142,M,White,Not Span/Hispanic,13,Emergency,Hospice - Medical Facility,2017,042,Secondary malignancies,037,DX BRONCHOSCOPY & BIOPS,343,Musculoskeletal malignancy & pathol fracture d/t muscskel malig,08,Diseases and Disorders of the Musculoskeletal System and Conn Tissue,3,Major,Major,Medical,Medicare,Self-Pay,,,N,Y,46032.69,20845.22