Hospital Service Area,Hospital County,Operating Certificate Number,Permanent Facility Id,Facility Name,Age Group,Zip Code - 3 digits,Gender,Race,Ethnicity,Length of Stay,Type of Admission,Patient Disposition,Discharge Year,CCS Diagnosis Code,CCS Diagnosis Description,CCS Procedure Code,CCS Procedure Description,APR DRG Code,APR DRG Description,APR MDC Code,APR MDC Description,APR Severity of Illness Code,APR Severity of Illness Description,APR Risk of Mortality,APR Medical Surgical Description,Payment Typology 1,Payment Typology 2,Payment Typology 3,Birth Weight,Abortion Edit Indicator,Emergency Department Indicator,Total Charges,Total Costs
Long Island,Nassau,2908000,000511,NYU Winthrop Hospital,70 or Older,115,F,White,Not Span/Hispanic,7,Emergency,Home or Self Care,2017,042,Secondary malignancies,159,OT DX PRCS ON MUSC/SKEL,343,Musculoskeletal malignancy & pathol fracture d/t muscskel malig,08,Diseases and Disorders of the Musculoskeletal System and Conn Tissue,2,Moderate,Moderate,Medical,Medicare,Medicare,Blue Cross/Blue Shield,,N,Y,132347.71,32525.61
Long Island,Nassau,2908000,000511,NYU Winthrop Hospital,70 or Older,115,F,White,Not Span/Hispanic,5,Elective,Home or Self Care,2017,013,Cancer of stomach,074,GASTRECTOMY; PART/TOTAL,343,Musculoskeletal malignancy & pathol fracture d/t muscskel malig,08,Diseases and Disorders of the Musculoskeletal System and Conn Tissue,1,Minor,Minor,Medical,Blue Cross/Blue Shield,Medicare,,,N,N,69944.56,15314.26
Long Island,Nassau,2908000,000511,NYU Winthrop Hospital,70 or Older,110,F,White,Not Span/Hispanic,11,Emergency,Skilled Nursing Home,2017,207,Pathological fracture,159,OT DX PRCS ON MUSC/SKEL,343,Musculoskeletal malignancy & pathol fracture d/t muscskel malig,08,Diseases and Disorders of the Musculoskeletal System and Conn Tissue,2,Moderate,Moderate,Medical,Medicare,Medicare,Private Health Insurance,,N,Y,104986.55,22558.86
Long Island,Nassau,2908000,000511,NYU Winthrop Hospital,70 or Older,117,F,White,Not Span/Hispanic,1,Emergency,Home or Self Care,2017,207,Pathological fracture,000,NO PROC,343,Musculoskeletal malignancy & pathol fracture d/t muscskel malig,08,Diseases and Disorders of the Musculoskeletal System and Conn Tissue,2,Moderate,Moderate,Medical,Medicare,Medicare,Blue Cross/Blue Shield,,N,Y,67634.29,8709.16
Long Island,Nassau,2908000,000511,NYU Winthrop Hospital,50 to 69,117,M,White,Not Span/Hispanic,5,Emergency,Home or Self Care,2017,042,Secondary malignancies,000,NO PROC,343,Musculoskeletal malignancy & pathol fracture d/t muscskel malig,08,Diseases and Disorders of the Musculoskeletal System and Conn Tissue,2,Moderate,Moderate,Medical,Blue Cross/Blue Shield,,,,N,Y,120005.59,22862.83
Long Island,Nassau,2908000,000511,NYU Winthrop Hospital,70 or Older,117,F,White,Not Span/Hispanic,17,Emergency,Hospice - Medical Facility,2017,042,Secondary malignancies,000,NO PROC,343,Musculoskeletal malignancy & pathol fracture d/t muscskel malig,08,Diseases and Disorders of the Musculoskeletal System and Conn Tissue,4,Extreme,Extreme,Medical,Medicare,Medicare,,,N,Y,305859.83,61249.73
Long Island,Nassau,2908000,000511,NYU Winthrop Hospital,70 or Older,115,F,White,Not Span/Hispanic,16,Emergency,Home w/ Home Health Services,2017,042,Secondary malignancies,211,THERAPEUTIC RADIOLOGY,343,Musculoskeletal malignancy & pathol fracture d/t muscskel malig,08,Diseases and Disorders of the Musculoskeletal System and Conn Tissue,3,Major,Major,Medical,Medicare,Medicare,Private Health Insurance,,N,Y,127943.70,24382.13
Long Island,Nassau,2908000,000511,NYU Winthrop Hospital,50 to 69,115,M,White,Not Span/Hispanic,6,Emergency,Home or Self Care,2017,042,Secondary malignancies,211,THERAPEUTIC RADIOLOGY,343,Musculoskeletal malignancy & pathol fracture d/t muscskel malig,08,Diseases and Disorders of the Musculoskeletal System and Conn Tissue,3,Major,Moderate,Medical,Private Health Insurance,Medicare,Medicare,,N,Y,54041.72,10386.24
Long Island,Nassau,2908000,000511,NYU Winthrop Hospital,30 to 49,110,F,White,Not Span/Hispanic,34,Emergency,Home or Self Care,2017,042,Secondary malignancies,198,MAG RESONANCE IMAGING,343,Musculoskeletal malignancy & pathol fracture d/t muscskel malig,08,Diseases and Disorders of the Musculoskeletal System and Conn Tissue,3,Major,Major,Medical,Federal/State/Local/VA,,,,N,Y,328949.54,57247.22
Long Island,Nassau,2908000,000511,NYU Winthrop Hospital,50 to 69,115,F,White,Not Span/Hispanic,6,Emergency,Home or Self Care,2017,042,Secondary malignancies,159,OT DX PRCS ON MUSC/SKEL,343,Musculoskeletal malignancy & pathol fracture d/t muscskel malig,08,Diseases and Disorders of the Musculoskeletal System and Conn Tissue,2,Moderate,Major,Medical,Blue Cross/Blue Shield,,,,N,Y,105047.48,15398.89
Long Island,Nassau,2908000,000511,NYU Winthrop Hospital,70 or Older,115,M,White,Not Span/Hispanic,21,Emergency,Skilled Nursing Home,2017,042,Secondary malignancies,083,BIOPSY OF LIVER,343,Musculoskeletal malignancy & pathol fracture d/t muscskel malig,08,Diseases and Disorders of the Musculoskeletal System and Conn Tissue,4,Extreme,Extreme,Medical,Medicare,Medicare,Private Health Insurance,,N,Y,219004.99,38113.71
Long Island,Nassau,2908000,000511,NYU Winthrop Hospital,70 or Older,115,F,Black/African American,Not Span/Hispanic,7,Emergency,Home or Self Care,2017,207,Pathological fracture,211,THERAPEUTIC RADIOLOGY,343,Musculoskeletal malignancy & pathol fracture d/t muscskel malig,08,Diseases and Disorders of the Musculoskeletal System and Conn Tissue,3,Major,Major,Medical,Private Health Insurance,Medicare,Medicare,,N,Y,97098.43,12957.45
Long Island,Nassau,2908000,000511,NYU Winthrop Hospital,70 or Older,115,F,Black/African American,Not Span/Hispanic,20,Emergency,Home w/ Home Health Services,2017,013,Cancer of stomach,092,OTHER BOWEL DX PRCS,343,Musculoskeletal malignancy & pathol fracture d/t muscskel malig,08,Diseases and Disorders of the Musculoskeletal System and Conn Tissue,2,Moderate,Moderate,Medical,Medicare,Medicare,,,N,Y,278523.78,71411.43
Long Island,Nassau,2908000,000511,NYU Winthrop Hospital,70 or Older,117,M,Black/African American,Not Span/Hispanic,15,Emergency,Skilled Nursing Home,2017,042,Secondary malignancies,231,OTHER THERAPEUTIC PRCS,343,Musculoskeletal malignancy & pathol fracture d/t muscskel malig,08,Diseases and Disorders of the Musculoskeletal System and Conn Tissue,3,Major,Major,Medical,Blue Cross/Blue Shield,Medicare,Medicare,,N,Y,282924.91,54477.77
Long Island,Nassau,2908000,000511,NYU Winthrop Hospital,70 or Older,112,M,White,Not Span/Hispanic,11,Emergency,Skilled Nursing Home,2017,231,Other fractures,000,NO PROC,343,Musculoskeletal malignancy & pathol fracture d/t muscskel malig,08,Diseases and Disorders of the Musculoskeletal System and Conn Tissue,2,Moderate,Moderate,Medical,Medicare,Medicare,Private Health Insurance,,N,Y,107577.41,20684.13
Long Island,Nassau,2908000,000511,NYU Winthrop Hospital,70 or Older,117,F,White,Not Span/Hispanic,11,Emergency,Hospice - Medical Facility,2017,042,Secondary malignancies,211,THERAPEUTIC RADIOLOGY,343,Musculoskeletal malignancy & pathol fracture d/t muscskel malig,08,Diseases and Disorders of the Musculoskeletal System and Conn Tissue,3,Major,Major,Medical,Medicare,Medicare,Private Health Insurance,,N,Y,109724.99,18247.44
Long Island,Nassau,2908000,000511,NYU Winthrop Hospital,70 or Older,118,F,White,Not Span/Hispanic,7,Emergency,Home w/ Home Health Services,2017,042,Secondary malignancies,211,THERAPEUTIC RADIOLOGY,343,Musculoskeletal malignancy & pathol fracture d/t muscskel malig,08,Diseases and Disorders of the Musculoskeletal System and Conn Tissue,3,Major,Major,Medical,Medicare,Medicare,Private Health Insurance,,N,Y,69573.02,13020.85
Long Island,Nassau,2908000,000511,NYU Winthrop Hospital,70 or Older,114,M,Black/African American,Not Span/Hispanic,6,Emergency,Home w/ Home Health Services,2017,042,Secondary malignancies,211,THERAPEUTIC RADIOLOGY,343,Musculoskeletal malignancy & pathol fracture d/t muscskel malig,08,Diseases and Disorders of the Musculoskeletal System and Conn Tissue,3,Major,Major,Medical,Medicare,Medicare,Private Health Insurance,,N,Y,104923.45,14680.40
Long Island,Nassau,2908000,000511,NYU Winthrop Hospital,70 or Older,117,M,White,Not Span/Hispanic,9,Emergency,Home w/ Home Health Services,2017,042,Secondary malignancies,083,BIOPSY OF LIVER,343,Musculoskeletal malignancy & pathol fracture d/t muscskel malig,08,Diseases and Disorders of the Musculoskeletal System and Conn Tissue,3,Major,Moderate,Medical,Medicare,Medicare,Blue Cross/Blue Shield,,N,Y,151814.79,23183.11
Long Island,Nassau,2908000,000511,NYU Winthrop Hospital,70 or Older,117,F,White,Not Span/Hispanic,3,Emergency,Home w/ Home Health Services,2017,042,Secondary malignancies,000,NO PROC,343,Musculoskeletal malignancy & pathol fracture d/t muscskel malig,08,Diseases and Disorders of the Musculoskeletal System and Conn Tissue,2,Moderate,Major,Medical,Medicare,Medicare,Medicaid,,N,Y,63073.57,7855.49
Long Island,Nassau,2908000,000511,NYU Winthrop Hospital,70 or Older,115,M,White,Not Span/Hispanic,23,Emergency,Home w/ Home Health Services,2017,042,Secondary malignancies,037,DX BRONCHOSCOPY & BIOPS,343,Musculoskeletal malignancy & pathol fracture d/t muscskel malig,08,Diseases and Disorders of the Musculoskeletal System and Conn Tissue,3,Major,Major,Medical,Medicare,Medicare,Blue Cross/Blue Shield,,N,Y,258079.30,49201.16
Long Island,Nassau,2908000,000511,NYU Winthrop Hospital,70 or Older,115,F,Black/African American,Not Span/Hispanic,7,Emergency,Expired,2017,042,Secondary malignancies,070,UP GASTRO ENDOSC/BIOPSY,343,Musculoskeletal malignancy & pathol fracture d/t muscskel malig,08,Diseases and Disorders of the Musculoskeletal System and Conn Tissue,4,Extreme,Extreme,Medical,Medicare,Medicare,,,N,Y,150764.70,30677.37
Long Island,Nassau,2908000,000511,NYU Winthrop Hospital,70 or Older,117,F,Other Race,Spanish/Hispanic,6,Emergency,Home w/ Home Health Services,2017,042,Secondary malignancies,159,OT DX PRCS ON MUSC/SKEL,343,Musculoskeletal malignancy & pathol fracture d/t muscskel malig,08,Diseases and Disorders of the Musculoskeletal System and Conn Tissue,2,Moderate,Moderate,Medical,Medicare,Medicare,Private Health Insurance,,N,Y,103783.94,17343.21
Long Island,Nassau,2908000,000511,NYU Winthrop Hospital,70 or Older,114,F,Black/African American,Not Span/Hispanic,17,Emergency,Home w/ Home Health Services,2017,042,Secondary malignancies,029,ORAL AND DENTAL SVCS,343,Musculoskeletal malignancy & pathol fracture d/t muscskel malig,08,Diseases and Disorders of the Musculoskeletal System and Conn Tissue,3,Major,Major,Medical,Medicare,Medicare,Blue Cross/Blue Shield,,N,Y,153989.65,33185.38
Long Island,Nassau,2908000,000511,NYU Winthrop Hospital,70 or Older,115,F,White,Not Span/Hispanic,4,Emergency,Home w/ Home Health Services,2017,042,Secondary malignancies,168,"INCIS/DRAIN, SKIN/SUBCU",343,Musculoskeletal malignancy & pathol fracture d/t muscskel malig,08,Diseases and Disorders of the Musculoskeletal System and Conn Tissue,2,Moderate,Moderate,Medical,Medicare,Medicare,Private Health Insurance,,N,Y,79093.92,15819.30
Long Island,Nassau,2908000,000511,NYU Winthrop Hospital,0 to 17,117,M,White,Not Span/Hispanic,10,Emergency,Home w/ Home Health Services,2017,021,Cancer of bone and connective tissue,224,CANCER CHEMOTHERAPY,343,Musculoskeletal malignancy & pathol fracture d/t muscskel malig,08,Diseases and Disorders of the Musculoskeletal System and Conn Tissue,3,Major,Minor,Medical,Blue Cross/Blue Shield,,,,N,Y,226075.09,37536.09
Long Island,Nassau,2908000,000511,NYU Winthrop Hospital,70 or Older,115,M,Black/African American,Not Span/Hispanic,7,Emergency,Home w/ Home Health Services,2017,042,Secondary malignancies,000,NO PROC,343,Musculoskeletal malignancy & pathol fracture d/t muscskel malig,08,Diseases and Disorders of the Musculoskeletal System and Conn Tissue,4,Extreme,Major,Medical,Medicaid,,,,N,Y,195807.09,36002.72
Long Island,Nassau,2908000,000511,NYU Winthrop Hospital,50 to 69,115,M,White,Not Span/Hispanic,10,Emergency,Skilled Nursing Home,2017,042,Secondary malignancies,000,NO PROC,343,Musculoskeletal malignancy & pathol fracture d/t muscskel malig,08,Diseases and Disorders of the Musculoskeletal System and Conn Tissue,3,Major,Moderate,Medical,Private Health Insurance,,,,N,Y,85356.61,17844.77
Long Island,Nassau,2908000,000511,NYU Winthrop Hospital,50 to 69,113,F,Other Race,Not Span/Hispanic,2,Elective,Home or Self Care,2017,013,Cancer of stomach,070,UP GASTRO ENDOSC/BIOPSY,343,Musculoskeletal malignancy & pathol fracture d/t muscskel malig,08,Diseases and Disorders of the Musculoskeletal System and Conn Tissue,2,Moderate,Minor,Medical,Medicaid,Medicaid,,,N,N,75769.28,16536.62
Long Island,Nassau,2908000,000511,NYU Winthrop Hospital,70 or Older,117,M,White,Not Span/Hispanic,6,Emergency,Home w/ Home Health Services,2017,042,Secondary malignancies,159,OT DX PRCS ON MUSC/SKEL,343,Musculoskeletal malignancy & pathol fracture d/t muscskel malig,08,Diseases and Disorders of the Musculoskeletal System and Conn Tissue,3,Major,Major,Medical,Medicare,Medicare,,,N,Y,95054.51,15585.37
Long Island,Nassau,2908000,000511,NYU Winthrop Hospital,70 or Older,117,F,White,Not Span/Hispanic,8,Emergency,Skilled Nursing Home,2017,042,Secondary malignancies,000,NO PROC,343,Musculoskeletal malignancy & pathol fracture d/t muscskel malig,08,Diseases and Disorders of the Musculoskeletal System and Conn Tissue,3,Major,Major,Medical,Medicare,Medicare,Medicaid,,N,Y,58177.79,12489.41
Long Island,Nassau,2908000,000511,NYU Winthrop Hospital,50 to 69,115,M,Black/African American,Not Span/Hispanic,4,Emergency,Home or Self Care,2017,207,Pathological fracture,159,OT DX PRCS ON MUSC/SKEL,343,Musculoskeletal malignancy & pathol fracture d/t muscskel malig,08,Diseases and Disorders of the Musculoskeletal System and Conn Tissue,3,Major,Major,Medical,Self-Pay,,,,N,Y,117967.02,14016.00
Long Island,Nassau,2908000,000511,NYU Winthrop Hospital,50 to 69,,M,Other Race,Unknown,3,Elective,Home or Self Care,2017,013,Cancer of stomach,074,GASTRECTOMY; PART/TOTAL,343,Musculoskeletal malignancy & pathol fracture d/t muscskel malig,08,Diseases and Disorders of the Musculoskeletal System and Conn Tissue,1,Minor,Minor,Medical,Federal/State/Local/VA,,,,N,N,127455.02,29646.45
Long Island,Nassau,2908000,000511,NYU Winthrop Hospital,50 to 69,115,F,White,Not Span/Hispanic,1,Emergency,Home or Self Care,2017,207,Pathological fracture,198,MAG RESONANCE IMAGING,343,Musculoskeletal malignancy & pathol fracture d/t muscskel malig,08,Diseases and Disorders of the Musculoskeletal System and Conn Tissue,3,Major,Moderate,Medical,Medicare,Medicare,Medicaid,,N,Y,35116.08,4182.61
Long Island,Nassau,2908000,000511,NYU Winthrop Hospital,70 or Older,117,M,White,Not Span/Hispanic,3,Elective,Home or Self Care,2017,013,Cancer of stomach,070,UP GASTRO ENDOSC/BIOPSY,343,Musculoskeletal malignancy & pathol fracture d/t muscskel malig,08,Diseases and Disorders of the Musculoskeletal System and Conn Tissue,1,Minor,Minor,Medical,Medicare,Medicare,Private Health Insurance,,N,N,183185.21,56499.80
Long Island,Nassau,2908000,000511,NYU Winthrop Hospital,70 or Older,117,F,White,Not Span/Hispanic,4,Emergency,Skilled Nursing Home,2017,207,Pathological fracture,000,NO PROC,343,Musculoskeletal malignancy & pathol fracture d/t muscskel malig,08,Diseases and Disorders of the Musculoskeletal System and Conn Tissue,2,Moderate,Moderate,Medical,Medicare,Medicare,Private Health Insurance,,N,Y,38203.65,7968.99
Long Island,Nassau,2908000,000511,NYU Winthrop Hospital,50 to 69,115,F,White,Not Span/Hispanic,2,Elective,Home w/ Home Health Services,2017,021,Cancer of bone and connective tissue,175,OT OR THER PRC SKN/BRST,343,Musculoskeletal malignancy & pathol fracture d/t muscskel malig,08,Diseases and Disorders of the Musculoskeletal System and Conn Tissue,1,Minor,Minor,Medical,Private Health Insurance,,,,N,N,77183.08,24937.49
Long Island,Nassau,2908000,000511,NYU Winthrop Hospital,50 to 69,117,F,Other Race,Not Span/Hispanic,7,Urgent,Home w/ Home Health Services,2017,042,Secondary malignancies,000,NO PROC,343,Musculoskeletal malignancy & pathol fracture d/t muscskel malig,08,Diseases and Disorders of the Musculoskeletal System and Conn Tissue,2,Moderate,Moderate,Medical,Private Health Insurance,,,,N,N,85241.47,12706.72
Long Island,Nassau,2908000,000511,NYU Winthrop Hospital,70 or Older,115,M,Black/African American,Not Span/Hispanic,6,Emergency,Federal Health Care Facility,2017,042,Secondary malignancies,000,NO PROC,343,Musculoskeletal malignancy & pathol fracture d/t muscskel malig,08,Diseases and Disorders of the Musculoskeletal System and Conn Tissue,3,Major,Major,Medical,Medicare,Medicare,,,N,Y,135759.23,21193.96
Long Island,Nassau,2908000,000511,NYU Winthrop Hospital,70 or Older,114,M,White,Spanish/Hispanic,5,Emergency,Home w/ Home Health Services,2017,042,Secondary malignancies,211,THERAPEUTIC RADIOLOGY,343,Musculoskeletal malignancy & pathol fracture d/t muscskel malig,08,Diseases and Disorders of the Musculoskeletal System and Conn Tissue,3,Major,Major,Medical,Medicare,Medicare,Self-Pay,,N,Y,75023.18,10225.39
Long Island,Nassau,2908000,000511,NYU Winthrop Hospital,50 to 69,115,M,White,Spanish/Hispanic,4,Emergency,Home or Self Care,2017,042,Secondary malignancies,000,NO PROC,343,Musculoskeletal malignancy & pathol fracture d/t muscskel malig,08,Diseases and Disorders of the Musculoskeletal System and Conn Tissue,2,Moderate,Moderate,Medical,Medicare,Medicare,,,N,Y,54368.72,7686.25
Long Island,Nassau,2908000,000511,NYU Winthrop Hospital,70 or Older,117,F,White,Not Span/Hispanic,4,Emergency,Skilled Nursing Home,2017,207,Pathological fracture,000,NO PROC,343,Musculoskeletal malignancy & pathol fracture d/t muscskel malig,08,Diseases and Disorders of the Musculoskeletal System and Conn Tissue,3,Major,Major,Medical,Medicare,Medicare,Medicaid,,N,Y,49884.26,7937.59
Long Island,Nassau,2908000,000511,NYU Winthrop Hospital,70 or Older,115,M,White,Not Span/Hispanic,3,Emergency,Home or Self Care,2017,042,Secondary malignancies,159,OT DX PRCS ON MUSC/SKEL,343,Musculoskeletal malignancy & pathol fracture d/t muscskel malig,08,Diseases and Disorders of the Musculoskeletal System and Conn Tissue,2,Moderate,Moderate,Medical,Medicare,Medicare,,,N,Y,71192.15,15733.16
Long Island,Nassau,2908000,000511,NYU Winthrop Hospital,50 to 69,115,M,Black/African American,Not Span/Hispanic,28,Emergency,Skilled Nursing Home,2017,042,Secondary malignancies,039,INCISION OF PLEURA,343,Musculoskeletal malignancy & pathol fracture d/t muscskel malig,08,Diseases and Disorders of the Musculoskeletal System and Conn Tissue,4,Extreme,Major,Medical,Medicaid,Medicaid,,,N,Y,575841.16,123726.35
Long Island,Nassau,2908000,000511,NYU Winthrop Hospital,50 to 69,115,F,White,Not Span/Hispanic,6,Emergency,Home w/ Home Health Services,2017,207,Pathological fracture,000,NO PROC,343,Musculoskeletal malignancy & pathol fracture d/t muscskel malig,08,Diseases and Disorders of the Musculoskeletal System and Conn Tissue,3,Major,Moderate,Medical,Private Health Insurance,,,,N,Y,76375.89,12982.58
Long Island,Nassau,2908000,000511,NYU Winthrop Hospital,50 to 69,114,F,Black/African American,Not Span/Hispanic,2,Emergency,Home or Self Care,2017,042,Secondary malignancies,211,THERAPEUTIC RADIOLOGY,343,Musculoskeletal malignancy & pathol fracture d/t muscskel malig,08,Diseases and Disorders of the Musculoskeletal System and Conn Tissue,3,Major,Moderate,Medical,Private Health Insurance,,,,N,Y,123950.14,14856.32
