Hospital Service Area,Hospital County,Operating Certificate Number,Permanent Facility Id,Facility Name,Age Group,Zip Code - 3 digits,Gender,Race,Ethnicity,Length of Stay,Type of Admission,Patient Disposition,Discharge Year,CCS Diagnosis Code,CCS Diagnosis Description,CCS Procedure Code,CCS Procedure Description,APR DRG Code,APR DRG Description,APR MDC Code,APR MDC Description,APR Severity of Illness Code,APR Severity of Illness Description,APR Risk of Mortality,APR Medical Surgical Description,Payment Typology 1,Payment Typology 2,Payment Typology 3,Birth Weight,Abortion Edit Indicator,Emergency Department Indicator,Total Charges,Total Costs
New York City,Manhattan,7002053,001463,NYU Langone Hospitals,70 or Older,112,M,Other Race,Not Span/Hispanic,6,Emergency,Home w/ Home Health Services,2020,NEO070,SECONDARY MALIGNANCIES,,,343,MUSCULOSKELETAL MALIGNANCY & PATHOL FRACTURE D/T MUSCSKEL MALIG,08,DISEASES AND DISORDERS OF THE MUSCULOSKELETAL SYSTEM AND CONNECTIVE TISSUE,3,Major,Moderate,Medical,Medicare,Medicaid,,,,Y,64713.6,21026.02
New York City,Manhattan,7002053,001463,NYU Langone Hospitals,50 to 69,105,F,Other Race,Not Span/Hispanic,14,Emergency,Home or Self Care,2020,NEO070,SECONDARY MALIGNANCIES,MST002,BONE AND JOINT BIOPSY,343,MUSCULOSKELETAL MALIGNANCY & PATHOL FRACTURE D/T MUSCSKEL MALIG,08,DISEASES AND DISORDERS OF THE MUSCULOSKELETAL SYSTEM AND CONNECTIVE TISSUE,3,Major,Moderate,Medical,Blue Cross/Blue Shield,,,,,Y,229823.26,66642.04
New York City,Manhattan,7002053,001463,NYU Langone Hospitals,30 to 49,104,F,Other Race,Spanish/Hispanic,1,Emergency,Home w/ Home Health Services,2020,NEO070,SECONDARY MALIGNANCIES,,,343,MUSCULOSKELETAL MALIGNANCY & PATHOL FRACTURE D/T MUSCSKEL MALIG,08,DISEASES AND DISORDERS OF THE MUSCULOSKELETAL SYSTEM AND CONNECTIVE TISSUE,2,Moderate,Moderate,Medical,Medicare,Medicaid,,,,Y,57907.26,13459.3
New York City,Manhattan,7002053,001463,NYU Langone Hospitals,70 or Older,100,F,Other Race,Not Span/Hispanic,18,Emergency,Skilled Nursing Home,2020,NEO070,SECONDARY MALIGNANCIES,,,343,MUSCULOSKELETAL MALIGNANCY & PATHOL FRACTURE D/T MUSCSKEL MALIG,08,DISEASES AND DISORDERS OF THE MUSCULOSKELETAL SYSTEM AND CONNECTIVE TISSUE,3,Major,Major,Medical,Medicare,Medicaid,,,,Y,190693.88,60550.92
New York City,Manhattan,7002053,001463,NYU Langone Hospitals,70 or Older,100,F,White,Not Span/Hispanic,23,Emergency,Skilled Nursing Home,2020,MUS014,"PATHOLOGICAL FRACTURE, INITIAL ENCOUNTER",,,343,MUSCULOSKELETAL MALIGNANCY & PATHOL FRACTURE D/T MUSCSKEL MALIG,08,DISEASES AND DISORDERS OF THE MUSCULOSKELETAL SYSTEM AND CONNECTIVE TISSUE,3,Major,Major,Medical,Medicare,Blue Cross/Blue Shield,,,,Y,337336.98,113902.77
New York City,Manhattan,7002053,001463,NYU Langone Hospitals,30 to 49,112,M,Black/African American,Not Span/Hispanic,5,Emergency,Home or Self Care,2020,NEO070,SECONDARY MALIGNANCIES,IMG008,ULTRASONOGRAPHY,343,MUSCULOSKELETAL MALIGNANCY & PATHOL FRACTURE D/T MUSCSKEL MALIG,08,DISEASES AND DISORDERS OF THE MUSCULOSKELETAL SYSTEM AND CONNECTIVE TISSUE,3,Major,Major,Medical,Private Health Insurance,,,,,Y,112477.7,23398.49
New York City,Manhattan,7002053,001463,NYU Langone Hospitals,30 to 49,100,M,White,Not Span/Hispanic,3,Emergency,Home or Self Care,2020,NEO070,SECONDARY MALIGNANCIES,,,343,MUSCULOSKELETAL MALIGNANCY & PATHOL FRACTURE D/T MUSCSKEL MALIG,08,DISEASES AND DISORDERS OF THE MUSCULOSKELETAL SYSTEM AND CONNECTIVE TISSUE,2,Moderate,Moderate,Medical,Private Health Insurance,,,,,Y,77588.53,15182.87
New York City,Manhattan,7002053,001463,NYU Langone Hospitals,70 or Older,100,F,Black/African American,Not Span/Hispanic,15,Emergency,Skilled Nursing Home,2020,NEO070,SECONDARY MALIGNANCIES,CNS001,MINIMALLY INVASIVE CNS BIOPSY,343,MUSCULOSKELETAL MALIGNANCY & PATHOL FRACTURE D/T MUSCSKEL MALIG,08,DISEASES AND DISORDERS OF THE MUSCULOSKELETAL SYSTEM AND CONNECTIVE TISSUE,3,Major,Major,Medical,Medicare,Medicare,,,,N,153325.84,52607.32
New York City,Manhattan,7002053,001463,NYU Langone Hospitals,70 or Older,113,M,White,Not Span/Hispanic,2,Emergency,Home w/ Home Health Services,2020,NEO070,SECONDARY MALIGNANCIES,,,343,MUSCULOSKELETAL MALIGNANCY & PATHOL FRACTURE D/T MUSCSKEL MALIG,08,DISEASES AND DISORDERS OF THE MUSCULOSKELETAL SYSTEM AND CONNECTIVE TISSUE,3,Major,Moderate,Medical,Medicare,Blue Cross/Blue Shield,,,,Y,47678.89,16736.07
New York City,Manhattan,7002053,001463,NYU Langone Hospitals,0 to 17,100,F,Black/African American,Spanish/Hispanic,2,Elective,Home or Self Care,2020,NEO024,SARCOMA,CAR024,VENOUS AND ARTERIAL CATHETER PLACEMENT,343,MUSCULOSKELETAL MALIGNANCY & PATHOL FRACTURE D/T MUSCSKEL MALIG,08,DISEASES AND DISORDERS OF THE MUSCULOSKELETAL SYSTEM AND CONNECTIVE TISSUE,2,Moderate,Moderate,Medical,Medicaid,,,,,N,194104.73,18333.09
New York City,Manhattan,7002053,001463,NYU Langone Hospitals,50 to 69,100,M,White,Not Span/Hispanic,7,Elective,Home or Self Care,2020,NEO070,SECONDARY MALIGNANCIES,CNS013,SPINAL EPIDURAL CATHETER PLACEMENT,343,MUSCULOSKELETAL MALIGNANCY & PATHOL FRACTURE D/T MUSCSKEL MALIG,08,DISEASES AND DISORDERS OF THE MUSCULOSKELETAL SYSTEM AND CONNECTIVE TISSUE,2,Moderate,Major,Medical,Private Health Insurance,,,,,N,243171.43,47853.31
New York City,Manhattan,7002053,001463,NYU Langone Hospitals,50 to 69,104,M,Other Race,Spanish/Hispanic,6,Emergency,Home w/ Home Health Services,2020,NEO070,SECONDARY MALIGNANCIES,,,343,MUSCULOSKELETAL MALIGNANCY & PATHOL FRACTURE D/T MUSCSKEL MALIG,08,DISEASES AND DISORDERS OF THE MUSCULOSKELETAL SYSTEM AND CONNECTIVE TISSUE,3,Major,Major,Medical,Medicaid,,,,,Y,177744.91,35878.93
New York City,Manhattan,7002053,001463,NYU Langone Hospitals,70 or Older,100,M,White,Not Span/Hispanic,3,Emergency,Home w/ Home Health Services,2020,NEO024,SARCOMA,ADM001,TRANSFUSION OF BLOOD AND BLOOD PRODUCTS,343,MUSCULOSKELETAL MALIGNANCY & PATHOL FRACTURE D/T MUSCSKEL MALIG,08,DISEASES AND DISORDERS OF THE MUSCULOSKELETAL SYSTEM AND CONNECTIVE TISSUE,2,Moderate,Moderate,Medical,Medicare,Medicare,,,,Y,48285.56,11855.06
New York City,Manhattan,7002053,001463,NYU Langone Hospitals,50 to 69,100,M,White,Not Span/Hispanic,4,Emergency,Skilled Nursing Home,2020,NEO070,SECONDARY MALIGNANCIES,,,343,MUSCULOSKELETAL MALIGNANCY & PATHOL FRACTURE D/T MUSCSKEL MALIG,08,DISEASES AND DISORDERS OF THE MUSCULOSKELETAL SYSTEM AND CONNECTIVE TISSUE,2,Moderate,Moderate,Medical,Medicaid,,,,,Y,68724.21,20167.23
New York City,Manhattan,7002053,001463,NYU Langone Hospitals,70 or Older,112,M,Other Race,Not Span/Hispanic,25,Emergency,Hospice - Medical Facility,2020,MUS014,"PATHOLOGICAL FRACTURE, INITIAL ENCOUNTER",RES007,AIRWAY INTUBATION,343,MUSCULOSKELETAL MALIGNANCY & PATHOL FRACTURE D/T MUSCSKEL MALIG,08,DISEASES AND DISORDERS OF THE MUSCULOSKELETAL SYSTEM AND CONNECTIVE TISSUE,4,Extreme,Extreme,Medical,Medicare,Medicaid,,,,Y,669468.05,126010.43
New York City,Manhattan,7002053,001463,NYU Langone Hospitals,70 or Older,112,M,Black/African American,Not Span/Hispanic,1,Emergency,Home or Self Care,2020,NEO070,SECONDARY MALIGNANCIES,ADM001,TRANSFUSION OF BLOOD AND BLOOD PRODUCTS,343,MUSCULOSKELETAL MALIGNANCY & PATHOL FRACTURE D/T MUSCSKEL MALIG,08,DISEASES AND DISORDERS OF THE MUSCULOSKELETAL SYSTEM AND CONNECTIVE TISSUE,2,Moderate,Moderate,Medical,Medicare,Private Health Insurance,,,,Y,30280.47,7074.57
New York City,Manhattan,7002053,001463,NYU Langone Hospitals,70 or Older,100,M,White,Unknown,3,Emergency,Home w/ Home Health Services,2020,NEO070,SECONDARY MALIGNANCIES,,,343,MUSCULOSKELETAL MALIGNANCY & PATHOL FRACTURE D/T MUSCSKEL MALIG,08,DISEASES AND DISORDERS OF THE MUSCULOSKELETAL SYSTEM AND CONNECTIVE TISSUE,2,Moderate,Moderate,Medical,Medicare,,,,,Y,93563.47,19226.44
New York City,Manhattan,7002053,001463,NYU Langone Hospitals,50 to 69,104,M,Other Race,Spanish/Hispanic,4,Emergency,Home or Self Care,2020,NEO070,SECONDARY MALIGNANCIES,,,343,MUSCULOSKELETAL MALIGNANCY & PATHOL FRACTURE D/T MUSCSKEL MALIG,08,DISEASES AND DISORDERS OF THE MUSCULOSKELETAL SYSTEM AND CONNECTIVE TISSUE,2,Moderate,Moderate,Medical,Medicaid,,,,,Y,122697.85,32821.16
New York City,Manhattan,7002053,001463,NYU Langone Hospitals,70 or Older,100,M,White,Not Span/Hispanic,18,Emergency,Skilled Nursing Home,2020,NEO070,SECONDARY MALIGNANCIES,ADM001,TRANSFUSION OF BLOOD AND BLOOD PRODUCTS,343,MUSCULOSKELETAL MALIGNANCY & PATHOL FRACTURE D/T MUSCSKEL MALIG,08,DISEASES AND DISORDERS OF THE MUSCULOSKELETAL SYSTEM AND CONNECTIVE TISSUE,4,Extreme,Extreme,Medical,Medicare,,,,,Y,300120.49,90856.54
New York City,Manhattan,7002053,001463,NYU Langone Hospitals,50 to 69,113,M,Other Race,Spanish/Hispanic,8,Emergency,Skilled Nursing Home,2020,MUS014,"PATHOLOGICAL FRACTURE, INITIAL ENCOUNTER",,,343,MUSCULOSKELETAL MALIGNANCY & PATHOL FRACTURE D/T MUSCSKEL MALIG,08,DISEASES AND DISORDERS OF THE MUSCULOSKELETAL SYSTEM AND CONNECTIVE TISSUE,3,Major,Moderate,Medical,Medicare,Medicaid,,,,Y,130603.79,55523.28
New York City,Manhattan,7002053,001463,NYU Langone Hospitals,70 or Older,119,M,White,Not Span/Hispanic,11,Emergency,Hospice - Medical Facility,2020,NEO070,SECONDARY MALIGNANCIES,ADM021,"ADMINISTRATION OF THERAPEUTIC SUBSTANCES, NEC",343,MUSCULOSKELETAL MALIGNANCY & PATHOL FRACTURE D/T MUSCSKEL MALIG,08,DISEASES AND DISORDERS OF THE MUSCULOSKELETAL SYSTEM AND CONNECTIVE TISSUE,4,Extreme,Extreme,Medical,Medicare,Medicaid,,,,Y,219981.97,63382.72
New York City,Manhattan,7002053,001463,NYU Langone Hospitals,70 or Older,112,M,White,Not Span/Hispanic,2,Emergency,Home w/ Home Health Services,2020,NEO070,SECONDARY MALIGNANCIES,URN006,BLADDER CATHETERIZATION AND DRAINAGE,343,MUSCULOSKELETAL MALIGNANCY & PATHOL FRACTURE D/T MUSCSKEL MALIG,08,DISEASES AND DISORDERS OF THE MUSCULOSKELETAL SYSTEM AND CONNECTIVE TISSUE,2,Moderate,Moderate,Medical,Medicare,,,,,Y,65499.35,15640.57
New York City,Manhattan,7002053,001463,NYU Langone Hospitals,50 to 69,104,M,White,Not Span/Hispanic,7,Emergency,Home or Self Care,2020,NEO070,SECONDARY MALIGNANCIES,,,343,MUSCULOSKELETAL MALIGNANCY & PATHOL FRACTURE D/T MUSCSKEL MALIG,08,DISEASES AND DISORDERS OF THE MUSCULOSKELETAL SYSTEM AND CONNECTIVE TISSUE,3,Major,Major,Medical,Blue Cross/Blue Shield,,,,,Y,121259.05,36525.54
New York City,Manhattan,7002053,001463,NYU Langone Hospitals,70 or Older,100,M,Other Race,Not Span/Hispanic,7,Emergency,Home w/ Home Health Services,2020,NEO070,SECONDARY MALIGNANCIES,OTR004,ISOLATION PROCEDURES,343,MUSCULOSKELETAL MALIGNANCY & PATHOL FRACTURE D/T MUSCSKEL MALIG,08,DISEASES AND DISORDERS OF THE MUSCULOSKELETAL SYSTEM AND CONNECTIVE TISSUE,3,Major,Major,Medical,Medicare,Medicaid,,,,Y,109959.94,35947.99
New York City,Manhattan,7002053,001463,NYU Langone Hospitals,70 or Older,116,M,White,Not Span/Hispanic,3,Emergency,Home or Self Care,2020,NEO070,SECONDARY MALIGNANCIES,MST002,BONE AND JOINT BIOPSY,343,MUSCULOSKELETAL MALIGNANCY & PATHOL FRACTURE D/T MUSCSKEL MALIG,08,DISEASES AND DISORDERS OF THE MUSCULOSKELETAL SYSTEM AND CONNECTIVE TISSUE,2,Moderate,Moderate,Medical,Medicare,,,,,Y,78000.12,19065.27
New York City,Manhattan,7002053,001463,NYU Langone Hospitals,70 or Older,115,F,White,Not Span/Hispanic,4,Emergency,Home w/ Home Health Services,2020,NEO024,SARCOMA,MST003,"SUBCUTANEOUS TISSUE, FASCIA, AND MUSCLE BIOPSY",343,MUSCULOSKELETAL MALIGNANCY & PATHOL FRACTURE D/T MUSCSKEL MALIG,08,DISEASES AND DISORDERS OF THE MUSCULOSKELETAL SYSTEM AND CONNECTIVE TISSUE,3,Major,Major,Medical,Blue Cross/Blue Shield,Medicare,,,,Y,102062.39,24787.52
New York City,Manhattan,7002053,001463,NYU Langone Hospitals,70 or Older,113,M,White,Not Span/Hispanic,2,Emergency,Home w/ Home Health Services,2020,NEO070,SECONDARY MALIGNANCIES,,,343,MUSCULOSKELETAL MALIGNANCY & PATHOL FRACTURE D/T MUSCSKEL MALIG,08,DISEASES AND DISORDERS OF THE MUSCULOSKELETAL SYSTEM AND CONNECTIVE TISSUE,2,Moderate,Major,Medical,Medicare,Private Health Insurance,,,,Y,38016.41,13924.92
New York City,Manhattan,7002053,001463,NYU Langone Hospitals,50 to 69,OOS,F,Other Race,Not Span/Hispanic,8,Emergency,Home w/ Home Health Services,2020,MUS014,"PATHOLOGICAL FRACTURE, INITIAL ENCOUNTER",MST002,BONE AND JOINT BIOPSY,343,MUSCULOSKELETAL MALIGNANCY & PATHOL FRACTURE D/T MUSCSKEL MALIG,08,DISEASES AND DISORDERS OF THE MUSCULOSKELETAL SYSTEM AND CONNECTIVE TISSUE,3,Major,Major,Medical,Medicare,,,,,Y,186343.02,51805.55
New York City,Manhattan,7002053,001463,NYU Langone Hospitals,30 to 49,112,F,Black/African American,Not Span/Hispanic,7,Emergency,Home w/ Home Health Services,2020,NEO070,SECONDARY MALIGNANCIES,ADM012,CHEMOTHERAPY,343,MUSCULOSKELETAL MALIGNANCY & PATHOL FRACTURE D/T MUSCSKEL MALIG,08,DISEASES AND DISORDERS OF THE MUSCULOSKELETAL SYSTEM AND CONNECTIVE TISSUE,3,Major,Moderate,Medical,Medicaid,,,,,Y,206089.33,71111.99
New York City,Manhattan,7002053,001463,NYU Langone Hospitals,50 to 69,112,F,White,Not Span/Hispanic,3,Emergency,Home or Self Care,2020,NEO070,SECONDARY MALIGNANCIES,,,343,MUSCULOSKELETAL MALIGNANCY & PATHOL FRACTURE D/T MUSCSKEL MALIG,08,DISEASES AND DISORDERS OF THE MUSCULOSKELETAL SYSTEM AND CONNECTIVE TISSUE,3,Major,Major,Medical,Medicare,Medicare,,,,Y,122523.4,33762.19
New York City,Manhattan,7002053,001463,NYU Langone Hospitals,30 to 49,109,F,White,Not Span/Hispanic,2,Emergency,Home or Self Care,2020,NEO070,SECONDARY MALIGNANCIES,,,343,MUSCULOSKELETAL MALIGNANCY & PATHOL FRACTURE D/T MUSCSKEL MALIG,08,DISEASES AND DISORDERS OF THE MUSCULOSKELETAL SYSTEM AND CONNECTIVE TISSUE,3,Major,Moderate,Medical,Blue Cross/Blue Shield,,,,,Y,91974.93,17442.89
New York City,Manhattan,7002053,001463,NYU Langone Hospitals,70 or Older,104,F,Black/African American,Not Span/Hispanic,23,Emergency,Hospice - Medical Facility,2020,NEO070,SECONDARY MALIGNANCIES,MST002,BONE AND JOINT BIOPSY,343,MUSCULOSKELETAL MALIGNANCY & PATHOL FRACTURE D/T MUSCSKEL MALIG,08,DISEASES AND DISORDERS OF THE MUSCULOSKELETAL SYSTEM AND CONNECTIVE TISSUE,4,Extreme,Extreme,Medical,Private Health Insurance,,,,,Y,441962.93,135373.87
New York City,Manhattan,7002053,001463,NYU Langone Hospitals,70 or Older,100,F,White,Spanish/Hispanic,2,Emergency,Skilled Nursing Home,2020,MUS014,"PATHOLOGICAL FRACTURE, INITIAL ENCOUNTER",URN006,BLADDER CATHETERIZATION AND DRAINAGE,343,MUSCULOSKELETAL MALIGNANCY & PATHOL FRACTURE D/T MUSCSKEL MALIG,08,DISEASES AND DISORDERS OF THE MUSCULOSKELETAL SYSTEM AND CONNECTIVE TISSUE,2,Moderate,Moderate,Medical,Medicare,,,,,Y,66696.66,16400.26
New York City,Manhattan,7002053,001463,NYU Langone Hospitals,18 to 29,,F,Black/African American,Unknown,1,Urgent,Home or Self Care,2020,NEO023,BONE CANCER,MST002,BONE AND JOINT BIOPSY,343,MUSCULOSKELETAL MALIGNANCY & PATHOL FRACTURE D/T MUSCSKEL MALIG,08,DISEASES AND DISORDERS OF THE MUSCULOSKELETAL SYSTEM AND CONNECTIVE TISSUE,2,Moderate,Minor,Medical,Medicaid,,,,,N,26636.21,5860.84
New York City,Manhattan,7002053,001463,NYU Langone Hospitals,70 or Older,113,M,White,Not Span/Hispanic,14,Emergency,Home w/ Home Health Services,2020,MUS014,"PATHOLOGICAL FRACTURE, INITIAL ENCOUNTER",,,343,MUSCULOSKELETAL MALIGNANCY & PATHOL FRACTURE D/T MUSCSKEL MALIG,08,DISEASES AND DISORDERS OF THE MUSCULOSKELETAL SYSTEM AND CONNECTIVE TISSUE,3,Major,Moderate,Medical,Medicare,,,,,Y,317080.34,119578.67
New York City,Manhattan,7002053,001463,NYU Langone Hospitals,70 or Older,112,M,Black/African American,Not Span/Hispanic,3,Emergency,Home w/ Home Health Services,2020,NEO070,SECONDARY MALIGNANCIES,,,343,MUSCULOSKELETAL MALIGNANCY & PATHOL FRACTURE D/T MUSCSKEL MALIG,08,DISEASES AND DISORDERS OF THE MUSCULOSKELETAL SYSTEM AND CONNECTIVE TISSUE,3,Major,Major,Medical,Medicare,,,,,Y,62327.84,18661.73
New York City,Manhattan,7002053,001463,NYU Langone Hospitals,30 to 49,112,M,Black/African American,Not Span/Hispanic,26,Emergency,Home w/ Home Health Services,2020,NEO024,SARCOMA,URN003,URETER AND OTHER URINARY TRACT DILATION,343,MUSCULOSKELETAL MALIGNANCY & PATHOL FRACTURE D/T MUSCSKEL MALIG,08,DISEASES AND DISORDERS OF THE MUSCULOSKELETAL SYSTEM AND CONNECTIVE TISSUE,4,Extreme,Extreme,Medical,Medicare,Blue Cross/Blue Shield,,,,Y,542326,162541.51
New York City,Manhattan,7002053,001463,NYU Langone Hospitals,70 or Older,100,M,White,Not Span/Hispanic,8,Emergency,Skilled Nursing Home,2020,MUS014,"PATHOLOGICAL FRACTURE, INITIAL ENCOUNTER",PLC001,IMMOBILIZATION BY SPLINT OR OTHER EXTERNAL DEVICE,343,MUSCULOSKELETAL MALIGNANCY & PATHOL FRACTURE D/T MUSCSKEL MALIG,08,DISEASES AND DISORDERS OF THE MUSCULOSKELETAL SYSTEM AND CONNECTIVE TISSUE,2,Moderate,Moderate,Medical,Medicare,,,,,Y,90726.78,38022.29
