Hospital Service Area,Hospital County,Operating Certificate Number,Permanent Facility Id,Facility Name,Age Group,Zip Code - 3 digits,Gender,Race,Ethnicity,Length of Stay,Type of Admission,Patient Disposition,Discharge Year,CCS Diagnosis Code,CCS Diagnosis Description,CCS Procedure Code,CCS Procedure Description,APR DRG Code,APR DRG Description,APR MDC Code,APR MDC Description,APR Severity of Illness Code,APR Severity of Illness Description,APR Risk of Mortality,APR Medical Surgical Description,Payment Typology 1,Payment Typology 2,Payment Typology 3,Birth Weight,Abortion Edit Indicator,Emergency Department Indicator,Total Charges,Total Costs
Long Island,Nassau,2908000,000511,NYU Winthrop Hospital,30 to 49,115,M,Other Race,Spanish/Hispanic,22,Emergency,Home or Self Care,2017,201,Infective arthritis and osteomyelitis (except that caused by tuberculosis or sexually transmitted disease),159,OT DX PRCS ON MUSC/SKEL,344,"Osteomyelitis, septic arthritis & other musculoskeletal infections",08,Diseases and Disorders of the Musculoskeletal System and Conn Tissue,2,Moderate,Minor,Medical,Medicaid,,,,N,Y,187925.08,39731.57
Long Island,Nassau,2908000,000511,NYU Winthrop Hospital,50 to 69,117,M,White,Not Span/Hispanic,5,Emergency,Home w/ Home Health Services,2017,201,Infective arthritis and osteomyelitis (except that caused by tuberculosis or sexually transmitted disease),175,OT OR THER PRC SKN/BRST,344,"Osteomyelitis, septic arthritis & other musculoskeletal infections",08,Diseases and Disorders of the Musculoskeletal System and Conn Tissue,2,Moderate,Moderate,Medical,Medicare,Medicare,Private Health Insurance,,N,Y,54032.88,15644.42
Long Island,Nassau,2908000,000511,NYU Winthrop Hospital,50 to 69,115,M,White,Not Span/Hispanic,3,Emergency,Home w/ Home Health Services,2017,201,Infective arthritis and osteomyelitis (except that caused by tuberculosis or sexually transmitted disease),175,OT OR THER PRC SKN/BRST,344,"Osteomyelitis, septic arthritis & other musculoskeletal infections",08,Diseases and Disorders of the Musculoskeletal System and Conn Tissue,2,Moderate,Minor,Medical,Medicaid,,,,N,Y,79940.15,14182.26
Long Island,Nassau,2908000,000511,NYU Winthrop Hospital,50 to 69,115,M,White,Not Span/Hispanic,1,Emergency,Home or Self Care,2017,201,Infective arthritis and osteomyelitis (except that caused by tuberculosis or sexually transmitted disease),000,NO PROC,344,"Osteomyelitis, septic arthritis & other musculoskeletal infections",08,Diseases and Disorders of the Musculoskeletal System and Conn Tissue,2,Moderate,Minor,Medical,Private Health Insurance,,,,N,Y,10845.98,2290.47
Long Island,Nassau,2908000,000511,NYU Winthrop Hospital,70 or Older,110,F,White,Not Span/Hispanic,7,Emergency,Home or Self Care,2017,201,Infective arthritis and osteomyelitis (except that caused by tuberculosis or sexually transmitted disease),054,OT VASC CATH; NOT HEART,344,"Osteomyelitis, septic arthritis & other musculoskeletal infections",08,Diseases and Disorders of the Musculoskeletal System and Conn Tissue,2,Moderate,Moderate,Medical,Medicare,Medicare,,,N,Y,58287.12,14978.01
Long Island,Nassau,2908000,000511,NYU Winthrop Hospital,70 or Older,115,M,White,Spanish/Hispanic,5,Emergency,Home w/ Home Health Services,2017,050,Diabetes mellitus with complications,058,HEMODIALYSIS,344,"Osteomyelitis, septic arthritis & other musculoskeletal infections",08,Diseases and Disorders of the Musculoskeletal System and Conn Tissue,2,Moderate,Moderate,Medical,Medicare,Medicare,Medicaid,,N,Y,42582.28,8609.27
Long Island,Nassau,2908000,000511,NYU Winthrop Hospital,0 to 17,114,M,Black/African American,Not Span/Hispanic,3,Emergency,Home or Self Care,2017,211,Other connective tissue disease,000,NO PROC,344,"Osteomyelitis, septic arthritis & other musculoskeletal infections",08,Diseases and Disorders of the Musculoskeletal System and Conn Tissue,1,Minor,Minor,Medical,Blue Cross/Blue Shield,,,,N,Y,26094.73,5546.20
Long Island,Nassau,2908000,000511,NYU Winthrop Hospital,50 to 69,115,F,White,Not Span/Hispanic,14,Emergency,Home w/ Home Health Services,2017,201,Infective arthritis and osteomyelitis (except that caused by tuberculosis or sexually transmitted disease),076,COLONOSCOPY AND BIOPSY,344,"Osteomyelitis, septic arthritis & other musculoskeletal infections",08,Diseases and Disorders of the Musculoskeletal System and Conn Tissue,3,Major,Major,Medical,Medicare,Medicare,Blue Cross/Blue Shield,,N,Y,320268.14,66448.49
Long Island,Nassau,2908000,000511,NYU Winthrop Hospital,70 or Older,115,M,White,Not Span/Hispanic,4,Emergency,Home w/ Home Health Services,2017,201,Infective arthritis and osteomyelitis (except that caused by tuberculosis or sexually transmitted disease),159,OT DX PRCS ON MUSC/SKEL,344,"Osteomyelitis, septic arthritis & other musculoskeletal infections",08,Diseases and Disorders of the Musculoskeletal System and Conn Tissue,3,Major,Moderate,Medical,Medicare,Medicare,Self-Pay,,N,Y,42356.14,10790.82
Long Island,Nassau,2908000,000511,NYU Winthrop Hospital,50 to 69,110,M,Black/African American,Not Span/Hispanic,6,Emergency,Home or Self Care,2017,050,Diabetes mellitus with complications,175,OT OR THER PRC SKN/BRST,344,"Osteomyelitis, septic arthritis & other musculoskeletal infections",08,Diseases and Disorders of the Musculoskeletal System and Conn Tissue,2,Moderate,Moderate,Medical,Private Health Insurance,,,,N,Y,72687.26,16503.50
Long Island,Nassau,2908000,000511,NYU Winthrop Hospital,50 to 69,115,F,White,Spanish/Hispanic,6,Emergency,Home w/ Home Health Services,2017,050,Diabetes mellitus with complications,159,OT DX PRCS ON MUSC/SKEL,344,"Osteomyelitis, septic arthritis & other musculoskeletal infections",08,Diseases and Disorders of the Musculoskeletal System and Conn Tissue,2,Moderate,Moderate,Medical,Medicaid,Medicaid,,,N,Y,59223.48,14534.60
Long Island,Nassau,2908000,000511,NYU Winthrop Hospital,70 or Older,117,F,Black/African American,Not Span/Hispanic,5,Emergency,Home or Self Care,2017,201,Infective arthritis and osteomyelitis (except that caused by tuberculosis or sexually transmitted disease),000,NO PROC,344,"Osteomyelitis, septic arthritis & other musculoskeletal infections",08,Diseases and Disorders of the Musculoskeletal System and Conn Tissue,3,Major,Major,Medical,Medicare,Medicare,Medicaid,,N,Y,51336.95,10583.53
Long Island,Nassau,2908000,000511,NYU Winthrop Hospital,50 to 69,112,M,White,Spanish/Hispanic,4,Emergency,Home w/ Home Health Services,2017,201,Infective arthritis and osteomyelitis (except that caused by tuberculosis or sexually transmitted disease),054,OT VASC CATH; NOT HEART,344,"Osteomyelitis, septic arthritis & other musculoskeletal infections",08,Diseases and Disorders of the Musculoskeletal System and Conn Tissue,1,Minor,Minor,Medical,Medicare,Medicare,Medicaid,,N,Y,65755.46,13702.57
Long Island,Nassau,2908000,000511,NYU Winthrop Hospital,70 or Older,117,F,White,Not Span/Hispanic,14,Emergency,Skilled Nursing Home,2017,201,Infective arthritis and osteomyelitis (except that caused by tuberculosis or sexually transmitted disease),222,BLOOD TRANSFUSION,344,"Osteomyelitis, septic arthritis & other musculoskeletal infections",08,Diseases and Disorders of the Musculoskeletal System and Conn Tissue,3,Major,Moderate,Medical,Medicare,Medicare,Blue Cross/Blue Shield,,N,Y,212198.30,38745.28
Long Island,Nassau,2908000,000511,NYU Winthrop Hospital,50 to 69,115,F,White,Not Span/Hispanic,7,Emergency,Home w/ Home Health Services,2017,050,Diabetes mellitus with complications,054,OT VASC CATH; NOT HEART,344,"Osteomyelitis, septic arthritis & other musculoskeletal infections",08,Diseases and Disorders of the Musculoskeletal System and Conn Tissue,2,Moderate,Moderate,Medical,Medicare,Medicare,Private Health Insurance,,N,Y,81532.14,18616.38
Long Island,Nassau,2908000,000511,NYU Winthrop Hospital,70 or Older,115,M,Black/African American,Not Span/Hispanic,5,Emergency,Home w/ Home Health Services,2017,050,Diabetes mellitus with complications,000,NO PROC,344,"Osteomyelitis, septic arthritis & other musculoskeletal infections",08,Diseases and Disorders of the Musculoskeletal System and Conn Tissue,2,Moderate,Major,Medical,Medicare,Medicare,Blue Cross/Blue Shield,,N,Y,45474.60,9302.22
Long Island,Nassau,2908000,000511,NYU Winthrop Hospital,50 to 69,115,M,White,Not Span/Hispanic,4,Emergency,Home or Self Care,2017,201,Infective arthritis and osteomyelitis (except that caused by tuberculosis or sexually transmitted disease),159,OT DX PRCS ON MUSC/SKEL,344,"Osteomyelitis, septic arthritis & other musculoskeletal infections",08,Diseases and Disorders of the Musculoskeletal System and Conn Tissue,4,Extreme,Major,Medical,Medicare,Medicare,Blue Cross/Blue Shield,,N,Y,80370.10,18814.15
Long Island,Nassau,2908000,000511,NYU Winthrop Hospital,70 or Older,110,M,White,Not Span/Hispanic,7,Emergency,Skilled Nursing Home,2017,201,Infective arthritis and osteomyelitis (except that caused by tuberculosis or sexually transmitted disease),000,NO PROC,344,"Osteomyelitis, septic arthritis & other musculoskeletal infections",08,Diseases and Disorders of the Musculoskeletal System and Conn Tissue,3,Major,Major,Medical,Medicare,Medicare,,,N,Y,59928.03,12974.62
Long Island,Nassau,2908000,000511,NYU Winthrop Hospital,50 to 69,115,M,Black/African American,Not Span/Hispanic,6,Emergency,Home w/ Home Health Services,2017,211,Other connective tissue disease,175,OT OR THER PRC SKN/BRST,344,"Osteomyelitis, septic arthritis & other musculoskeletal infections",08,Diseases and Disorders of the Musculoskeletal System and Conn Tissue,4,Extreme,Moderate,Medical,Blue Cross/Blue Shield,,,,N,Y,162308.66,36513.49
Long Island,Nassau,2908000,000511,NYU Winthrop Hospital,70 or Older,115,F,White,Not Span/Hispanic,7,Emergency,Home w/ Home Health Services,2017,050,Diabetes mellitus with complications,000,NO PROC,344,"Osteomyelitis, septic arthritis & other musculoskeletal infections",08,Diseases and Disorders of the Musculoskeletal System and Conn Tissue,2,Moderate,Moderate,Medical,Medicare,Medicare,Private Health Insurance,,N,Y,94805.85,23859.77
Long Island,Nassau,2908000,000511,NYU Winthrop Hospital,70 or Older,110,M,White,Not Span/Hispanic,4,Emergency,Home w/ Home Health Services,2017,050,Diabetes mellitus with complications,000,NO PROC,344,"Osteomyelitis, septic arthritis & other musculoskeletal infections",08,Diseases and Disorders of the Musculoskeletal System and Conn Tissue,2,Moderate,Moderate,Medical,Medicare,Medicare,Private Health Insurance,,N,Y,46063.70,8951.96
Long Island,Nassau,2908000,000511,NYU Winthrop Hospital,50 to 69,115,F,Black/African American,Not Span/Hispanic,5,Emergency,Left Against Medical Advice,2017,201,Infective arthritis and osteomyelitis (except that caused by tuberculosis or sexually transmitted disease),159,OT DX PRCS ON MUSC/SKEL,344,"Osteomyelitis, septic arthritis & other musculoskeletal infections",08,Diseases and Disorders of the Musculoskeletal System and Conn Tissue,3,Major,Moderate,Medical,Medicaid,Medicaid,,,N,Y,74622.31,16197.00
Long Island,Nassau,2908000,000511,NYU Winthrop Hospital,50 to 69,110,M,White,Not Span/Hispanic,8,Emergency,Home w/ Home Health Services,2017,050,Diabetes mellitus with complications,159,OT DX PRCS ON MUSC/SKEL,344,"Osteomyelitis, septic arthritis & other musculoskeletal infections",08,Diseases and Disorders of the Musculoskeletal System and Conn Tissue,3,Major,Major,Medical,Private Health Insurance,,,,N,Y,86706.89,18672.65
Long Island,Nassau,2908000,000511,NYU Winthrop Hospital,70 or Older,115,M,White,Not Span/Hispanic,21,Emergency,Skilled Nursing Home,2017,201,Infective arthritis and osteomyelitis (except that caused by tuberculosis or sexually transmitted disease),058,HEMODIALYSIS,344,"Osteomyelitis, septic arthritis & other musculoskeletal infections",08,Diseases and Disorders of the Musculoskeletal System and Conn Tissue,3,Major,Major,Medical,Medicare,Medicare,Blue Cross/Blue Shield,,N,Y,331392.34,68254.82
Long Island,Nassau,2908000,000511,NYU Winthrop Hospital,70 or Older,115,M,White,Not Span/Hispanic,13,Emergency,Skilled Nursing Home,2017,050,Diabetes mellitus with complications,159,OT DX PRCS ON MUSC/SKEL,344,"Osteomyelitis, septic arthritis & other musculoskeletal infections",08,Diseases and Disorders of the Musculoskeletal System and Conn Tissue,2,Moderate,Moderate,Medical,Medicare,Medicare,,,N,Y,161284.11,38365.79
Long Island,Nassau,2908000,000511,NYU Winthrop Hospital,70 or Older,110,F,White,Not Span/Hispanic,6,Emergency,Home or Self Care,2017,201,Infective arthritis and osteomyelitis (except that caused by tuberculosis or sexually transmitted disease),159,OT DX PRCS ON MUSC/SKEL,344,"Osteomyelitis, septic arthritis & other musculoskeletal infections",08,Diseases and Disorders of the Musculoskeletal System and Conn Tissue,1,Minor,Moderate,Medical,Medicare,Medicare,,,N,Y,147057.52,40439.29
Long Island,Nassau,2908000,000511,NYU Winthrop Hospital,50 to 69,115,M,White,Spanish/Hispanic,10,Emergency,Home w/ Home Health Services,2017,201,Infective arthritis and osteomyelitis (except that caused by tuberculosis or sexually transmitted disease),155,ARTHROCENTESIS,344,"Osteomyelitis, septic arthritis & other musculoskeletal infections",08,Diseases and Disorders of the Musculoskeletal System and Conn Tissue,3,Major,Moderate,Medical,Medicaid,Medicaid,,,N,Y,172947.32,40174.41
Long Island,Nassau,2908000,000511,NYU Winthrop Hospital,70 or Older,115,F,White,Not Span/Hispanic,14,Emergency,Skilled Nursing Home,2017,201,Infective arthritis and osteomyelitis (except that caused by tuberculosis or sexually transmitted disease),054,OT VASC CATH; NOT HEART,344,"Osteomyelitis, septic arthritis & other musculoskeletal infections",08,Diseases and Disorders of the Musculoskeletal System and Conn Tissue,3,Major,Major,Medical,Medicare,Medicare,Blue Cross/Blue Shield,,N,Y,232370.04,49170.48
Long Island,Nassau,2908000,000511,NYU Winthrop Hospital,70 or Older,117,M,White,Not Span/Hispanic,13,Emergency,Home w/ Home Health Services,2017,201,Infective arthritis and osteomyelitis (except that caused by tuberculosis or sexually transmitted disease),175,OT OR THER PRC SKN/BRST,344,"Osteomyelitis, septic arthritis & other musculoskeletal infections",08,Diseases and Disorders of the Musculoskeletal System and Conn Tissue,3,Major,Major,Medical,Medicare,Medicare,Blue Cross/Blue Shield,,N,Y,133844.80,31918.79
Long Island,Nassau,2908000,000511,NYU Winthrop Hospital,0 to 17,115,M,Black/African American,Not Span/Hispanic,1,Emergency,Home or Self Care,2017,201,Infective arthritis and osteomyelitis (except that caused by tuberculosis or sexually transmitted disease),159,OT DX PRCS ON MUSC/SKEL,344,"Osteomyelitis, septic arthritis & other musculoskeletal infections",08,Diseases and Disorders of the Musculoskeletal System and Conn Tissue,1,Minor,Minor,Medical,Medicaid,Medicaid,,,N,Y,44834.48,13599.20
Long Island,Nassau,2908000,000511,NYU Winthrop Hospital,70 or Older,115,F,Black/African American,Not Span/Hispanic,13,Emergency,Home w/ Home Health Services,2017,201,Infective arthritis and osteomyelitis (except that caused by tuberculosis or sexually transmitted disease),054,OT VASC CATH; NOT HEART,344,"Osteomyelitis, septic arthritis & other musculoskeletal infections",08,Diseases and Disorders of the Musculoskeletal System and Conn Tissue,3,Major,Major,Medical,Medicare,Medicare,Blue Cross/Blue Shield,,N,Y,159887.50,31751.23
Long Island,Nassau,2908000,000511,NYU Winthrop Hospital,30 to 49,115,M,White,Not Span/Hispanic,2,Emergency,Home or Self Care,2017,050,Diabetes mellitus with complications,159,OT DX PRCS ON MUSC/SKEL,344,"Osteomyelitis, septic arthritis & other musculoskeletal infections",08,Diseases and Disorders of the Musculoskeletal System and Conn Tissue,2,Moderate,Moderate,Medical,Private Health Insurance,,,,N,Y,30922.05,5420.40
Long Island,Nassau,2908000,000511,NYU Winthrop Hospital,50 to 69,110,F,White,Not Span/Hispanic,7,Emergency,Home or Self Care,2017,201,Infective arthritis and osteomyelitis (except that caused by tuberculosis or sexually transmitted disease),175,OT OR THER PRC SKN/BRST,344,"Osteomyelitis, septic arthritis & other musculoskeletal infections",08,Diseases and Disorders of the Musculoskeletal System and Conn Tissue,3,Major,Major,Medical,Medicare,Medicare,Medicaid,,N,Y,84187.59,21574.60
Long Island,Nassau,2908000,000511,NYU Winthrop Hospital,70 or Older,115,M,White,Not Span/Hispanic,15,Emergency,Skilled Nursing Home,2017,201,Infective arthritis and osteomyelitis (except that caused by tuberculosis or sexually transmitted disease),159,OT DX PRCS ON MUSC/SKEL,344,"Osteomyelitis, septic arthritis & other musculoskeletal infections",08,Diseases and Disorders of the Musculoskeletal System and Conn Tissue,2,Moderate,Minor,Medical,Medicare,Medicare,Private Health Insurance,,N,Y,184278.30,35435.24
Long Island,Nassau,2908000,000511,NYU Winthrop Hospital,50 to 69,115,M,White,Not Span/Hispanic,6,Emergency,Home w/ Home Health Services,2017,201,Infective arthritis and osteomyelitis (except that caused by tuberculosis or sexually transmitted disease),159,OT DX PRCS ON MUSC/SKEL,344,"Osteomyelitis, septic arthritis & other musculoskeletal infections",08,Diseases and Disorders of the Musculoskeletal System and Conn Tissue,2,Moderate,Moderate,Medical,Medicare,Medicare,,,N,Y,131398.79,28012.53
Long Island,Nassau,2908000,000511,NYU Winthrop Hospital,50 to 69,115,M,Black/African American,Not Span/Hispanic,3,Emergency,Home or Self Care,2017,050,Diabetes mellitus with complications,000,NO PROC,344,"Osteomyelitis, septic arthritis & other musculoskeletal infections",08,Diseases and Disorders of the Musculoskeletal System and Conn Tissue,2,Moderate,Minor,Medical,Private Health Insurance,Medicaid,,,N,Y,36262.06,7798.39
Long Island,Nassau,2908000,000511,NYU Winthrop Hospital,50 to 69,115,F,Black/African American,Not Span/Hispanic,10,Emergency,Home or Self Care,2017,201,Infective arthritis and osteomyelitis (except that caused by tuberculosis or sexually transmitted disease),091,PERITONEAL DIALYSIS,344,"Osteomyelitis, septic arthritis & other musculoskeletal infections",08,Diseases and Disorders of the Musculoskeletal System and Conn Tissue,4,Extreme,Major,Medical,Medicare,Blue Cross/Blue Shield,,,N,Y,116475.43,23171.05
Long Island,Nassau,2908000,000511,NYU Winthrop Hospital,70 or Older,115,F,White,Not Span/Hispanic,7,Emergency,Home or Self Care,2017,211,Other connective tissue disease,000,NO PROC,344,"Osteomyelitis, septic arthritis & other musculoskeletal infections",08,Diseases and Disorders of the Musculoskeletal System and Conn Tissue,2,Moderate,Moderate,Medical,Medicare,Medicare,Blue Cross/Blue Shield,,N,Y,89299.66,18405.34
Long Island,Nassau,2908000,000511,NYU Winthrop Hospital,18 to 29,115,M,White,Spanish/Hispanic,30,Emergency,Inpatient Rehabilitation Facility,2017,201,Infective arthritis and osteomyelitis (except that caused by tuberculosis or sexually transmitted disease),193,DX ULTRASOUND HEART,344,"Osteomyelitis, septic arthritis & other musculoskeletal infections",08,Diseases and Disorders of the Musculoskeletal System and Conn Tissue,4,Extreme,Major,Medical,Medicaid,Medicaid,,,N,Y,241137.83,44811.55
Long Island,Nassau,2908000,000511,NYU Winthrop Hospital,0 to 17,115,M,White,Spanish/Hispanic,3,Emergency,Home or Self Care,2017,201,Infective arthritis and osteomyelitis (except that caused by tuberculosis or sexually transmitted disease),170,EXCISION OF SKIN LESION,344,"Osteomyelitis, septic arthritis & other musculoskeletal infections",08,Diseases and Disorders of the Musculoskeletal System and Conn Tissue,2,Moderate,Minor,Medical,Medicaid,Medicaid,,,N,Y,41377.12,8494.00
Long Island,Nassau,2908000,000511,NYU Winthrop Hospital,50 to 69,112,M,Other Race,Not Span/Hispanic,2,Emergency,Home or Self Care,2017,201,Infective arthritis and osteomyelitis (except that caused by tuberculosis or sexually transmitted disease),000,NO PROC,344,"Osteomyelitis, septic arthritis & other musculoskeletal infections",08,Diseases and Disorders of the Musculoskeletal System and Conn Tissue,3,Major,Moderate,Medical,Medicaid,,,,N,Y,37156.22,6912.30
Long Island,Nassau,2908000,000511,NYU Winthrop Hospital,18 to 29,114,F,Black/African American,Not Span/Hispanic,20,Emergency,Home w/ Home Health Services,2017,009,Sexually transmitted infections (not HIV or hepatitis),155,ARTHROCENTESIS,344,"Osteomyelitis, septic arthritis & other musculoskeletal infections",08,Diseases and Disorders of the Musculoskeletal System and Conn Tissue,3,Major,Major,Medical,Private Health Insurance,,,,N,Y,399227.21,86212.32
Long Island,Nassau,2908000,000511,NYU Winthrop Hospital,70 or Older,119,M,White,Not Span/Hispanic,13,Emergency,Home w/ Home Health Services,2017,201,Infective arthritis and osteomyelitis (except that caused by tuberculosis or sexually transmitted disease),159,OT DX PRCS ON MUSC/SKEL,344,"Osteomyelitis, septic arthritis & other musculoskeletal infections",08,Diseases and Disorders of the Musculoskeletal System and Conn Tissue,3,Major,Major,Medical,Medicare,Medicare,,,N,Y,261219.24,61390.75
Long Island,Nassau,2908000,000511,NYU Winthrop Hospital,50 to 69,115,M,Other Race,Spanish/Hispanic,2,Emergency,Home w/ Home Health Services,2017,201,Infective arthritis and osteomyelitis (except that caused by tuberculosis or sexually transmitted disease),159,OT DX PRCS ON MUSC/SKEL,344,"Osteomyelitis, septic arthritis & other musculoskeletal infections",08,Diseases and Disorders of the Musculoskeletal System and Conn Tissue,1,Minor,Minor,Medical,Blue Cross/Blue Shield,,,,N,Y,64109.64,16975.97
