Hospital Service Area,Hospital County,Operating Certificate Number,Permanent Facility Id,Facility Name,Age Group,Zip Code - 3 digits,Gender,Race,Ethnicity,Length of Stay,Type of Admission,Patient Disposition,Discharge Year,CCS Diagnosis Code,CCS Diagnosis Description,CCS Procedure Code,CCS Procedure Description,APR DRG Code,APR DRG Description,APR MDC Code,APR MDC Description,APR Severity of Illness Code,APR Severity of Illness Description,APR Risk of Mortality,APR Medical Surgical Description,Payment Typology 1,Payment Typology 2,Payment Typology 3,Birth Weight,Abortion Edit Indicator,Emergency Department Indicator,Total Charges,Total Costs
New York City,Bronx,7000006,001169,Montefiore Medical Center - Henry & Lucy Moses Div,50 to 69,104,M,Other Race,Unknown,4,Emergency,Home w/ Home Health Services,2020,END003,DIABETES MELLITUS WITH COMPLICATION,,,344,"OSTEOMYELITIS, SEPTIC ARTHRITIS & OTHER MUSCULOSKELETAL INFECTIONS",08,DISEASES AND DISORDERS OF THE MUSCULOSKELETAL SYSTEM AND CONNECTIVE TISSUE,2,Moderate,Minor,Medical,Medicare,Medicaid,,,,Y,49873.46,8299.32
New York City,Bronx,7000006,001169,Montefiore Medical Center - Henry & Lucy Moses Div,70 or Older,104,M,Black/African American,Not Span/Hispanic,2,Emergency,Home or Self Care,2020,MUS002,OSTEOMYELITIS,,,344,"OSTEOMYELITIS, SEPTIC ARTHRITIS & OTHER MUSCULOSKELETAL INFECTIONS",08,DISEASES AND DISORDERS OF THE MUSCULOSKELETAL SYSTEM AND CONNECTIVE TISSUE,3,Major,Major,Medical,Medicare,Medicaid,,,,Y,31616.74,5336.22
New York City,Bronx,7000006,001168,Montefiore Medical Center-Wakefield Hospital,70 or Older,104,M,Black/African American,Not Span/Hispanic,3,Emergency,Home or Self Care,2020,END003,DIABETES MELLITUS WITH COMPLICATION,,,344,"OSTEOMYELITIS, SEPTIC ARTHRITIS & OTHER MUSCULOSKELETAL INFECTIONS",08,DISEASES AND DISORDERS OF THE MUSCULOSKELETAL SYSTEM AND CONNECTIVE TISSUE,3,Major,Major,Medical,Medicare,,,,,Y,43772.72,7166.41
New York City,Bronx,7000006,001169,Montefiore Medical Center - Henry & Lucy Moses Div,50 to 69,104,F,Black/African American,Not Span/Hispanic,21,Emergency,Home w/ Home Health Services,2020,MUS002,OSTEOMYELITIS,CAR025,PLACEMENT OF TUNNELED OR IMPLANTABLE PORTION OF A VASCULAR ACCESS DEVICE,344,"OSTEOMYELITIS, SEPTIC ARTHRITIS & OTHER MUSCULOSKELETAL INFECTIONS",08,DISEASES AND DISORDERS OF THE MUSCULOSKELETAL SYSTEM AND CONNECTIVE TISSUE,2,Moderate,Minor,Medical,Private Health Insurance,,,,,Y,275733.74,55002.46
New York City,Bronx,7000006,001169,Montefiore Medical Center - Henry & Lucy Moses Div,30 to 49,113,M,White,Not Span/Hispanic,48,Emergency,Home w/ Home Health Services,2020,MUS002,OSTEOMYELITIS,ADM015,ADMINISTRATION OF ANTIBIOTICS,344,"OSTEOMYELITIS, SEPTIC ARTHRITIS & OTHER MUSCULOSKELETAL INFECTIONS",08,DISEASES AND DISORDERS OF THE MUSCULOSKELETAL SYSTEM AND CONNECTIVE TISSUE,3,Major,Major,Medical,Medicaid,,,,,Y,512753.57,100258.49
New York City,Bronx,7000006,001168,Montefiore Medical Center-Wakefield Hospital,70 or Older,104,F,Other Race,Spanish/Hispanic,24,Emergency,Home w/ Home Health Services,2020,MUS002,OSTEOMYELITIS,CAR024,VENOUS AND ARTERIAL CATHETER PLACEMENT,344,"OSTEOMYELITIS, SEPTIC ARTHRITIS & OTHER MUSCULOSKELETAL INFECTIONS",08,DISEASES AND DISORDERS OF THE MUSCULOSKELETAL SYSTEM AND CONNECTIVE TISSUE,3,Major,Major,Medical,Medicare,Medicaid,,,,Y,283897.05,54030
New York City,Bronx,7000006,001168,Montefiore Medical Center-Wakefield Hospital,50 to 69,104,M,Black/African American,Not Span/Hispanic,6,Emergency,Home or Self Care,2020,END003,DIABETES MELLITUS WITH COMPLICATION,MST020,SUBCUTANEOUS TISSUE AND FASCIA EXCISION,344,"OSTEOMYELITIS, SEPTIC ARTHRITIS & OTHER MUSCULOSKELETAL INFECTIONS",08,DISEASES AND DISORDERS OF THE MUSCULOSKELETAL SYSTEM AND CONNECTIVE TISSUE,2,Moderate,Moderate,Medical,Medicare,,,,,Y,107664.8,18373.1
New York City,Bronx,7000006,001168,Montefiore Medical Center-Wakefield Hospital,50 to 69,104,M,Black/African American,Not Span/Hispanic,5,Emergency,Home or Self Care,2020,END003,DIABETES MELLITUS WITH COMPLICATION,ADM016,ADMINISTRATION OF ANTI-INFLAMMATORY AGENTS,344,"OSTEOMYELITIS, SEPTIC ARTHRITIS & OTHER MUSCULOSKELETAL INFECTIONS",08,DISEASES AND DISORDERS OF THE MUSCULOSKELETAL SYSTEM AND CONNECTIVE TISSUE,2,Moderate,Moderate,Medical,Blue Cross/Blue Shield,,,,,Y,64199.34,12034.58
New York City,Kings,7002002,001324,Mount Sinai Brooklyn,50 to 69,112,F,Black/African American,Not Span/Hispanic,1,Emergency,Home or Self Care,2020,MUS002,OSTEOMYELITIS,,,344,"OSTEOMYELITIS, SEPTIC ARTHRITIS & OTHER MUSCULOSKELETAL INFECTIONS",08,DISEASES AND DISORDERS OF THE MUSCULOSKELETAL SYSTEM AND CONNECTIVE TISSUE,1,Minor,Minor,Medical,Medicaid,Self-Pay,,,,Y,13953.63,2711.32
New York City,Manhattan,7002032,001469,Mount Sinai Morningside,50 to 69,113,M,White,Not Span/Hispanic,8,Urgent,Short-term Hospital,2020,END003,DIABETES MELLITUS WITH COMPLICATION,CAR024,VENOUS AND ARTERIAL CATHETER PLACEMENT,344,"OSTEOMYELITIS, SEPTIC ARTHRITIS & OTHER MUSCULOSKELETAL INFECTIONS",08,DISEASES AND DISORDERS OF THE MUSCULOSKELETAL SYSTEM AND CONNECTIVE TISSUE,3,Major,Major,Medical,Medicaid,Medicaid,Self-Pay,,,N,89573.65,19129.49
New York City,Kings,7002002,001324,Mount Sinai Brooklyn,50 to 69,112,M,Black/African American,Not Span/Hispanic,3,Emergency,Skilled Nursing Home,2020,MUS001,INFECTIVE ARTHRITIS,ESA001,HEMODIALYSIS,344,"OSTEOMYELITIS, SEPTIC ARTHRITIS & OTHER MUSCULOSKELETAL INFECTIONS",08,DISEASES AND DISORDERS OF THE MUSCULOSKELETAL SYSTEM AND CONNECTIVE TISSUE,3,Major,Moderate,Medical,Medicaid,Self-Pay,,,,N,34838.86,6446.65
New York City,Kings,7002002,001324,Mount Sinai Brooklyn,50 to 69,112,F,White,Unknown,9,Emergency,Home w/ Home Health Services,2020,END003,DIABETES MELLITUS WITH COMPLICATION,MST020,SUBCUTANEOUS TISSUE AND FASCIA EXCISION,344,"OSTEOMYELITIS, SEPTIC ARTHRITIS & OTHER MUSCULOSKELETAL INFECTIONS",08,DISEASES AND DISORDERS OF THE MUSCULOSKELETAL SYSTEM AND CONNECTIVE TISSUE,2,Moderate,Moderate,Medical,Medicare,Miscellaneous/Other,Self-Pay,,,Y,109452.51,19497.49
New York City,Manhattan,7002032,001469,Mount Sinai Morningside,50 to 69,100,M,Black/African American,Not Span/Hispanic,16,Emergency,Left Against Medical Advice,2020,END003,DIABETES MELLITUS WITH COMPLICATION,CAR024,VENOUS AND ARTERIAL CATHETER PLACEMENT,344,"OSTEOMYELITIS, SEPTIC ARTHRITIS & OTHER MUSCULOSKELETAL INFECTIONS",08,DISEASES AND DISORDERS OF THE MUSCULOSKELETAL SYSTEM AND CONNECTIVE TISSUE,2,Moderate,Moderate,Medical,Medicaid,Medicaid,Self-Pay,,,Y,177720.24,39171.1
New York City,Manhattan,7002032,001466,Mount Sinai West,70 or Older,100,M,White,Not Span/Hispanic,8,Emergency,Home w/ Home Health Services,2020,END003,DIABETES MELLITUS WITH COMPLICATION,ADM001,TRANSFUSION OF BLOOD AND BLOOD PRODUCTS,344,"OSTEOMYELITIS, SEPTIC ARTHRITIS & OTHER MUSCULOSKELETAL INFECTIONS",08,DISEASES AND DISORDERS OF THE MUSCULOSKELETAL SYSTEM AND CONNECTIVE TISSUE,3,Major,Major,Medical,Medicare,Medicare,Self-Pay,,,Y,104615.32,23083.46
New York City,Manhattan,7002002,001439,Mount Sinai Beth Israel,30 to 49,100,M,Black/African American,Not Span/Hispanic,1,Emergency,Left Against Medical Advice,2020,END003,DIABETES MELLITUS WITH COMPLICATION,IMG009,PLAIN RADIOGRAPHY,344,"OSTEOMYELITIS, SEPTIC ARTHRITIS & OTHER MUSCULOSKELETAL INFECTIONS",08,DISEASES AND DISORDERS OF THE MUSCULOSKELETAL SYSTEM AND CONNECTIVE TISSUE,1,Minor,Minor,Medical,Medicaid,Medicaid,Self-Pay,,,N,22134.26,5281.32
New York City,Bronx,7000006,001169,Montefiore Medical Center - Henry & Lucy Moses Div,30 to 49,104,M,Other Race,Spanish/Hispanic,10,Emergency,Inpatient Rehabilitation Facility,2020,MUS001,INFECTIVE ARTHRITIS,IMG008,ULTRASONOGRAPHY,344,"OSTEOMYELITIS, SEPTIC ARTHRITIS & OTHER MUSCULOSKELETAL INFECTIONS",08,DISEASES AND DISORDERS OF THE MUSCULOSKELETAL SYSTEM AND CONNECTIVE TISSUE,3,Major,Major,Medical,Medicaid,,,,,Y,125757.69,23552.14
New York City,Bronx,7000006,001169,Montefiore Medical Center - Henry & Lucy Moses Div,50 to 69,104,F,Black/African American,Not Span/Hispanic,3,Emergency,Home or Self Care,2020,MUS025,OTHER SPECIFIED CONNECTIVE TISSUE DISEASE,MST020,SUBCUTANEOUS TISSUE AND FASCIA EXCISION,344,"OSTEOMYELITIS, SEPTIC ARTHRITIS & OTHER MUSCULOSKELETAL INFECTIONS",08,DISEASES AND DISORDERS OF THE MUSCULOSKELETAL SYSTEM AND CONNECTIVE TISSUE,3,Major,Minor,Medical,Medicaid,,,,,Y,68861.94,12035.75
Hudson Valley,Westchester,5901000,001039,NewYork-Presbyterian/Hudson Valley Hospital,50 to 69,105,M,Other Race,Spanish/Hispanic,4,Emergency,Home or Self Care,2020,END003,DIABETES MELLITUS WITH COMPLICATION,ADM001,TRANSFUSION OF BLOOD AND BLOOD PRODUCTS,344,"OSTEOMYELITIS, SEPTIC ARTHRITIS & OTHER MUSCULOSKELETAL INFECTIONS",08,DISEASES AND DISORDERS OF THE MUSCULOSKELETAL SYSTEM AND CONNECTIVE TISSUE,3,Major,Moderate,Medical,Medicaid,,,,,Y,64284.26,20579.79
New York City,Bronx,7000006,003058,Montefiore Med Center - Jack D Weiler Hosp of A Einstein College Div,50 to 69,104,M,Other Race,Spanish/Hispanic,6,Emergency,Medicaid Cert Nursing Facility,2020,END003,DIABETES MELLITUS WITH COMPLICATION,CAR024,VENOUS AND ARTERIAL CATHETER PLACEMENT,344,"OSTEOMYELITIS, SEPTIC ARTHRITIS & OTHER MUSCULOSKELETAL INFECTIONS",08,DISEASES AND DISORDERS OF THE MUSCULOSKELETAL SYSTEM AND CONNECTIVE TISSUE,2,Moderate,Moderate,Medical,Medicare,Medicaid,,,,Y,104431.89,19850.24
New York City,Bronx,7000006,003058,Montefiore Med Center - Jack D Weiler Hosp of A Einstein College Div,30 to 49,104,M,Black/African American,Not Span/Hispanic,1,Emergency,Home or Self Care,2020,END003,DIABETES MELLITUS WITH COMPLICATION,ADM015,ADMINISTRATION OF ANTIBIOTICS,344,"OSTEOMYELITIS, SEPTIC ARTHRITIS & OTHER MUSCULOSKELETAL INFECTIONS",08,DISEASES AND DISORDERS OF THE MUSCULOSKELETAL SYSTEM AND CONNECTIVE TISSUE,2,Moderate,Moderate,Medical,Medicare,Medicaid,,,,Y,31369,5388.62
New York City,Manhattan,7002024,001456,Mount Sinai Hospital,50 to 69,113,M,White,Not Span/Hispanic,8,Urgent,Home or Self Care,2020,END003,DIABETES MELLITUS WITH COMPLICATION,MAM007,ELECTROCARDIOGRAM (ECG),344,"OSTEOMYELITIS, SEPTIC ARTHRITIS & OTHER MUSCULOSKELETAL INFECTIONS",08,DISEASES AND DISORDERS OF THE MUSCULOSKELETAL SYSTEM AND CONNECTIVE TISSUE,2,Moderate,Moderate,Medical,Medicaid,Medicaid,Self-Pay,,,N,89672.82,23198.63
New York City,Manhattan,7002024,001456,Mount Sinai Hospital,30 to 49,100,M,Black/African American,Not Span/Hispanic,2,Emergency,Left Against Medical Advice,2020,END003,DIABETES MELLITUS WITH COMPLICATION,ADM001,TRANSFUSION OF BLOOD AND BLOOD PRODUCTS,344,"OSTEOMYELITIS, SEPTIC ARTHRITIS & OTHER MUSCULOSKELETAL INFECTIONS",08,DISEASES AND DISORDERS OF THE MUSCULOSKELETAL SYSTEM AND CONNECTIVE TISSUE,3,Major,Moderate,Medical,Medicare,Medicaid,Self-Pay,,,Y,31648.42,8760.74
New York City,Manhattan,7002024,001456,Mount Sinai Hospital,50 to 69,100,F,Other Race,Not Span/Hispanic,11,Emergency,Home w/ Home Health Services,2020,MUS002,OSTEOMYELITIS,,,344,"OSTEOMYELITIS, SEPTIC ARTHRITIS & OTHER MUSCULOSKELETAL INFECTIONS",08,DISEASES AND DISORDERS OF THE MUSCULOSKELETAL SYSTEM AND CONNECTIVE TISSUE,3,Major,Major,Medical,Medicare,Medicaid,Self-Pay,,,Y,118737,33315.48
New York City,Bronx,7000006,001169,Montefiore Medical Center - Henry & Lucy Moses Div,50 to 69,105,M,Black/African American,Not Span/Hispanic,1,Emergency,Home or Self Care,2020,END003,DIABETES MELLITUS WITH COMPLICATION,,,344,"OSTEOMYELITIS, SEPTIC ARTHRITIS & OTHER MUSCULOSKELETAL INFECTIONS",08,DISEASES AND DISORDERS OF THE MUSCULOSKELETAL SYSTEM AND CONNECTIVE TISSUE,2,Moderate,Moderate,Medical,Private Health Insurance,,,,,Y,22135.48,3704.19
New York City,Bronx,7000006,001169,Montefiore Medical Center - Henry & Lucy Moses Div,70 or Older,104,M,Other Race,Unknown,10,Emergency,Home w/ Home Health Services,2020,END003,DIABETES MELLITUS WITH COMPLICATION,CAR024,VENOUS AND ARTERIAL CATHETER PLACEMENT,344,"OSTEOMYELITIS, SEPTIC ARTHRITIS & OTHER MUSCULOSKELETAL INFECTIONS",08,DISEASES AND DISORDERS OF THE MUSCULOSKELETAL SYSTEM AND CONNECTIVE TISSUE,2,Moderate,Moderate,Medical,Medicare,Private Health Insurance,,,,N,151905.43,26227.96
New York City,Bronx,7000006,001169,Montefiore Medical Center - Henry & Lucy Moses Div,50 to 69,104,M,Other Race,Not Span/Hispanic,1,Emergency,Left Against Medical Advice,2020,END003,DIABETES MELLITUS WITH COMPLICATION,,,344,"OSTEOMYELITIS, SEPTIC ARTHRITIS & OTHER MUSCULOSKELETAL INFECTIONS",08,DISEASES AND DISORDERS OF THE MUSCULOSKELETAL SYSTEM AND CONNECTIVE TISSUE,2,Moderate,Minor,Medical,Medicaid,,,,,Y,35536.13,6087.5
Long Island,Nassau,2908000,000511,NYU Langone Hospital-Long Island,0 to 17,115,M,Black/African American,Not Span/Hispanic,1,Emergency,Home or Self Care,2020,MUS026,MUSCLE DISORDERS,,,344,"OSTEOMYELITIS, SEPTIC ARTHRITIS & OTHER MUSCULOSKELETAL INFECTIONS",08,DISEASES AND DISORDERS OF THE MUSCULOSKELETAL SYSTEM AND CONNECTIVE TISSUE,1,Minor,Minor,Medical,Blue Cross/Blue Shield,,,,,Y,15913.03,3372.23
Long Island,Nassau,2908000,000511,NYU Langone Hospital-Long Island,70 or Older,115,F,Black/African American,Not Span/Hispanic,15,Emergency,Hospice - Medical Facility,2020,MUS002,OSTEOMYELITIS,ESA001,HEMODIALYSIS,344,"OSTEOMYELITIS, SEPTIC ARTHRITIS & OTHER MUSCULOSKELETAL INFECTIONS",08,DISEASES AND DISORDERS OF THE MUSCULOSKELETAL SYSTEM AND CONNECTIVE TISSUE,4,Extreme,Major,Medical,Medicare,Medicaid,,,,Y,173404.17,69235.69
New York City,Manhattan,7002054,003975,New York Presbyterian Hospital - Allen Hospital,50 to 69,100,M,Multi-racial,Not Span/Hispanic,8,Emergency,Home or Self Care,2020,END003,DIABETES MELLITUS WITH COMPLICATION,MST002,BONE AND JOINT BIOPSY,344,"OSTEOMYELITIS, SEPTIC ARTHRITIS & OTHER MUSCULOSKELETAL INFECTIONS",08,DISEASES AND DISORDERS OF THE MUSCULOSKELETAL SYSTEM AND CONNECTIVE TISSUE,2,Moderate,Moderate,Medical,Medicaid,Medicaid,Self-Pay,,,Y,133688.69,32762.47
New York City,Manhattan,7002054,003975,New York Presbyterian Hospital - Allen Hospital,30 to 49,112,M,White,Not Span/Hispanic,4,Emergency,Home or Self Care,2020,END003,DIABETES MELLITUS WITH COMPLICATION,ADM001,TRANSFUSION OF BLOOD AND BLOOD PRODUCTS,344,"OSTEOMYELITIS, SEPTIC ARTHRITIS & OTHER MUSCULOSKELETAL INFECTIONS",08,DISEASES AND DISORDERS OF THE MUSCULOSKELETAL SYSTEM AND CONNECTIVE TISSUE,2,Moderate,Major,Medical,Medicaid,Medicaid,Self-Pay,,,Y,58732.08,15744.07
New York City,Manhattan,7002054,001464,New York-Presbyterian Hospital - Columbia Presbyterian Center,0 to 17,100,F,Other Race,Multi-ethnic,3,Urgent,Home or Self Care,2020,MUS026,MUSCLE DISORDERS,,,344,"OSTEOMYELITIS, SEPTIC ARTHRITIS & OTHER MUSCULOSKELETAL INFECTIONS",08,DISEASES AND DISORDERS OF THE MUSCULOSKELETAL SYSTEM AND CONNECTIVE TISSUE,3,Major,Minor,Medical,Medicaid,Medicaid,Self-Pay,,,Y,38919.53,8387.25
New York City,Manhattan,7002054,001464,New York-Presbyterian Hospital - Columbia Presbyterian Center,70 or Older,100,F,Other Race,Not Span/Hispanic,10,Emergency,Skilled Nursing Home,2020,END003,DIABETES MELLITUS WITH COMPLICATION,MST003,"SUBCUTANEOUS TISSUE, FASCIA, AND MUSCLE BIOPSY",344,"OSTEOMYELITIS, SEPTIC ARTHRITIS & OTHER MUSCULOSKELETAL INFECTIONS",08,DISEASES AND DISORDERS OF THE MUSCULOSKELETAL SYSTEM AND CONNECTIVE TISSUE,2,Moderate,Moderate,Medical,Medicare,Medicare,Medicaid,,,Y,118078.38,25351.46
New York City,Manhattan,7002054,001464,New York-Presbyterian Hospital - Columbia Presbyterian Center,70 or Older,104,M,Multi-racial,Multi-ethnic,18,Emergency,Expired,2020,MUS025,OTHER SPECIFIED CONNECTIVE TISSUE DISEASE,CAR024,VENOUS AND ARTERIAL CATHETER PLACEMENT,344,"OSTEOMYELITIS, SEPTIC ARTHRITIS & OTHER MUSCULOSKELETAL INFECTIONS",08,DISEASES AND DISORDERS OF THE MUSCULOSKELETAL SYSTEM AND CONNECTIVE TISSUE,4,Extreme,Extreme,Medical,Medicare,Medicare,Medicaid,,,Y,337400.88,110850.22
New York City,Manhattan,7002054,001464,New York-Presbyterian Hospital - Columbia Presbyterian Center,0 to 17,100,F,Multi-racial,Multi-ethnic,2,Emergency,Home or Self Care,2020,MUS026,MUSCLE DISORDERS,,,344,"OSTEOMYELITIS, SEPTIC ARTHRITIS & OTHER MUSCULOSKELETAL INFECTIONS",08,DISEASES AND DISORDERS OF THE MUSCULOSKELETAL SYSTEM AND CONNECTIVE TISSUE,1,Minor,Minor,Medical,Medicaid,Medicaid,Self-Pay,,,Y,28078.61,6209.8
New York City,Manhattan,7002054,001464,New York-Presbyterian Hospital - Columbia Presbyterian Center,50 to 69,104,M,Black/African American,Not Span/Hispanic,4,Emergency,Home or Self Care,2020,END003,DIABETES MELLITUS WITH COMPLICATION,,,344,"OSTEOMYELITIS, SEPTIC ARTHRITIS & OTHER MUSCULOSKELETAL INFECTIONS",08,DISEASES AND DISORDERS OF THE MUSCULOSKELETAL SYSTEM AND CONNECTIVE TISSUE,1,Minor,Minor,Medical,Private Health Insurance,Self-Pay,,,,Y,48514.25,10748.12
New York City,Manhattan,7002054,001464,New York-Presbyterian Hospital - Columbia Presbyterian Center,50 to 69,104,F,Other Race,Not Span/Hispanic,1,Emergency,Left Against Medical Advice,2020,MUS002,OSTEOMYELITIS,,,344,"OSTEOMYELITIS, SEPTIC ARTHRITIS & OTHER MUSCULOSKELETAL INFECTIONS",08,DISEASES AND DISORDERS OF THE MUSCULOSKELETAL SYSTEM AND CONNECTIVE TISSUE,2,Moderate,Moderate,Medical,Private Health Insurance,Self-Pay,,,,Y,14354.48,3125.08
New York City,Manhattan,7002054,001464,New York-Presbyterian Hospital - Columbia Presbyterian Center,50 to 69,100,F,Other Race,Not Span/Hispanic,3,Emergency,Home w/ Home Health Services,2020,END003,DIABETES MELLITUS WITH COMPLICATION,,,344,"OSTEOMYELITIS, SEPTIC ARTHRITIS & OTHER MUSCULOSKELETAL INFECTIONS",08,DISEASES AND DISORDERS OF THE MUSCULOSKELETAL SYSTEM AND CONNECTIVE TISSUE,1,Minor,Minor,Medical,Medicare,Medicare,Medicaid,,,Y,44068.64,9640.99
New York City,Manhattan,7002054,001464,New York-Presbyterian Hospital - Columbia Presbyterian Center,50 to 69,104,M,Other Race,Not Span/Hispanic,1,Emergency,Left Against Medical Advice,2020,END003,DIABETES MELLITUS WITH COMPLICATION,,,344,"OSTEOMYELITIS, SEPTIC ARTHRITIS & OTHER MUSCULOSKELETAL INFECTIONS",08,DISEASES AND DISORDERS OF THE MUSCULOSKELETAL SYSTEM AND CONNECTIVE TISSUE,2,Moderate,Minor,Medical,Medicaid,Medicaid,Self-Pay,,,Y,18922.55,4349.3
New York City,Manhattan,7002054,001464,New York-Presbyterian Hospital - Columbia Presbyterian Center,0 to 17,100,F,Multi-racial,Not Span/Hispanic,2,Emergency,Home or Self Care,2020,MUS026,MUSCLE DISORDERS,,,344,"OSTEOMYELITIS, SEPTIC ARTHRITIS & OTHER MUSCULOSKELETAL INFECTIONS",08,DISEASES AND DISORDERS OF THE MUSCULOSKELETAL SYSTEM AND CONNECTIVE TISSUE,2,Moderate,Minor,Medical,Private Health Insurance,Self-Pay,,,,Y,26902.04,6994.63
New York City,Manhattan,7002054,001464,New York-Presbyterian Hospital - Columbia Presbyterian Center,0 to 17,104,M,Black/African American,Not Span/Hispanic,3,Emergency,Home or Self Care,2020,MUS026,MUSCLE DISORDERS,ADM021,"ADMINISTRATION OF THERAPEUTIC SUBSTANCES, NEC",344,"OSTEOMYELITIS, SEPTIC ARTHRITIS & OTHER MUSCULOSKELETAL INFECTIONS",08,DISEASES AND DISORDERS OF THE MUSCULOSKELETAL SYSTEM AND CONNECTIVE TISSUE,1,Minor,Minor,Medical,Medicaid,Medicaid,Self-Pay,,,Y,36491.75,7711.46
New York City,Manhattan,7002054,001464,New York-Presbyterian Hospital - Columbia Presbyterian Center,50 to 69,112,M,Other Race,Not Span/Hispanic,4,Emergency,Home or Self Care,2020,END003,DIABETES MELLITUS WITH COMPLICATION,,,344,"OSTEOMYELITIS, SEPTIC ARTHRITIS & OTHER MUSCULOSKELETAL INFECTIONS",08,DISEASES AND DISORDERS OF THE MUSCULOSKELETAL SYSTEM AND CONNECTIVE TISSUE,2,Moderate,Major,Medical,Medicare,Medicare,Medicaid,,,Y,51693.98,11402.95
New York City,Manhattan,7002024,001456,Mount Sinai Hospital,18 to 29,112,M,Other Race,Not Span/Hispanic,6,Emergency,Home w/ Home Health Services,2020,MUS002,OSTEOMYELITIS,,,344,"OSTEOMYELITIS, SEPTIC ARTHRITIS & OTHER MUSCULOSKELETAL INFECTIONS",08,DISEASES AND DISORDERS OF THE MUSCULOSKELETAL SYSTEM AND CONNECTIVE TISSUE,3,Major,Moderate,Medical,Medicare,Medicaid,Self-Pay,,,Y,88067.03,22526.23
New York City,Manhattan,7002024,001456,Mount Sinai Hospital,50 to 69,100,M,Other Race,Spanish/Hispanic,6,Emergency,Home or Self Care,2020,MUS002,OSTEOMYELITIS,MST001,ARTHROCENTESIS,344,"OSTEOMYELITIS, SEPTIC ARTHRITIS & OTHER MUSCULOSKELETAL INFECTIONS",08,DISEASES AND DISORDERS OF THE MUSCULOSKELETAL SYSTEM AND CONNECTIVE TISSUE,3,Major,Moderate,Medical,Medicare,Medicaid,Self-Pay,,,Y,84469.37,22777.89
New York City,Queens,7003010,001637,New York - Presbyterian/Queens,70 or Older,113,M,White,Not Span/Hispanic,2,Emergency,Home or Self Care,2020,END003,DIABETES MELLITUS WITH COMPLICATION,ADM015,ADMINISTRATION OF ANTIBIOTICS,344,"OSTEOMYELITIS, SEPTIC ARTHRITIS & OTHER MUSCULOSKELETAL INFECTIONS",08,DISEASES AND DISORDERS OF THE MUSCULOSKELETAL SYSTEM AND CONNECTIVE TISSUE,1,Minor,Moderate,Medical,Blue Cross/Blue Shield,Self-Pay,,,,Y,22480.1,5545.58
New York City,Manhattan,7002024,001456,Mount Sinai Hospital,70 or Older,111,F,White,Not Span/Hispanic,7,Urgent,Skilled Nursing Home,2020,MUS002,OSTEOMYELITIS,MST004,INCISION AND DRAINAGE OF MUSCULOSKELETAL TISSUE AND JOINTS,344,"OSTEOMYELITIS, SEPTIC ARTHRITIS & OTHER MUSCULOSKELETAL INFECTIONS",08,DISEASES AND DISORDERS OF THE MUSCULOSKELETAL SYSTEM AND CONNECTIVE TISSUE,3,Major,Major,Medical,Medicare,Blue Cross/Blue Shield,Self-Pay,,,N,72602.06,19340.49
New York City,Queens,7003010,001637,New York - Presbyterian/Queens,70 or Older,113,M,Other Race,Spanish/Hispanic,3,Emergency,Home or Self Care,2020,END003,DIABETES MELLITUS WITH COMPLICATION,ADM015,ADMINISTRATION OF ANTIBIOTICS,344,"OSTEOMYELITIS, SEPTIC ARTHRITIS & OTHER MUSCULOSKELETAL INFECTIONS",08,DISEASES AND DISORDERS OF THE MUSCULOSKELETAL SYSTEM AND CONNECTIVE TISSUE,2,Moderate,Major,Medical,Medicare,Medicare,Medicaid,,,Y,27251.29,6879.56
New York City,Queens,7003010,001637,New York - Presbyterian/Queens,50 to 69,112,F,Black/African American,Not Span/Hispanic,5,Emergency,Home w/ Home Health Services,2020,END003,DIABETES MELLITUS WITH COMPLICATION,MST020,SUBCUTANEOUS TISSUE AND FASCIA EXCISION,344,"OSTEOMYELITIS, SEPTIC ARTHRITIS & OTHER MUSCULOSKELETAL INFECTIONS",08,DISEASES AND DISORDERS OF THE MUSCULOSKELETAL SYSTEM AND CONNECTIVE TISSUE,3,Major,Moderate,Medical,Medicare,Medicare,Self-Pay,,,Y,51013.56,12423.43
New York City,Queens,7003010,001637,New York - Presbyterian/Queens,50 to 69,113,M,Other Race,Spanish/Hispanic,2,Emergency,Home w/ Home Health Services,2020,END003,DIABETES MELLITUS WITH COMPLICATION,ADM015,ADMINISTRATION OF ANTIBIOTICS,344,"OSTEOMYELITIS, SEPTIC ARTHRITIS & OTHER MUSCULOSKELETAL INFECTIONS",08,DISEASES AND DISORDERS OF THE MUSCULOSKELETAL SYSTEM AND CONNECTIVE TISSUE,2,Moderate,Moderate,Medical,Medicaid,Self-Pay,,,,Y,20603.99,5082.19
New York City,Queens,7003010,001637,New York - Presbyterian/Queens,70 or Older,113,F,White,Not Span/Hispanic,12,Emergency,Skilled Nursing Home,2020,MUS002,OSTEOMYELITIS,GIS017,GASTROSTOMY,344,"OSTEOMYELITIS, SEPTIC ARTHRITIS & OTHER MUSCULOSKELETAL INFECTIONS",08,DISEASES AND DISORDERS OF THE MUSCULOSKELETAL SYSTEM AND CONNECTIVE TISSUE,2,Moderate,Minor,Medical,Medicare,Medicaid,Self-Pay,,,Y,113698.23,26580.44
New York City,Queens,7003010,001637,New York - Presbyterian/Queens,50 to 69,113,M,White,Not Span/Hispanic,8,Emergency,Home w/ Home Health Services,2020,MUS001,INFECTIVE ARTHRITIS,MST004,INCISION AND DRAINAGE OF MUSCULOSKELETAL TISSUE AND JOINTS,344,"OSTEOMYELITIS, SEPTIC ARTHRITIS & OTHER MUSCULOSKELETAL INFECTIONS",08,DISEASES AND DISORDERS OF THE MUSCULOSKELETAL SYSTEM AND CONNECTIVE TISSUE,2,Moderate,Minor,Medical,Blue Cross/Blue Shield,Medicare,Self-Pay,,,Y,68297.24,18262.03
New York City,Manhattan,7002054,001437,New York-Presbyterian/Lower Manhattan Hospital,50 to 69,112,M,Black/African American,Not Span/Hispanic,48,Emergency,Skilled Nursing Home,2020,MUS002,OSTEOMYELITIS,CAR024,VENOUS AND ARTERIAL CATHETER PLACEMENT,344,"OSTEOMYELITIS, SEPTIC ARTHRITIS & OTHER MUSCULOSKELETAL INFECTIONS",08,DISEASES AND DISORDERS OF THE MUSCULOSKELETAL SYSTEM AND CONNECTIVE TISSUE,2,Moderate,Major,Medical,Medicare,Medicare,Medicaid,,,Y,586281.81,127517.4