Hospital Service Area,Hospital County,Operating Certificate Number,Permanent Facility Id,Facility Name,Age Group,Zip Code - 3 digits,Gender,Race,Ethnicity,Length of Stay,Type of Admission,Patient Disposition,Discharge Year,CCS Diagnosis Code,CCS Diagnosis Description,CCS Procedure Code,CCS Procedure Description,APR DRG Code,APR DRG Description,APR MDC Code,APR MDC Description,APR Severity of Illness Code,APR Severity of Illness Description,APR Risk of Mortality,APR Medical Surgical Description,Payment Typology 1,Payment Typology 2,Payment Typology 3,Birth Weight,Abortion Edit Indicator,Emergency Department Indicator,Total Charges,Total Costs
New York City,Kings,7002053,001304,NYU Langone Hospital-Brooklyn,70 or Older,112,F,Black/African American,Not Span/Hispanic,19,Emergency,Skilled Nursing Home,2019,MUS024,SYSTEMIC LUPUS ERYTHEMATOSUS AND CONNECTIVE TISSUE DISORDERS,ADM021,"ADMINISTRATION OF THERAPEUTIC SUBSTANCES, NEC",346,CONNECTIVE TISSUE DISORDERS,08,DISEASES AND DISORDERS OF THE MUSCULOSKELETAL SYSTEM AND CONNECTIVE TISSUE,2,Moderate,Moderate,Medical,Medicaid,,,,,true,153605.94,62222
New York City,Kings,7002053,001304,NYU Langone Hospital-Brooklyn,50 to 69,112,M,Black/African American,Not Span/Hispanic,7,Emergency,Home w/ Home Health Services,2019,MUS024,SYSTEMIC LUPUS ERYTHEMATOSUS AND CONNECTIVE TISSUE DISORDERS,ADM001,TRANSFUSION OF BLOOD AND BLOOD PRODUCTS,346,CONNECTIVE TISSUE DISORDERS,08,DISEASES AND DISORDERS OF THE MUSCULOSKELETAL SYSTEM AND CONNECTIVE TISSUE,4,Extreme,Major,Medical,Private Health Insurance,,,,,true,106305.73,28249.59
New York City,Kings,7002053,001304,NYU Langone Hospital-Brooklyn,18 to 29,112,M,White,Spanish/Hispanic,2,Emergency,Home or Self Care,2019,MUS003,RHEUMATOID ARTHRITIS AND RELATED DISEASE,,,346,CONNECTIVE TISSUE DISORDERS,08,DISEASES AND DISORDERS OF THE MUSCULOSKELETAL SYSTEM AND CONNECTIVE TISSUE,1,Minor,Minor,Medical,Medicaid,,,,,true,41947.38,11022.64
New York City,Kings,7002053,001304,NYU Langone Hospital-Brooklyn,0 to 17,112,M,Other Race,Spanish/Hispanic,6,Emergency,Home or Self Care,2019,MUS024,SYSTEMIC LUPUS ERYTHEMATOSUS AND CONNECTIVE TISSUE DISORDERS,IMG008,ULTRASONOGRAPHY,346,CONNECTIVE TISSUE DISORDERS,08,DISEASES AND DISORDERS OF THE MUSCULOSKELETAL SYSTEM AND CONNECTIVE TISSUE,2,Moderate,Minor,Medical,Medicaid,,,,,true,75852.83,17515.49
New York City,Kings,7002053,001304,NYU Langone Hospital-Brooklyn,18 to 29,112,F,White,Not Span/Hispanic,5,Emergency,Home or Self Care,2019,MUS024,SYSTEMIC LUPUS ERYTHEMATOSUS AND CONNECTIVE TISSUE DISORDERS,,,346,CONNECTIVE TISSUE DISORDERS,08,DISEASES AND DISORDERS OF THE MUSCULOSKELETAL SYSTEM AND CONNECTIVE TISSUE,2,Moderate,Minor,Medical,Private Health Insurance,,,,,true,50841.36,18244.02
New York City,Kings,7002053,001304,NYU Langone Hospital-Brooklyn,70 or Older,112,M,Other Race,Not Span/Hispanic,7,Emergency,Home w/ Home Health Services,2019,END016,OTHER SPECIFIED AND UNSPECIFIED NUTRITIONAL AND METABOLIC DISORDERS,MAM011,ELECTROENCEPHALOGRAM (EEG),346,CONNECTIVE TISSUE DISORDERS,08,DISEASES AND DISORDERS OF THE MUSCULOSKELETAL SYSTEM AND CONNECTIVE TISSUE,4,Extreme,Extreme,Medical,Medicare,Medicaid,,,,true,84166.09,26708.92
New York City,Kings,7002053,001304,NYU Langone Hospital-Brooklyn,50 to 69,103,M,White,Not Span/Hispanic,2,Emergency,Home or Self Care,2019,CIR032,OTHER SPECIFIED AND UNSPECIFIED CIRCULATORY DISEASE,,,346,CONNECTIVE TISSUE DISORDERS,08,DISEASES AND DISORDERS OF THE MUSCULOSKELETAL SYSTEM AND CONNECTIVE TISSUE,4,Extreme,Extreme,Medical,Private Health Insurance,,,,,true,39487,10147.5
New York City,Kings,7002053,001304,NYU Langone Hospital-Brooklyn,0 to 17,103,F,Other Race,Not Span/Hispanic,3,Emergency,Home or Self Care,2019,MUS024,SYSTEMIC LUPUS ERYTHEMATOSUS AND CONNECTIVE TISSUE DISORDERS,ADM003,ADMINISTRATION OF ALBUMIN AND GLOBULIN,346,CONNECTIVE TISSUE DISORDERS,08,DISEASES AND DISORDERS OF THE MUSCULOSKELETAL SYSTEM AND CONNECTIVE TISSUE,2,Moderate,Minor,Medical,Private Health Insurance,,,,,true,85158.51,10990.38
New York City,Kings,7002053,001304,NYU Langone Hospital-Brooklyn,30 to 49,112,M,Other Race,Spanish/Hispanic,4,Emergency,Home or Self Care,2019,MUS024,SYSTEMIC LUPUS ERYTHEMATOSUS AND CONNECTIVE TISSUE DISORDERS,,,346,CONNECTIVE TISSUE DISORDERS,08,DISEASES AND DISORDERS OF THE MUSCULOSKELETAL SYSTEM AND CONNECTIVE TISSUE,2,Moderate,Minor,Medical,Medicaid,,,,,true,64205.66,17982.14
New York City,Kings,7002053,001304,NYU Langone Hospital-Brooklyn,70 or Older,112,F,Black/African American,Not Span/Hispanic,3,Emergency,Skilled Nursing Home,2019,MUS003,RHEUMATOID ARTHRITIS AND RELATED DISEASE,,,346,CONNECTIVE TISSUE DISORDERS,08,DISEASES AND DISORDERS OF THE MUSCULOSKELETAL SYSTEM AND CONNECTIVE TISSUE,1,Minor,Moderate,Medical,Medicare,Blue Cross/Blue Shield,,,,true,44126.83,16531.42
New York City,Kings,7002053,001304,NYU Langone Hospital-Brooklyn,50 to 69,112,F,Other Race,Spanish/Hispanic,3,Emergency,Home or Self Care,2019,MUS024,SYSTEMIC LUPUS ERYTHEMATOSUS AND CONNECTIVE TISSUE DISORDERS,,,346,CONNECTIVE TISSUE DISORDERS,08,DISEASES AND DISORDERS OF THE MUSCULOSKELETAL SYSTEM AND CONNECTIVE TISSUE,2,Moderate,Moderate,Medical,Medicaid,,,,,true,59131.24,20552.83
New York City,Kings,7002053,001304,NYU Langone Hospital-Brooklyn,50 to 69,112,F,Other Race,Spanish/Hispanic,1,Emergency,Left Against Medical Advice,2019,MUS024,SYSTEMIC LUPUS ERYTHEMATOSUS AND CONNECTIVE TISSUE DISORDERS,IMG005,MAGNETIC RESONANCE IMAGING (MRI),346,CONNECTIVE TISSUE DISORDERS,08,DISEASES AND DISORDERS OF THE MUSCULOSKELETAL SYSTEM AND CONNECTIVE TISSUE,2,Moderate,Moderate,Medical,Medicaid,,,,,true,28403.62,4557.23
New York City,Kings,7002053,001304,NYU Langone Hospital-Brooklyn,0 to 17,112,F,Other Race,Spanish/Hispanic,3,Emergency,Home or Self Care,2019,MUS024,SYSTEMIC LUPUS ERYTHEMATOSUS AND CONNECTIVE TISSUE DISORDERS,IMG008,ULTRASONOGRAPHY,346,CONNECTIVE TISSUE DISORDERS,08,DISEASES AND DISORDERS OF THE MUSCULOSKELETAL SYSTEM AND CONNECTIVE TISSUE,2,Moderate,Minor,Medical,Medicaid,,,,,true,62882.45,10246.93
New York City,Kings,7002053,001304,NYU Langone Hospital-Brooklyn,18 to 29,112,F,Other Race,Not Span/Hispanic,9,Emergency,Home or Self Care,2019,MUS024,SYSTEMIC LUPUS ERYTHEMATOSUS AND CONNECTIVE TISSUE DISORDERS,,,346,CONNECTIVE TISSUE DISORDERS,08,DISEASES AND DISORDERS OF THE MUSCULOSKELETAL SYSTEM AND CONNECTIVE TISSUE,3,Major,Moderate,Medical,Private Health Insurance,,,,,true,106170.41,35065.49
New York City,Kings,7002053,001304,NYU Langone Hospital-Brooklyn,50 to 69,112,F,Other Race,Not Span/Hispanic,3,Emergency,Home or Self Care,2019,END016,OTHER SPECIFIED AND UNSPECIFIED NUTRITIONAL AND METABOLIC DISORDERS,,,346,CONNECTIVE TISSUE DISORDERS,08,DISEASES AND DISORDERS OF THE MUSCULOSKELETAL SYSTEM AND CONNECTIVE TISSUE,3,Major,Major,Medical,Medicaid,,,,,true,36422.34,12315.03
New York City,Kings,7002053,001304,NYU Langone Hospital-Brooklyn,50 to 69,112,F,Other Race,Spanish/Hispanic,5,Emergency,Home or Self Care,2019,MUS003,RHEUMATOID ARTHRITIS AND RELATED DISEASE,SKB001,SKIN BIOPSY AND DIAGNOSTIC DRAINAGE,346,CONNECTIVE TISSUE DISORDERS,08,DISEASES AND DISORDERS OF THE MUSCULOSKELETAL SYSTEM AND CONNECTIVE TISSUE,1,Minor,Minor,Medical,Medicaid,,,,,true,55689.28,18570.2
New York City,Kings,7002053,001304,NYU Langone Hospital-Brooklyn,70 or Older,112,M,White,Not Span/Hispanic,6,Emergency,Home or Self Care,2019,BLD006,COAGULATION AND HEMORRHAGIC DISORDERS,SKB001,SKIN BIOPSY AND DIAGNOSTIC DRAINAGE,346,CONNECTIVE TISSUE DISORDERS,08,DISEASES AND DISORDERS OF THE MUSCULOSKELETAL SYSTEM AND CONNECTIVE TISSUE,3,Major,Major,Medical,Medicare,Blue Cross/Blue Shield,,,,true,135442.88,36742.39
New York City,Kings,7002053,001304,NYU Langone Hospital-Brooklyn,50 to 69,103,F,White,Not Span/Hispanic,15,Emergency,Home w/ Home Health Services,2019,MUS024,SYSTEMIC LUPUS ERYTHEMATOSUS AND CONNECTIVE TISSUE DISORDERS,URN002,KIDNEY AND OTHER URINARY TRACT BIOPSY (NON-ENDOSCOPIC),346,CONNECTIVE TISSUE DISORDERS,08,DISEASES AND DISORDERS OF THE MUSCULOSKELETAL SYSTEM AND CONNECTIVE TISSUE,3,Major,Major,Medical,Medicare,,,,,true,201661.03,60450.21
New York City,Kings,7002053,001304,NYU Langone Hospital-Brooklyn,50 to 69,112,F,White,Spanish/Hispanic,3,Emergency,Home or Self Care,2019,MUS024,SYSTEMIC LUPUS ERYTHEMATOSUS AND CONNECTIVE TISSUE DISORDERS,,,346,CONNECTIVE TISSUE DISORDERS,08,DISEASES AND DISORDERS OF THE MUSCULOSKELETAL SYSTEM AND CONNECTIVE TISSUE,2,Moderate,Minor,Medical,Medicaid,,,,,true,63860.51,17185.31
New York City,Kings,7002053,001304,NYU Langone Hospital-Brooklyn,30 to 49,112,M,Other Race,Spanish/Hispanic,4,Emergency,Home or Self Care,2019,MUS003,RHEUMATOID ARTHRITIS AND RELATED DISEASE,,,346,CONNECTIVE TISSUE DISORDERS,08,DISEASES AND DISORDERS OF THE MUSCULOSKELETAL SYSTEM AND CONNECTIVE TISSUE,3,Major,Major,Medical,Medicaid,,,,,true,82830.59,19871.79
New York City,Kings,7002053,001304,NYU Langone Hospital-Brooklyn,30 to 49,112,F,Other Race,Not Span/Hispanic,2,Emergency,Home or Self Care,2019,MUS024,SYSTEMIC LUPUS ERYTHEMATOSUS AND CONNECTIVE TISSUE DISORDERS,,,346,CONNECTIVE TISSUE DISORDERS,08,DISEASES AND DISORDERS OF THE MUSCULOSKELETAL SYSTEM AND CONNECTIVE TISSUE,3,Major,Major,Medical,Private Health Insurance,,,,,true,20313.66,7567.73
New York City,Kings,7002053,001304,NYU Langone Hospital-Brooklyn,0 to 17,112,M,Other Race,Not Span/Hispanic,1,Emergency,Home or Self Care,2019,BLD006,COAGULATION AND HEMORRHAGIC DISORDERS,,,346,CONNECTIVE TISSUE DISORDERS,08,DISEASES AND DISORDERS OF THE MUSCULOSKELETAL SYSTEM AND CONNECTIVE TISSUE,1,Minor,Minor,Medical,Medicaid,,,,,true,18027.41,4433.24
New York City,Kings,7002053,001304,NYU Langone Hospital-Brooklyn,30 to 49,112,M,Other Race,Spanish/Hispanic,2,Emergency,Home or Self Care,2019,MUS003,RHEUMATOID ARTHRITIS AND RELATED DISEASE,,,346,CONNECTIVE TISSUE DISORDERS,08,DISEASES AND DISORDERS OF THE MUSCULOSKELETAL SYSTEM AND CONNECTIVE TISSUE,2,Moderate,Minor,Medical,Medicaid,,,,,true,22390.5,7719.62
New York City,Kings,7002053,001304,NYU Langone Hospital-Brooklyn,50 to 69,112,F,Other Race,Spanish/Hispanic,1,Emergency,Home or Self Care,2019,CIR032,OTHER SPECIFIED AND UNSPECIFIED CIRCULATORY DISEASE,,,346,CONNECTIVE TISSUE DISORDERS,08,DISEASES AND DISORDERS OF THE MUSCULOSKELETAL SYSTEM AND CONNECTIVE TISSUE,2,Moderate,Minor,Medical,Medicaid,,,,,true,23392.9,8116.52
New York City,Kings,7002053,001304,NYU Langone Hospital-Brooklyn,50 to 69,112,F,Other Race,Not Span/Hispanic,3,Emergency,Home or Self Care,2019,MUS024,SYSTEMIC LUPUS ERYTHEMATOSUS AND CONNECTIVE TISSUE DISORDERS,,,346,CONNECTIVE TISSUE DISORDERS,08,DISEASES AND DISORDERS OF THE MUSCULOSKELETAL SYSTEM AND CONNECTIVE TISSUE,2,Moderate,Moderate,Medical,Private Health Insurance,Medicaid,,,,true,39600.75,12152.81
New York City,Kings,7002053,001304,NYU Langone Hospital-Brooklyn,70 or Older,112,M,Other Race,Not Span/Hispanic,1,Emergency,Home or Self Care,2019,MUS003,RHEUMATOID ARTHRITIS AND RELATED DISEASE,ADM014,REGIONAL ANESTHESIA,346,CONNECTIVE TISSUE DISORDERS,08,DISEASES AND DISORDERS OF THE MUSCULOSKELETAL SYSTEM AND CONNECTIVE TISSUE,1,Minor,Moderate,Medical,Medicare,,,,,true,53932.47,15864.23
New York City,Kings,7002053,001304,NYU Langone Hospital-Brooklyn,50 to 69,112,F,Other Race,Spanish/Hispanic,2,Emergency,Home w/ Home Health Services,2019,MUS003,RHEUMATOID ARTHRITIS AND RELATED DISEASE,,,346,CONNECTIVE TISSUE DISORDERS,08,DISEASES AND DISORDERS OF THE MUSCULOSKELETAL SYSTEM AND CONNECTIVE TISSUE,1,Minor,Minor,Medical,Medicaid,,,,,true,30343.44,8809.23
New York City,Kings,7002053,001304,NYU Langone Hospital-Brooklyn,70 or Older,112,M,Other Race,Not Span/Hispanic,2,Emergency,Home or Self Care,2019,MUS024,SYSTEMIC LUPUS ERYTHEMATOSUS AND CONNECTIVE TISSUE DISORDERS,,,346,CONNECTIVE TISSUE DISORDERS,08,DISEASES AND DISORDERS OF THE MUSCULOSKELETAL SYSTEM AND CONNECTIVE TISSUE,3,Major,Major,Medical,Medicare,,,,,true,62102.99,11281.38
New York City,Kings,7002053,001304,NYU Langone Hospital-Brooklyn,30 to 49,116,F,Black/African American,Not Span/Hispanic,3,Emergency,Home or Self Care,2019,MUS024,SYSTEMIC LUPUS ERYTHEMATOSUS AND CONNECTIVE TISSUE DISORDERS,,,346,CONNECTIVE TISSUE DISORDERS,08,DISEASES AND DISORDERS OF THE MUSCULOSKELETAL SYSTEM AND CONNECTIVE TISSUE,3,Major,Moderate,Medical,Private Health Insurance,,,,,true,43213.06,12893.7
New York City,Kings,7002053,001304,NYU Langone Hospital-Brooklyn,30 to 49,112,F,White,Spanish/Hispanic,3,Emergency,Home or Self Care,2019,MUS024,SYSTEMIC LUPUS ERYTHEMATOSUS AND CONNECTIVE TISSUE DISORDERS,IMG008,ULTRASONOGRAPHY,346,CONNECTIVE TISSUE DISORDERS,08,DISEASES AND DISORDERS OF THE MUSCULOSKELETAL SYSTEM AND CONNECTIVE TISSUE,2,Moderate,Minor,Medical,Private Health Insurance,,,,,true,37757.37,11480.87
New York City,Kings,7002053,001304,NYU Langone Hospital-Brooklyn,70 or Older,112,F,White,Not Span/Hispanic,1,Emergency,Home or Self Care,2019,MUS024,SYSTEMIC LUPUS ERYTHEMATOSUS AND CONNECTIVE TISSUE DISORDERS,,,346,CONNECTIVE TISSUE DISORDERS,08,DISEASES AND DISORDERS OF THE MUSCULOSKELETAL SYSTEM AND CONNECTIVE TISSUE,4,Extreme,Major,Medical,Blue Cross/Blue Shield,Medicare,,,,true,28680.55,6054.46
New York City,Kings,7002053,001304,NYU Langone Hospital-Brooklyn,0 to 17,112,M,Other Race,Not Span/Hispanic,2,Emergency,Home or Self Care,2019,CIR032,OTHER SPECIFIED AND UNSPECIFIED CIRCULATORY DISEASE,SKB001,SKIN BIOPSY AND DIAGNOSTIC DRAINAGE,346,CONNECTIVE TISSUE DISORDERS,08,DISEASES AND DISORDERS OF THE MUSCULOSKELETAL SYSTEM AND CONNECTIVE TISSUE,1,Minor,Minor,Medical,Medicaid,,,,,true,21644.42,6550.62
New York City,Kings,7002053,001304,NYU Langone Hospital-Brooklyn,30 to 49,112,F,Other Race,Not Span/Hispanic,5,Emergency,Home or Self Care,2019,MUS024,SYSTEMIC LUPUS ERYTHEMATOSUS AND CONNECTIVE TISSUE DISORDERS,GIS001,ESOPHAGOGASTRODUODENOSCOPY (EGD) WITH BIOPSY,346,CONNECTIVE TISSUE DISORDERS,08,DISEASES AND DISORDERS OF THE MUSCULOSKELETAL SYSTEM AND CONNECTIVE TISSUE,2,Moderate,Minor,Medical,Medicaid,,,,,true,94364.42,22163.44
New York City,Kings,7002053,001304,NYU Langone Hospital-Brooklyn,70 or Older,112,M,Other Race,Spanish/Hispanic,5,Emergency,Skilled Nursing Home,2019,MUS003,RHEUMATOID ARTHRITIS AND RELATED DISEASE,MST001,ARTHROCENTESIS,346,CONNECTIVE TISSUE DISORDERS,08,DISEASES AND DISORDERS OF THE MUSCULOSKELETAL SYSTEM AND CONNECTIVE TISSUE,2,Moderate,Major,Medical,Medicare,,,,,true,107656.38,25674.86
New York City,Kings,7002053,001304,NYU Langone Hospital-Brooklyn,70 or Older,112,F,White,Not Span/Hispanic,19,Emergency,Home or Self Care,2019,MUS024,SYSTEMIC LUPUS ERYTHEMATOSUS AND CONNECTIVE TISSUE DISORDERS,,,346,CONNECTIVE TISSUE DISORDERS,08,DISEASES AND DISORDERS OF THE MUSCULOSKELETAL SYSTEM AND CONNECTIVE TISSUE,3,Major,Moderate,Medical,Medicare,Private Health Insurance,,,,true,184498.99,66265.98
New York City,Kings,7002053,001304,NYU Langone Hospital-Brooklyn,18 to 29,112,F,Other Race,Not Span/Hispanic,5,Emergency,Home or Self Care,2019,MUS024,SYSTEMIC LUPUS ERYTHEMATOSUS AND CONNECTIVE TISSUE DISORDERS,,,346,CONNECTIVE TISSUE DISORDERS,08,DISEASES AND DISORDERS OF THE MUSCULOSKELETAL SYSTEM AND CONNECTIVE TISSUE,3,Major,Major,Medical,Private Health Insurance,,,,,true,85407.23,32280.94
New York City,Kings,7002053,001304,NYU Langone Hospital-Brooklyn,18 to 29,112,M,Other Race,Not Span/Hispanic,1,Emergency,Home or Self Care,2019,MUS036,AUTOINFLAMMATORY SYNDROMES,ADM021,"ADMINISTRATION OF THERAPEUTIC SUBSTANCES, NEC",346,CONNECTIVE TISSUE DISORDERS,08,DISEASES AND DISORDERS OF THE MUSCULOSKELETAL SYSTEM AND CONNECTIVE TISSUE,2,Moderate,Minor,Medical,Self-Pay,,,,,true,39736.41,11994.96
New York City,Kings,7002053,001304,NYU Langone Hospital-Brooklyn,30 to 49,112,F,Black/African American,Not Span/Hispanic,5,Emergency,Home w/ Home Health Services,2019,MUS024,SYSTEMIC LUPUS ERYTHEMATOSUS AND CONNECTIVE TISSUE DISORDERS,ESA001,HEMODIALYSIS,346,CONNECTIVE TISSUE DISORDERS,08,DISEASES AND DISORDERS OF THE MUSCULOSKELETAL SYSTEM AND CONNECTIVE TISSUE,4,Extreme,Major,Medical,Medicare,Medicaid,,,,true,74408.22,22883.83
New York City,Kings,7002053,001304,NYU Langone Hospital-Brooklyn,30 to 49,112,F,Other Race,Unknown,3,Emergency,Home or Self Care,2019,MUS024,SYSTEMIC LUPUS ERYTHEMATOSUS AND CONNECTIVE TISSUE DISORDERS,,,346,CONNECTIVE TISSUE DISORDERS,08,DISEASES AND DISORDERS OF THE MUSCULOSKELETAL SYSTEM AND CONNECTIVE TISSUE,2,Moderate,Minor,Medical,Private Health Insurance,,,,,true,38978.87,12712.76
New York City,Kings,7002053,001304,NYU Langone Hospital-Brooklyn,18 to 29,112,F,Other Race,Not Span/Hispanic,7,Emergency,Inpatient Rehabilitation Facility,2019,MUS024,SYSTEMIC LUPUS ERYTHEMATOSUS AND CONNECTIVE TISSUE DISORDERS,,,346,CONNECTIVE TISSUE DISORDERS,08,DISEASES AND DISORDERS OF THE MUSCULOSKELETAL SYSTEM AND CONNECTIVE TISSUE,2,Moderate,Minor,Medical,Medicaid,,,,,true,81280.37,27337.91
New York City,Kings,7002053,001304,NYU Langone Hospital-Brooklyn,18 to 29,112,F,White,Not Span/Hispanic,2,Emergency,Home or Self Care,2019,MUS024,SYSTEMIC LUPUS ERYTHEMATOSUS AND CONNECTIVE TISSUE DISORDERS,ADM021,"ADMINISTRATION OF THERAPEUTIC SUBSTANCES, NEC",346,CONNECTIVE TISSUE DISORDERS,08,DISEASES AND DISORDERS OF THE MUSCULOSKELETAL SYSTEM AND CONNECTIVE TISSUE,1,Minor,Minor,Medical,Private Health Insurance,,,,,true,24405.85,8070.88
New York City,Kings,7002053,001304,NYU Langone Hospital-Brooklyn,18 to 29,112,F,Other Race,Spanish/Hispanic,1,Emergency,Home or Self Care,2019,MUS024,SYSTEMIC LUPUS ERYTHEMATOSUS AND CONNECTIVE TISSUE DISORDERS,,,346,CONNECTIVE TISSUE DISORDERS,08,DISEASES AND DISORDERS OF THE MUSCULOSKELETAL SYSTEM AND CONNECTIVE TISSUE,2,Moderate,Minor,Medical,Medicaid,,,,,true,29037.13,6467.98
New York City,Kings,7002053,001304,NYU Langone Hospital-Brooklyn,18 to 29,112,F,Other Race,Not Span/Hispanic,9,Elective,Home or Self Care,2019,MUS024,SYSTEMIC LUPUS ERYTHEMATOSUS AND CONNECTIVE TISSUE DISORDERS,RHB002,"PHYSICAL, OCCUPATIONAL, AND RESPIRATORY THERAPY TREATMENT",346,CONNECTIVE TISSUE DISORDERS,08,DISEASES AND DISORDERS OF THE MUSCULOSKELETAL SYSTEM AND CONNECTIVE TISSUE,3,Major,Moderate,Medical,Medicaid,,,,,false,83142.96,28113.81
New York City,Kings,7002053,001304,NYU Langone Hospital-Brooklyn,30 to 49,112,F,Other Race,Not Span/Hispanic,2,Emergency,Home or Self Care,2019,MUS024,SYSTEMIC LUPUS ERYTHEMATOSUS AND CONNECTIVE TISSUE DISORDERS,,,346,CONNECTIVE TISSUE DISORDERS,08,DISEASES AND DISORDERS OF THE MUSCULOSKELETAL SYSTEM AND CONNECTIVE TISSUE,3,Major,Major,Medical,Blue Cross/Blue Shield,,,,,true,44106.85,10651.52
New York City,Kings,7002053,001304,NYU Langone Hospital-Brooklyn,50 to 69,112,F,White,Not Span/Hispanic,2,Emergency,Home or Self Care,2019,MUS024,SYSTEMIC LUPUS ERYTHEMATOSUS AND CONNECTIVE TISSUE DISORDERS,CAR021,"ARTERY, VEIN, AND GREAT VESSEL PROCEDURES, NEC",346,CONNECTIVE TISSUE DISORDERS,08,DISEASES AND DISORDERS OF THE MUSCULOSKELETAL SYSTEM AND CONNECTIVE TISSUE,1,Minor,Minor,Medical,Blue Cross/Blue Shield,,,,,true,77932.67,17624.3
New York City,Kings,7002053,001304,NYU Langone Hospital-Brooklyn,30 to 49,112,M,Black/African American,Spanish/Hispanic,7,Emergency,Home or Self Care,2019,MUS024,SYSTEMIC LUPUS ERYTHEMATOSUS AND CONNECTIVE TISSUE DISORDERS,ESA001,HEMODIALYSIS,346,CONNECTIVE TISSUE DISORDERS,08,DISEASES AND DISORDERS OF THE MUSCULOSKELETAL SYSTEM AND CONNECTIVE TISSUE,4,Extreme,Major,Medical,Medicare,Private Health Insurance,,,,true,159160.4,34221.33
New York City,Kings,7002053,001304,NYU Langone Hospital-Brooklyn,0 to 17,103,F,White,Not Span/Hispanic,3,Emergency,Home or Self Care,2019,MUS024,SYSTEMIC LUPUS ERYTHEMATOSUS AND CONNECTIVE TISSUE DISORDERS,ADM010,VACCINATIONS,346,CONNECTIVE TISSUE DISORDERS,08,DISEASES AND DISORDERS OF THE MUSCULOSKELETAL SYSTEM AND CONNECTIVE TISSUE,1,Minor,Minor,Medical,Blue Cross/Blue Shield,,,,,true,48542.95,9599.46
New York City,Kings,7002053,001304,NYU Langone Hospital-Brooklyn,50 to 69,112,F,Black/African American,Not Span/Hispanic,6,Emergency,Home w/ Home Health Services,2019,MUS024,SYSTEMIC LUPUS ERYTHEMATOSUS AND CONNECTIVE TISSUE DISORDERS,,,346,CONNECTIVE TISSUE DISORDERS,08,DISEASES AND DISORDERS OF THE MUSCULOSKELETAL SYSTEM AND CONNECTIVE TISSUE,3,Major,Moderate,Medical,Medicare,Blue Cross/Blue Shield,,,,true,60343.91,20432.6
New York City,Kings,7002053,001304,NYU Langone Hospital-Brooklyn,30 to 49,112,F,Other Race,Spanish/Hispanic,4,Emergency,Home or Self Care,2019,MUS024,SYSTEMIC LUPUS ERYTHEMATOSUS AND CONNECTIVE TISSUE DISORDERS,GIS004,GI SYSTEM ENDOSCOPY WITHOUT BIOPSY (DIAGNOSTIC),346,CONNECTIVE TISSUE DISORDERS,08,DISEASES AND DISORDERS OF THE MUSCULOSKELETAL SYSTEM AND CONNECTIVE TISSUE,3,Major,Major,Medical,Medicaid,,,,,true,88701.32,21394.57
New York City,Kings,7002053,001304,NYU Langone Hospital-Brooklyn,30 to 49,112,M,Other Race,Spanish/Hispanic,5,Emergency,Home or Self Care,2019,MUS024,SYSTEMIC LUPUS ERYTHEMATOSUS AND CONNECTIVE TISSUE DISORDERS,MST003,"SUBCUTANEOUS TISSUE, FASCIA, AND MUSCLE BIOPSY",346,CONNECTIVE TISSUE DISORDERS,08,DISEASES AND DISORDERS OF THE MUSCULOSKELETAL SYSTEM AND CONNECTIVE TISSUE,1,Minor,Minor,Medical,Medicaid,,,,,true,97789.51,23386.03
New York City,Kings,7002053,001304,NYU Langone Hospital-Brooklyn,70 or Older,112,F,White,Not Span/Hispanic,19,Emergency,Home w/ Home Health Services,2019,CIR032,OTHER SPECIFIED AND UNSPECIFIED CIRCULATORY DISEASE,CAR025,PLACEMENT OF TUNNELED OR IMPLANTABLE PORTION OF A VASCULAR ACCESS DEVICE,346,CONNECTIVE TISSUE DISORDERS,08,DISEASES AND DISORDERS OF THE MUSCULOSKELETAL SYSTEM AND CONNECTIVE TISSUE,3,Major,Major,Medical,Medicare,Private Health Insurance,,,,true,312063.09,80625.87
New York City,Kings,7002053,001304,NYU Langone Hospital-Brooklyn,70 or Older,112,F,White,Spanish/Hispanic,18,Emergency,Inpatient Rehabilitation Facility,2019,MUS024,SYSTEMIC LUPUS ERYTHEMATOSUS AND CONNECTIVE TISSUE DISORDERS,ADM016,ADMINISTRATION OF ANTI-INFLAMMATORY AGENTS,346,CONNECTIVE TISSUE DISORDERS,08,DISEASES AND DISORDERS OF THE MUSCULOSKELETAL SYSTEM AND CONNECTIVE TISSUE,3,Major,Extreme,Medical,Medicare,Medicaid,,,,true,357027.54,68538.9
New York City,Kings,7002053,001304,NYU Langone Hospital-Brooklyn,50 to 69,112,M,Black/African American,Not Span/Hispanic,11,Emergency,Home w/ Home Health Services,2019,MUS024,SYSTEMIC LUPUS ERYTHEMATOSUS AND CONNECTIVE TISSUE DISORDERS,IMG007,COMPUTERIZED TOMOGRAPHY (CT) WITHOUT CONTRAST,346,CONNECTIVE TISSUE DISORDERS,08,DISEASES AND DISORDERS OF THE MUSCULOSKELETAL SYSTEM AND CONNECTIVE TISSUE,3,Major,Major,Medical,Medicare,Medicaid,,,,true,155081.18,39149.96
New York City,Kings,7002053,001304,NYU Langone Hospital-Brooklyn,70 or Older,112,M,Multi-racial,Not Span/Hispanic,8,Elective,Home w/ Home Health Services,2019,MUS024,SYSTEMIC LUPUS ERYTHEMATOSUS AND CONNECTIVE TISSUE DISORDERS,RHB002,"PHYSICAL, OCCUPATIONAL, AND RESPIRATORY THERAPY TREATMENT",346,CONNECTIVE TISSUE DISORDERS,08,DISEASES AND DISORDERS OF THE MUSCULOSKELETAL SYSTEM AND CONNECTIVE TISSUE,2,Moderate,Moderate,Medical,Medicare,Medicaid,,,,false,102780.09,24900.56
New York City,Kings,7002053,001304,NYU Langone Hospital-Brooklyn,70 or Older,112,F,White,Spanish/Hispanic,5,Emergency,Home w/ Home Health Services,2019,MUS024,SYSTEMIC LUPUS ERYTHEMATOSUS AND CONNECTIVE TISSUE DISORDERS,,,346,CONNECTIVE TISSUE DISORDERS,08,DISEASES AND DISORDERS OF THE MUSCULOSKELETAL SYSTEM AND CONNECTIVE TISSUE,3,Major,Moderate,Medical,Medicare,,,,,true,100672.52,20658.23
New York City,Kings,7002053,001304,NYU Langone Hospital-Brooklyn,18 to 29,112,F,Other Race,Not Span/Hispanic,1,Emergency,Home or Self Care,2019,MUS024,SYSTEMIC LUPUS ERYTHEMATOSUS AND CONNECTIVE TISSUE DISORDERS,,,346,CONNECTIVE TISSUE DISORDERS,08,DISEASES AND DISORDERS OF THE MUSCULOSKELETAL SYSTEM AND CONNECTIVE TISSUE,2,Moderate,Minor,Medical,Medicaid,,,,,true,21308.74,5339.93