Hospital Service Area,Hospital County,Operating Certificate Number,Permanent Facility Id,Facility Name,Age Group,Zip Code - 3 digits,Gender,Race,Ethnicity,Length of Stay,Type of Admission,Patient Disposition,Discharge Year,CCS Diagnosis Code,CCS Diagnosis Description,CCS Procedure Code,CCS Procedure Description,APR DRG Code,APR DRG Description,APR MDC Code,APR MDC Description,APR Severity of Illness Code,APR Severity of Illness Description,APR Risk of Mortality,APR Medical Surgical Description,Payment Typology 1,Payment Typology 2,Payment Typology 3,Birth Weight,Abortion Edit Indicator,Emergency Department Indicator,Total Charges,Total Costs
Long Island,Nassau,2908000,000511,NYU Winthrop Hospital,70 or Older,110,M,White,Not Span/Hispanic,12,Emergency,Skilled Nursing Home,2017,231,Other fractures,000,NO PROC,347,"Other back & neck disorders, fractures & injuries",08,Diseases and Disorders of the Musculoskeletal System and Conn Tissue,4,Extreme,Major,Medical,Medicare,Medicare,,,N,Y,172491.36,40576.41
Long Island,Nassau,2908000,000511,NYU Winthrop Hospital,70 or Older,115,F,White,Not Span/Hispanic,19,Emergency,Home w/ Home Health Services,2017,205,Spondylosis; intervertebral disc disorders; other back problems,095,OT NON-OR LW GI THER PR,347,"Other back & neck disorders, fractures & injuries",08,Diseases and Disorders of the Musculoskeletal System and Conn Tissue,2,Moderate,Moderate,Medical,Medicare,Medicare,,,N,Y,155509.74,30706.08
Long Island,Nassau,2908000,000511,NYU Winthrop Hospital,70 or Older,115,M,White,Not Span/Hispanic,3,Emergency,Hospice - Home,2017,231,Other fractures,000,NO PROC,347,"Other back & neck disorders, fractures & injuries",08,Diseases and Disorders of the Musculoskeletal System and Conn Tissue,3,Major,Major,Medical,Medicare,Medicare,Blue Cross/Blue Shield,,N,Y,53186.85,12196.02
Long Island,Nassau,2908000,000511,NYU Winthrop Hospital,30 to 49,115,F,White,Not Span/Hispanic,3,Emergency,Home w/ Home Health Services,2017,231,Other fractures,000,NO PROC,347,"Other back & neck disorders, fractures & injuries",08,Diseases and Disorders of the Musculoskeletal System and Conn Tissue,2,Moderate,Minor,Medical,Blue Cross/Blue Shield,,,,N,Y,64311.32,13455.43
Long Island,Nassau,2908000,000511,NYU Winthrop Hospital,70 or Older,115,M,Black/African American,Not Span/Hispanic,1,Emergency,Home w/ Home Health Services,2017,205,Spondylosis; intervertebral disc disorders; other back problems,000,NO PROC,347,"Other back & neck disorders, fractures & injuries",08,Diseases and Disorders of the Musculoskeletal System and Conn Tissue,2,Moderate,Minor,Medical,Medicare,Medicare,Private Health Insurance,,N,Y,27289.96,4466.88
Long Island,Nassau,2908000,000511,NYU Winthrop Hospital,70 or Older,115,F,White,Not Span/Hispanic,3,Emergency,Home w/ Home Health Services,2017,205,Spondylosis; intervertebral disc disorders; other back problems,000,NO PROC,347,"Other back & neck disorders, fractures & injuries",08,Diseases and Disorders of the Musculoskeletal System and Conn Tissue,3,Major,Major,Medical,Medicare,Medicare,Private Health Insurance,,N,Y,34994.63,5928.82
Long Island,Nassau,2908000,000511,NYU Winthrop Hospital,70 or Older,115,F,White,Not Span/Hispanic,1,Emergency,Home w/ Home Health Services,2017,231,Other fractures,214,"TRACTN, SPLNT, OT WOUND",347,"Other back & neck disorders, fractures & injuries",08,Diseases and Disorders of the Musculoskeletal System and Conn Tissue,2,Moderate,Minor,Medical,Medicare,Medicare,Private Health Insurance,,N,Y,63258.46,9018.81
Long Island,Nassau,2908000,000511,NYU Winthrop Hospital,70 or Older,115,F,White,Not Span/Hispanic,3,Emergency,Inpatient Rehabilitation Facility,2017,205,Spondylosis; intervertebral disc disorders; other back problems,000,NO PROC,347,"Other back & neck disorders, fractures & injuries",08,Diseases and Disorders of the Musculoskeletal System and Conn Tissue,2,Moderate,Moderate,Medical,Medicare,Medicare,Private Health Insurance,,N,Y,40511.48,7491.17
Long Island,Nassau,2908000,000511,NYU Winthrop Hospital,70 or Older,115,M,Black/African American,Not Span/Hispanic,11,Emergency,Home w/ Home Health Services,2017,205,Spondylosis; intervertebral disc disorders; other back problems,000,NO PROC,347,"Other back & neck disorders, fractures & injuries",08,Diseases and Disorders of the Musculoskeletal System and Conn Tissue,3,Major,Moderate,Medical,Medicare,Medicare,Medicaid,,N,Y,60415.90,15013.61
Long Island,Nassau,2908000,000511,NYU Winthrop Hospital,50 to 69,110,F,White,Not Span/Hispanic,7,Emergency,Home w/ Home Health Services,2017,205,Spondylosis; intervertebral disc disorders; other back problems,000,NO PROC,347,"Other back & neck disorders, fractures & injuries",08,Diseases and Disorders of the Musculoskeletal System and Conn Tissue,3,Major,Minor,Medical,Medicare,Medicare,Private Health Insurance,,N,Y,131443.22,27346.22
Long Island,Nassau,2908000,000511,NYU Winthrop Hospital,0 to 17,115,M,White,Not Span/Hispanic,1,Emergency,Home or Self Care,2017,231,Other fractures,214,"TRACTN, SPLNT, OT WOUND",347,"Other back & neck disorders, fractures & injuries",08,Diseases and Disorders of the Musculoskeletal System and Conn Tissue,1,Minor,Minor,Medical,Blue Cross/Blue Shield,,,,N,Y,44582.64,4104.29
Long Island,Nassau,2908000,000511,NYU Winthrop Hospital,70 or Older,115,F,White,Not Span/Hispanic,6,Emergency,Home w/ Home Health Services,2017,205,Spondylosis; intervertebral disc disorders; other back problems,098,OT NON-OR GI THER PRCS,347,"Other back & neck disorders, fractures & injuries",08,Diseases and Disorders of the Musculoskeletal System and Conn Tissue,3,Major,Moderate,Medical,Medicare,Medicare,Private Health Insurance,,N,Y,121865.55,24683.58
Long Island,Nassau,2908000,000511,NYU Winthrop Hospital,50 to 69,115,F,Black/African American,Not Span/Hispanic,1,Urgent,Home or Self Care,2017,205,Spondylosis; intervertebral disc disorders; other back problems,000,NO PROC,347,"Other back & neck disorders, fractures & injuries",08,Diseases and Disorders of the Musculoskeletal System and Conn Tissue,1,Minor,Minor,Medical,Private Health Insurance,,,,N,Y,23451.20,5149.93
Long Island,Nassau,2908000,000511,NYU Winthrop Hospital,70 or Older,117,F,White,Not Span/Hispanic,9,Emergency,Home w/ Home Health Services,2017,205,Spondylosis; intervertebral disc disorders; other back problems,155,ARTHROCENTESIS,347,"Other back & neck disorders, fractures & injuries",08,Diseases and Disorders of the Musculoskeletal System and Conn Tissue,3,Major,Major,Medical,Medicare,Medicare,Private Health Insurance,,N,Y,87582.56,16874.96
Long Island,Nassau,2908000,000511,NYU Winthrop Hospital,50 to 69,115,F,White,Not Span/Hispanic,4,Emergency,Home or Self Care,2017,205,Spondylosis; intervertebral disc disorders; other back problems,000,NO PROC,347,"Other back & neck disorders, fractures & injuries",08,Diseases and Disorders of the Musculoskeletal System and Conn Tissue,2,Moderate,Minor,Medical,Blue Cross/Blue Shield,,,,N,Y,56474.31,9840.12
Long Island,Nassau,2908000,000511,NYU Winthrop Hospital,50 to 69,115,F,White,Not Span/Hispanic,3,Emergency,Home or Self Care,2017,205,Spondylosis; intervertebral disc disorders; other back problems,005,INS CATHETER/SPNL STIM,347,"Other back & neck disorders, fractures & injuries",08,Diseases and Disorders of the Musculoskeletal System and Conn Tissue,1,Minor,Minor,Medical,Blue Cross/Blue Shield,,,,N,Y,35341.25,8809.13
Long Island,Nassau,2908000,000511,NYU Winthrop Hospital,70 or Older,115,M,White,Not Span/Hispanic,4,Emergency,Skilled Nursing Home,2017,205,Spondylosis; intervertebral disc disorders; other back problems,000,NO PROC,347,"Other back & neck disorders, fractures & injuries",08,Diseases and Disorders of the Musculoskeletal System and Conn Tissue,1,Minor,Moderate,Medical,Medicare,Medicare,Private Health Insurance,,N,Y,33501.55,6322.18
Long Island,Nassau,2908000,000511,NYU Winthrop Hospital,50 to 69,117,M,White,Not Span/Hispanic,3,Emergency,Home or Self Care,2017,205,Spondylosis; intervertebral disc disorders; other back problems,005,INS CATHETER/SPNL STIM,347,"Other back & neck disorders, fractures & injuries",08,Diseases and Disorders of the Musculoskeletal System and Conn Tissue,1,Minor,Minor,Medical,Miscellaneous/Other,,,,N,Y,50745.48,13334.85
Long Island,Nassau,2908000,000511,NYU Winthrop Hospital,50 to 69,112,M,Black/African American,Not Span/Hispanic,2,Elective,Home or Self Care,2017,205,Spondylosis; intervertebral disc disorders; other back problems,000,NO PROC,347,"Other back & neck disorders, fractures & injuries",08,Diseases and Disorders of the Musculoskeletal System and Conn Tissue,1,Minor,Minor,Medical,Medicaid,Medicaid,,,N,N,29515.28,7457.77
Long Island,Nassau,2908000,000511,NYU Winthrop Hospital,50 to 69,113,M,White,Not Span/Hispanic,1,Elective,Home or Self Care,2017,205,Spondylosis; intervertebral disc disorders; other back problems,000,NO PROC,347,"Other back & neck disorders, fractures & injuries",08,Diseases and Disorders of the Musculoskeletal System and Conn Tissue,1,Minor,Minor,Medical,Medicare,Medicare,Private Health Insurance,,N,N,36765.81,10549.98
Long Island,Nassau,2908000,000511,NYU Winthrop Hospital,70 or Older,115,F,Black/African American,Not Span/Hispanic,5,Emergency,Home w/ Home Health Services,2017,205,Spondylosis; intervertebral disc disorders; other back problems,000,NO PROC,347,"Other back & neck disorders, fractures & injuries",08,Diseases and Disorders of the Musculoskeletal System and Conn Tissue,2,Moderate,Major,Medical,Medicare,Medicare,Self-Pay,,N,Y,53689.10,8893.65
Long Island,Nassau,2908000,000511,NYU Winthrop Hospital,70 or Older,110,F,White,Not Span/Hispanic,4,Emergency,Home w/ Home Health Services,2017,205,Spondylosis; intervertebral disc disorders; other back problems,070,UP GASTRO ENDOSC/BIOPSY,347,"Other back & neck disorders, fractures & injuries",08,Diseases and Disorders of the Musculoskeletal System and Conn Tissue,1,Minor,Moderate,Medical,Medicare,Medicare,,,N,Y,76476.78,11675.03
Long Island,Nassau,2908000,000511,NYU Winthrop Hospital,70 or Older,115,M,White,Not Span/Hispanic,8,Emergency,Home w/ Home Health Services,2017,231,Other fractures,222,BLOOD TRANSFUSION,347,"Other back & neck disorders, fractures & injuries",08,Diseases and Disorders of the Musculoskeletal System and Conn Tissue,3,Major,Major,Medical,Medicare,Medicare,Private Health Insurance,,N,Y,84832.44,16049.37
Long Island,Nassau,2908000,000511,NYU Winthrop Hospital,70 or Older,115,F,White,Not Span/Hispanic,4,Emergency,Home or Self Care,2017,231,Other fractures,000,NO PROC,347,"Other back & neck disorders, fractures & injuries",08,Diseases and Disorders of the Musculoskeletal System and Conn Tissue,2,Moderate,Moderate,Medical,Medicare,Medicare,,,N,Y,75249.49,16568.12
Long Island,Nassau,2908000,000511,NYU Winthrop Hospital,50 to 69,110,M,White,Not Span/Hispanic,1,Emergency,Left Against Medical Advice,2017,205,Spondylosis; intervertebral disc disorders; other back problems,000,NO PROC,347,"Other back & neck disorders, fractures & injuries",08,Diseases and Disorders of the Musculoskeletal System and Conn Tissue,1,Minor,Minor,Medical,Medicare,Medicare,,,N,Y,31806.87,3408.42
Long Island,Nassau,2908000,000511,NYU Winthrop Hospital,70 or Older,113,M,White,Not Span/Hispanic,2,Emergency,Home w/ Home Health Services,2017,231,Other fractures,037,DX BRONCHOSCOPY & BIOPS,347,"Other back & neck disorders, fractures & injuries",08,Diseases and Disorders of the Musculoskeletal System and Conn Tissue,3,Major,Moderate,Medical,Medicare,Medicare,Blue Cross/Blue Shield,,N,Y,54379.96,10064.29
Long Island,Nassau,2908000,000511,NYU Winthrop Hospital,70 or Older,115,M,White,Not Span/Hispanic,4,Emergency,Home w/ Home Health Services,2017,231,Other fractures,000,NO PROC,347,"Other back & neck disorders, fractures & injuries",08,Diseases and Disorders of the Musculoskeletal System and Conn Tissue,2,Moderate,Major,Medical,Medicare,Medicare,Blue Cross/Blue Shield,,N,Y,78577.67,20701.47
Long Island,Nassau,2908000,000511,NYU Winthrop Hospital,70 or Older,115,F,White,Not Span/Hispanic,9,Emergency,Expired,2017,231,Other fractures,000,NO PROC,347,"Other back & neck disorders, fractures & injuries",08,Diseases and Disorders of the Musculoskeletal System and Conn Tissue,3,Major,Major,Medical,Private Health Insurance,,,,N,Y,95686.63,17749.23
Long Island,Nassau,2908000,000511,NYU Winthrop Hospital,70 or Older,119,F,White,Not Span/Hispanic,5,Emergency,Inpatient Rehabilitation Facility,2017,231,Other fractures,222,BLOOD TRANSFUSION,347,"Other back & neck disorders, fractures & injuries",08,Diseases and Disorders of the Musculoskeletal System and Conn Tissue,3,Major,Moderate,Medical,Medicare,Medicare,Blue Cross/Blue Shield,,N,Y,53881.48,9890.20
Long Island,Nassau,2908000,000511,NYU Winthrop Hospital,50 to 69,117,F,White,Not Span/Hispanic,3,Emergency,Home w/ Home Health Services,2017,231,Other fractures,000,NO PROC,347,"Other back & neck disorders, fractures & injuries",08,Diseases and Disorders of the Musculoskeletal System and Conn Tissue,2,Moderate,Moderate,Medical,Private Health Insurance,,,,N,Y,26305.75,5769.85
Long Island,Nassau,2908000,000511,NYU Winthrop Hospital,30 to 49,115,M,Black/African American,Not Span/Hispanic,10,Emergency,Home or Self Care,2017,205,Spondylosis; intervertebral disc disorders; other back problems,156,"INJ/ASP MUSC,TENDONS,ST",347,"Other back & neck disorders, fractures & injuries",08,Diseases and Disorders of the Musculoskeletal System and Conn Tissue,3,Major,Major,Medical,Medicaid,,,,N,Y,75177.21,18275.96
Long Island,Nassau,2908000,000511,NYU Winthrop Hospital,70 or Older,115,F,White,Not Span/Hispanic,3,Emergency,Skilled Nursing Home,2017,231,Other fractures,000,NO PROC,347,"Other back & neck disorders, fractures & injuries",08,Diseases and Disorders of the Musculoskeletal System and Conn Tissue,2,Moderate,Moderate,Medical,Medicare,Medicare,Private Health Insurance,,N,Y,16309.89,4334.08
Long Island,Nassau,2908000,000511,NYU Winthrop Hospital,70 or Older,113,F,White,Not Span/Hispanic,2,Emergency,Home or Self Care,2017,205,Spondylosis; intervertebral disc disorders; other back problems,000,NO PROC,347,"Other back & neck disorders, fractures & injuries",08,Diseases and Disorders of the Musculoskeletal System and Conn Tissue,1,Minor,Moderate,Medical,Medicare,Medicare,,,N,Y,49335.72,9698.42
Long Island,Nassau,2908000,000511,NYU Winthrop Hospital,70 or Older,115,F,White,Not Span/Hispanic,12,Emergency,Inpatient Rehabilitation Facility,2017,205,Spondylosis; intervertebral disc disorders; other back problems,181,MYELOGRAM,347,"Other back & neck disorders, fractures & injuries",08,Diseases and Disorders of the Musculoskeletal System and Conn Tissue,2,Moderate,Major,Medical,Medicare,Medicare,Private Health Insurance,,N,Y,84503.52,20740.84
Long Island,Nassau,2908000,000511,NYU Winthrop Hospital,70 or Older,115,M,White,Not Span/Hispanic,10,Emergency,Skilled Nursing Home,2017,205,Spondylosis; intervertebral disc disorders; other back problems,175,OT OR THER PRC SKN/BRST,347,"Other back & neck disorders, fractures & injuries",08,Diseases and Disorders of the Musculoskeletal System and Conn Tissue,3,Major,Major,Medical,Medicare,Medicare,Private Health Insurance,,N,Y,144946.76,28781.20
Long Island,Nassau,2908000,000511,NYU Winthrop Hospital,30 to 49,115,M,White,Not Span/Hispanic,1,Emergency,Home or Self Care,2017,205,Spondylosis; intervertebral disc disorders; other back problems,000,NO PROC,347,"Other back & neck disorders, fractures & injuries",08,Diseases and Disorders of the Musculoskeletal System and Conn Tissue,1,Minor,Minor,Medical,Medicaid,Medicaid,,,N,Y,9799.08,2263.73
Long Island,Nassau,2908000,000511,NYU Winthrop Hospital,70 or Older,118,M,White,Not Span/Hispanic,5,Emergency,Skilled Nursing Home,2017,231,Other fractures,000,NO PROC,347,"Other back & neck disorders, fractures & injuries",08,Diseases and Disorders of the Musculoskeletal System and Conn Tissue,3,Major,Major,Medical,Medicare,Medicare,Private Health Insurance,,N,Y,106300.53,19443.50
Long Island,Nassau,2908000,000511,NYU Winthrop Hospital,50 to 69,115,F,White,Spanish/Hispanic,2,Emergency,Home or Self Care,2017,205,Spondylosis; intervertebral disc disorders; other back problems,005,INS CATHETER/SPNL STIM,347,"Other back & neck disorders, fractures & injuries",08,Diseases and Disorders of the Musculoskeletal System and Conn Tissue,1,Minor,Minor,Medical,Private Health Insurance,,,,N,Y,46311.45,7945.51
Long Island,Nassau,2908000,000511,NYU Winthrop Hospital,30 to 49,115,M,White,Not Span/Hispanic,1,Emergency,Home or Self Care,2017,205,Spondylosis; intervertebral disc disorders; other back problems,000,NO PROC,347,"Other back & neck disorders, fractures & injuries",08,Diseases and Disorders of the Musculoskeletal System and Conn Tissue,1,Minor,Minor,Medical,Miscellaneous/Other,Blue Cross/Blue Shield,,,N,Y,51660.02,5536.46
Long Island,Nassau,2908000,000511,NYU Winthrop Hospital,50 to 69,115,F,White,Spanish/Hispanic,3,Emergency,Home or Self Care,2017,205,Spondylosis; intervertebral disc disorders; other back problems,000,NO PROC,347,"Other back & neck disorders, fractures & injuries",08,Diseases and Disorders of the Musculoskeletal System and Conn Tissue,1,Minor,Minor,Medical,Private Health Insurance,,,,N,Y,17717.65,4525.55
Long Island,Nassau,2908000,000511,NYU Winthrop Hospital,50 to 69,115,M,White,Not Span/Hispanic,21,Emergency,Home w/ Home Health Services,2017,207,Pathological fracture,031,DX PRCS ON NOSE & MOUTH,347,"Other back & neck disorders, fractures & injuries",08,Diseases and Disorders of the Musculoskeletal System and Conn Tissue,2,Moderate,Major,Medical,Medicare,Medicare,Medicaid,,N,Y,297831.93,69395.95
Long Island,Nassau,2908000,000511,NYU Winthrop Hospital,50 to 69,113,M,White,Not Span/Hispanic,4,Emergency,Home or Self Care,2017,205,Spondylosis; intervertebral disc disorders; other back problems,005,INS CATHETER/SPNL STIM,347,"Other back & neck disorders, fractures & injuries",08,Diseases and Disorders of the Musculoskeletal System and Conn Tissue,1,Minor,Minor,Medical,Blue Cross/Blue Shield,Blue Cross/Blue Shield,,,N,Y,47991.68,11409.66
Long Island,Nassau,2908000,000511,NYU Winthrop Hospital,50 to 69,115,M,White,Not Span/Hispanic,2,Emergency,Home or Self Care,2017,205,Spondylosis; intervertebral disc disorders; other back problems,005,INS CATHETER/SPNL STIM,347,"Other back & neck disorders, fractures & injuries",08,Diseases and Disorders of the Musculoskeletal System and Conn Tissue,1,Minor,Minor,Medical,Miscellaneous/Other,Blue Cross/Blue Shield,,,N,Y,38824.35,9049.41
Long Island,Nassau,2908000,000511,NYU Winthrop Hospital,70 or Older,110,F,White,Not Span/Hispanic,5,Emergency,Inpatient Rehabilitation Facility,2017,231,Other fractures,000,NO PROC,347,"Other back & neck disorders, fractures & injuries",08,Diseases and Disorders of the Musculoskeletal System and Conn Tissue,1,Minor,Minor,Medical,Medicare,Medicare,,,N,Y,35158.77,7600.70
Long Island,Nassau,2908000,000511,NYU Winthrop Hospital,70 or Older,117,F,White,Not Span/Hispanic,4,Emergency,Skilled Nursing Home,2017,207,Pathological fracture,000,NO PROC,347,"Other back & neck disorders, fractures & injuries",08,Diseases and Disorders of the Musculoskeletal System and Conn Tissue,2,Moderate,Minor,Medical,Medicare,Medicare,Private Health Insurance,,N,Y,68448.20,11036.76
Long Island,Nassau,2908000,000511,NYU Winthrop Hospital,70 or Older,115,M,White,Not Span/Hispanic,3,Emergency,Home w/ Home Health Services,2017,231,Other fractures,000,NO PROC,347,"Other back & neck disorders, fractures & injuries",08,Diseases and Disorders of the Musculoskeletal System and Conn Tissue,1,Minor,Moderate,Medical,Medicare,Medicare,Blue Cross/Blue Shield,,N,Y,45530.83,8565.26
Long Island,Nassau,2908000,000511,NYU Winthrop Hospital,50 to 69,117,M,White,Not Span/Hispanic,1,Emergency,Home or Self Care,2017,231,Other fractures,000,NO PROC,347,"Other back & neck disorders, fractures & injuries",08,Diseases and Disorders of the Musculoskeletal System and Conn Tissue,2,Moderate,Minor,Medical,Blue Cross/Blue Shield,Medicare,,,N,Y,19064.48,3074.73
Long Island,Nassau,2908000,000511,NYU Winthrop Hospital,70 or Older,117,F,White,Not Span/Hispanic,2,Emergency,Home or Self Care,2017,205,Spondylosis; intervertebral disc disorders; other back problems,000,NO PROC,347,"Other back & neck disorders, fractures & injuries",08,Diseases and Disorders of the Musculoskeletal System and Conn Tissue,1,Minor,Minor,Medical,Medicare,Medicare,Private Health Insurance,,N,Y,25313.55,4269.07
Long Island,Nassau,2908000,000511,NYU Winthrop Hospital,30 to 49,115,F,White,Not Span/Hispanic,1,Emergency,Home or Self Care,2017,205,Spondylosis; intervertebral disc disorders; other back problems,000,NO PROC,347,"Other back & neck disorders, fractures & injuries",08,Diseases and Disorders of the Musculoskeletal System and Conn Tissue,1,Minor,Minor,Medical,Medicaid,Medicaid,,,N,Y,51526.27,5083.22
Long Island,Nassau,2908000,000511,NYU Winthrop Hospital,50 to 69,115,F,White,Not Span/Hispanic,2,Emergency,Home w/ Home Health Services,2017,231,Other fractures,000,NO PROC,347,"Other back & neck disorders, fractures & injuries",08,Diseases and Disorders of the Musculoskeletal System and Conn Tissue,1,Minor,Minor,Medical,Blue Cross/Blue Shield,,,,N,Y,24898.17,4450.96
Long Island,Nassau,2908000,000511,NYU Winthrop Hospital,0 to 17,115,M,White,Spanish/Hispanic,2,Emergency,Home or Self Care,2017,232,Sprains and strains,004,DIAGNOSTIC SPINAL TAP,347,"Other back & neck disorders, fractures & injuries",08,Diseases and Disorders of the Musculoskeletal System and Conn Tissue,1,Minor,Minor,Medical,Medicaid,Medicaid,,,N,Y,25421.68,5294.41
Long Island,Nassau,2908000,000511,NYU Winthrop Hospital,70 or Older,110,M,White,Not Span/Hispanic,1,Emergency,Home or Self Care,2017,205,Spondylosis; intervertebral disc disorders; other back problems,000,NO PROC,347,"Other back & neck disorders, fractures & injuries",08,Diseases and Disorders of the Musculoskeletal System and Conn Tissue,1,Minor,Major,Medical,Medicare,Medicare,,,N,Y,36841.70,5503.11
Long Island,Nassau,2908000,000511,NYU Winthrop Hospital,70 or Older,110,F,White,Not Span/Hispanic,5,Emergency,Skilled Nursing Home,2017,231,Other fractures,000,NO PROC,347,"Other back & neck disorders, fractures & injuries",08,Diseases and Disorders of the Musculoskeletal System and Conn Tissue,1,Minor,Minor,Medical,Medicare,Medicare,Private Health Insurance,,N,Y,48429.05,9253.45
Long Island,Nassau,2908000,000511,NYU Winthrop Hospital,50 to 69,115,M,Black/African American,Not Span/Hispanic,4,Emergency,Home or Self Care,2017,205,Spondylosis; intervertebral disc disorders; other back problems,000,NO PROC,347,"Other back & neck disorders, fractures & injuries",08,Diseases and Disorders of the Musculoskeletal System and Conn Tissue,2,Moderate,Minor,Medical,Medicaid,Medicaid,,,N,Y,49444.68,10872.49
Long Island,Nassau,2908000,000511,NYU Winthrop Hospital,30 to 49,115,F,Black/African American,Not Span/Hispanic,4,Emergency,Home w/ Home Health Services,2017,205,Spondylosis; intervertebral disc disorders; other back problems,222,BLOOD TRANSFUSION,347,"Other back & neck disorders, fractures & injuries",08,Diseases and Disorders of the Musculoskeletal System and Conn Tissue,2,Moderate,Minor,Medical,Medicaid,Medicaid,,,N,Y,76410.81,16722.99
Long Island,Nassau,2908000,000511,NYU Winthrop Hospital,50 to 69,110,F,White,Not Span/Hispanic,3,Emergency,Home or Self Care,2017,231,Other fractures,000,NO PROC,347,"Other back & neck disorders, fractures & injuries",08,Diseases and Disorders of the Musculoskeletal System and Conn Tissue,2,Moderate,Minor,Medical,Private Health Insurance,,,,N,Y,72115.36,11227.68