Hospital Service Area,Hospital County,Operating Certificate Number,Permanent Facility Id,Facility Name,Age Group,Zip Code - 3 digits,Gender,Race,Ethnicity,Length of Stay,Type of Admission,Patient Disposition,Discharge Year,CCS Diagnosis Code,CCS Diagnosis Description,CCS Procedure Code,CCS Procedure Description,APR DRG Code,APR DRG Description,APR MDC Code,APR MDC Description,APR Severity of Illness Code,APR Severity of Illness Description,APR Risk of Mortality,APR Medical Surgical Description,Payment Typology 1,Payment Typology 2,Payment Typology 3,Birth Weight,Abortion Edit Indicator,Emergency Department Indicator,Total Charges,Total Costs
New York City,Manhattan,7002001,001438,Bellevue Hospital Center,70 or Older,100,F,White,Not Span/Hispanic,2,Emergency,Left Against Medical Advice,2020,INJ002,"FRACTURE OF THE SPINE AND BACK, INITIAL ENCOUNTER",SKB006,SKIN LACERATION REPAIR (EXCLUDING PERINEUM),347,"OTHER BACK & NECK DISORDERS, FRACTURES & INJURIES",08,DISEASES AND DISORDERS OF THE MUSCULOSKELETAL SYSTEM AND CONNECTIVE TISSUE,3,Major,Minor,Medical,Medicare,Private Health Insurance,,,,Y,19394.06,11153.21
New York City,Manhattan,7002001,001438,Bellevue Hospital Center,70 or Older,112,F,Other Race,Not Span/Hispanic,19,Emergency,Home w/ Home Health Services,2020,INJ002,"FRACTURE OF THE SPINE AND BACK, INITIAL ENCOUNTER",IMG007,COMPUTERIZED TOMOGRAPHY (CT) WITHOUT CONTRAST,347,"OTHER BACK & NECK DISORDERS, FRACTURES & INJURIES",08,DISEASES AND DISORDERS OF THE MUSCULOSKELETAL SYSTEM AND CONNECTIVE TISSUE,3,Major,Moderate,Medical,Medicare,,,,,Y,152396.21,87640.62
New York City,Manhattan,7002001,001438,Bellevue Hospital Center,50 to 69,100,F,Other Race,Spanish/Hispanic,1,Urgent,Home or Self Care,2020,MUS016,"STRESS FRACTURE, INITIAL ENCOUNTER",IMG007,COMPUTERIZED TOMOGRAPHY (CT) WITHOUT CONTRAST,347,"OTHER BACK & NECK DISORDERS, FRACTURES & INJURIES",08,DISEASES AND DISORDERS OF THE MUSCULOSKELETAL SYSTEM AND CONNECTIVE TISSUE,1,Minor,Minor,Medical,Medicaid,,,,,N,12140.36,6981.73
New York City,Manhattan,7002001,001438,Bellevue Hospital Center,18 to 29,112,M,White,Not Span/Hispanic,1,Emergency,Home or Self Care,2020,MUS011,SPONDYLOPATHIES/SPONDYLOARTHROPATHY (INCLUDING INFECTIVE),IMG007,COMPUTERIZED TOMOGRAPHY (CT) WITHOUT CONTRAST,347,"OTHER BACK & NECK DISORDERS, FRACTURES & INJURIES",08,DISEASES AND DISORDERS OF THE MUSCULOSKELETAL SYSTEM AND CONNECTIVE TISSUE,1,Minor,Minor,Medical,Private Health Insurance,,,,,Y,8170.27,4698.59
New York City,Manhattan,7002001,001438,Bellevue Hospital Center,18 to 29,100,F,White,Not Span/Hispanic,1,Emergency,Home or Self Care,2020,INJ002,"FRACTURE OF THE SPINE AND BACK, INITIAL ENCOUNTER",IMG007,COMPUTERIZED TOMOGRAPHY (CT) WITHOUT CONTRAST,347,"OTHER BACK & NECK DISORDERS, FRACTURES & INJURIES",08,DISEASES AND DISORDERS OF THE MUSCULOSKELETAL SYSTEM AND CONNECTIVE TISSUE,3,Major,Moderate,Medical,Private Health Insurance,,,,,Y,20877.76,12006.47
New York City,Manhattan,7002001,001438,Bellevue Hospital Center,50 to 69,100,F,Other Race,Spanish/Hispanic,8,Emergency,Home or Self Care,2020,MUS011,SPONDYLOPATHIES/SPONDYLOARTHROPATHY (INCLUDING INFECTIVE),MST002,BONE AND JOINT BIOPSY,347,"OTHER BACK & NECK DISORDERS, FRACTURES & INJURIES",08,DISEASES AND DISORDERS OF THE MUSCULOSKELETAL SYSTEM AND CONNECTIVE TISSUE,2,Moderate,Minor,Medical,Medicare,,,,,Y,76942.17,44248.21
New York City,Manhattan,7002001,001438,Bellevue Hospital Center,50 to 69,100,F,Other Race,Spanish/Hispanic,4,Emergency,Home w/ Home Health Services,2020,MUS011,SPONDYLOPATHIES/SPONDYLOARTHROPATHY (INCLUDING INFECTIVE),IMG007,COMPUTERIZED TOMOGRAPHY (CT) WITHOUT CONTRAST,347,"OTHER BACK & NECK DISORDERS, FRACTURES & INJURIES",08,DISEASES AND DISORDERS OF THE MUSCULOSKELETAL SYSTEM AND CONNECTIVE TISSUE,2,Moderate,Minor,Medical,Medicare,,,,,Y,32915.01,18928.9
New York City,Manhattan,7002001,001438,Bellevue Hospital Center,50 to 69,112,M,Other Race,Not Span/Hispanic,15,Emergency,Home or Self Care,2020,MUS011,SPONDYLOPATHIES/SPONDYLOARTHROPATHY (INCLUDING INFECTIVE),IMG007,COMPUTERIZED TOMOGRAPHY (CT) WITHOUT CONTRAST,347,"OTHER BACK & NECK DISORDERS, FRACTURES & INJURIES",08,DISEASES AND DISORDERS OF THE MUSCULOSKELETAL SYSTEM AND CONNECTIVE TISSUE,2,Moderate,Moderate,Medical,Medicaid,,,,,Y,105346.75,60583.23
New York City,Manhattan,7002001,001438,Bellevue Hospital Center,50 to 69,100,M,Multi-racial,Unknown,4,Emergency,Home or Self Care,2020,INJ002,"FRACTURE OF THE SPINE AND BACK, INITIAL ENCOUNTER",IMG007,COMPUTERIZED TOMOGRAPHY (CT) WITHOUT CONTRAST,347,"OTHER BACK & NECK DISORDERS, FRACTURES & INJURIES",08,DISEASES AND DISORDERS OF THE MUSCULOSKELETAL SYSTEM AND CONNECTIVE TISSUE,1,Minor,Minor,Medical,Miscellaneous/Other,,,,,Y,31819.83,18299.08
New York City,Manhattan,7002001,001438,Bellevue Hospital Center,70 or Older,100,M,White,Not Span/Hispanic,1,Trauma,Home w/ Home Health Services,2020,INJ002,"FRACTURE OF THE SPINE AND BACK, INITIAL ENCOUNTER",SKB006,SKIN LACERATION REPAIR (EXCLUDING PERINEUM),347,"OTHER BACK & NECK DISORDERS, FRACTURES & INJURIES",08,DISEASES AND DISORDERS OF THE MUSCULOSKELETAL SYSTEM AND CONNECTIVE TISSUE,3,Major,Moderate,Medical,Medicare,Medicaid,,,,Y,26466.59,15220.51
New York City,Manhattan,7002001,001438,Bellevue Hospital Center,70 or Older,112,M,Black/African American,Unknown,4,Urgent,Home or Self Care,2020,MUS011,SPONDYLOPATHIES/SPONDYLOARTHROPATHY (INCLUDING INFECTIVE),ADM015,ADMINISTRATION OF ANTIBIOTICS,347,"OTHER BACK & NECK DISORDERS, FRACTURES & INJURIES",08,DISEASES AND DISORDERS OF THE MUSCULOSKELETAL SYSTEM AND CONNECTIVE TISSUE,3,Major,Major,Medical,Medicare,,,,,N,52028.65,29920.84
New York City,Manhattan,7002001,001438,Bellevue Hospital Center,30 to 49,113,M,Other Race,Spanish/Hispanic,9,Emergency,Home w/ Home Health Services,2020,MUS011,SPONDYLOPATHIES/SPONDYLOARTHROPATHY (INCLUDING INFECTIVE),IMG005,MAGNETIC RESONANCE IMAGING (MRI),347,"OTHER BACK & NECK DISORDERS, FRACTURES & INJURIES",08,DISEASES AND DISORDERS OF THE MUSCULOSKELETAL SYSTEM AND CONNECTIVE TISSUE,1,Minor,Minor,Medical,Miscellaneous/Other,,,,,Y,60453.58,34765.89
New York City,Manhattan,7002001,001438,Bellevue Hospital Center,50 to 69,100,M,Black/African American,Not Span/Hispanic,12,Emergency,Skilled Nursing Home,2020,MUS011,SPONDYLOPATHIES/SPONDYLOARTHROPATHY (INCLUDING INFECTIVE),IMG007,COMPUTERIZED TOMOGRAPHY (CT) WITHOUT CONTRAST,347,"OTHER BACK & NECK DISORDERS, FRACTURES & INJURIES",08,DISEASES AND DISORDERS OF THE MUSCULOSKELETAL SYSTEM AND CONNECTIVE TISSUE,3,Major,Moderate,Medical,Medicaid,,,,,Y,82814.54,47625.32
New York City,Manhattan,7002001,001438,Bellevue Hospital Center,50 to 69,100,M,White,Not Span/Hispanic,2,Emergency,Home or Self Care,2020,MUS011,SPONDYLOPATHIES/SPONDYLOARTHROPATHY (INCLUDING INFECTIVE),,,347,"OTHER BACK & NECK DISORDERS, FRACTURES & INJURIES",08,DISEASES AND DISORDERS OF THE MUSCULOSKELETAL SYSTEM AND CONNECTIVE TISSUE,2,Moderate,Minor,Medical,Medicaid,,,,,Y,35883.24,20635.88
New York City,Manhattan,7002001,001438,Bellevue Hospital Center,30 to 49,104,M,Black/African American,Not Span/Hispanic,1,Emergency,Court/Law Enforcement,2020,MUS038,LOW BACK PAIN,ADM021,"ADMINISTRATION OF THERAPEUTIC SUBSTANCES, NEC",347,"OTHER BACK & NECK DISORDERS, FRACTURES & INJURIES",08,DISEASES AND DISORDERS OF THE MUSCULOSKELETAL SYSTEM AND CONNECTIVE TISSUE,1,Minor,Minor,Medical,Medicaid,,,,,Y,7450.9,4284.89
New York City,Manhattan,7002001,001438,Bellevue Hospital Center,70 or Older,113,M,Other Race,Not Span/Hispanic,13,Emergency,Home or Self Care,2020,INJ002,"FRACTURE OF THE SPINE AND BACK, INITIAL ENCOUNTER",MST002,BONE AND JOINT BIOPSY,347,"OTHER BACK & NECK DISORDERS, FRACTURES & INJURIES",08,DISEASES AND DISORDERS OF THE MUSCULOSKELETAL SYSTEM AND CONNECTIVE TISSUE,2,Moderate,Moderate,Medical,Medicare,Medicaid,,,,Y,133783.66,76936.84
New York City,Manhattan,7002001,001438,Bellevue Hospital Center,30 to 49,,M,White,Unknown,2,Trauma,Home or Self Care,2020,MUS011,SPONDYLOPATHIES/SPONDYLOARTHROPATHY (INCLUDING INFECTIVE),IMG005,MAGNETIC RESONANCE IMAGING (MRI),347,"OTHER BACK & NECK DISORDERS, FRACTURES & INJURIES",08,DISEASES AND DISORDERS OF THE MUSCULOSKELETAL SYSTEM AND CONNECTIVE TISSUE,2,Moderate,Minor,Medical,Miscellaneous/Other,,,,,Y,18903.38,10871.03
New York City,Manhattan,7002001,001438,Bellevue Hospital Center,70 or Older,112,F,White,Not Span/Hispanic,9,Emergency,Home or Self Care,2020,INJ002,"FRACTURE OF THE SPINE AND BACK, INITIAL ENCOUNTER",ADM015,ADMINISTRATION OF ANTIBIOTICS,347,"OTHER BACK & NECK DISORDERS, FRACTURES & INJURIES",08,DISEASES AND DISORDERS OF THE MUSCULOSKELETAL SYSTEM AND CONNECTIVE TISSUE,2,Moderate,Major,Medical,Medicare,,,,,Y,63623.62,36588.93
New York City,Manhattan,7002001,001438,Bellevue Hospital Center,70 or Older,100,F,White,Not Span/Hispanic,4,Emergency,Home w/ Home Health Services,2020,INJ002,"FRACTURE OF THE SPINE AND BACK, INITIAL ENCOUNTER",MHT001,PHARMACOTHERAPY FOR MENTAL HEALTH (EXCLUDING SUBSTANCE USE),347,"OTHER BACK & NECK DISORDERS, FRACTURES & INJURIES",08,DISEASES AND DISORDERS OF THE MUSCULOSKELETAL SYSTEM AND CONNECTIVE TISSUE,2,Moderate,Major,Medical,Medicare,Medicare,,,,Y,49301.57,28352.54
New York City,Manhattan,7002001,001438,Bellevue Hospital Center,30 to 49,112,M,White,Not Span/Hispanic,7,Emergency,Home or Self Care,2020,INJ002,"FRACTURE OF THE SPINE AND BACK, INITIAL ENCOUNTER",IMG006,COMPUTERIZED TOMOGRAPHY (CT) WITH CONTRAST,347,"OTHER BACK & NECK DISORDERS, FRACTURES & INJURIES",08,DISEASES AND DISORDERS OF THE MUSCULOSKELETAL SYSTEM AND CONNECTIVE TISSUE,3,Major,Major,Medical,Medicaid,,,,,Y,61467.36,35348.9
New York City,Manhattan,7002001,001438,Bellevue Hospital Center,30 to 49,112,F,Black/African American,Not Span/Hispanic,1,Emergency,Home or Self Care,2020,MUS011,SPONDYLOPATHIES/SPONDYLOARTHROPATHY (INCLUDING INFECTIVE),IMG006,COMPUTERIZED TOMOGRAPHY (CT) WITH CONTRAST,347,"OTHER BACK & NECK DISORDERS, FRACTURES & INJURIES",08,DISEASES AND DISORDERS OF THE MUSCULOSKELETAL SYSTEM AND CONNECTIVE TISSUE,2,Moderate,Minor,Medical,Medicaid,,,,,Y,26841.43,15436.08
New York City,Manhattan,7002001,001438,Bellevue Hospital Center,70 or Older,100,M,Black/African American,Unknown,4,Emergency,Home or Self Care,2020,MUS011,SPONDYLOPATHIES/SPONDYLOARTHROPATHY (INCLUDING INFECTIVE),IMG009,PLAIN RADIOGRAPHY,347,"OTHER BACK & NECK DISORDERS, FRACTURES & INJURIES",08,DISEASES AND DISORDERS OF THE MUSCULOSKELETAL SYSTEM AND CONNECTIVE TISSUE,2,Moderate,Minor,Medical,Medicare,Medicaid,,,,Y,27716.3,15939.2
New York City,Manhattan,7002001,001438,Bellevue Hospital Center,18 to 29,104,F,Black/African American,Not Span/Hispanic,2,Emergency,Left Against Medical Advice,2020,MUS010,"MUSCULOSKELETAL PAIN, NOT LOW BACK PAIN",IMG005,MAGNETIC RESONANCE IMAGING (MRI),347,"OTHER BACK & NECK DISORDERS, FRACTURES & INJURIES",08,DISEASES AND DISORDERS OF THE MUSCULOSKELETAL SYSTEM AND CONNECTIVE TISSUE,2,Moderate,Minor,Medical,Medicaid,,,,,Y,24352.18,14004.55
New York City,Manhattan,7002001,001438,Bellevue Hospital Center,50 to 69,100,M,Other Race,Unknown,5,Emergency,Home or Self Care,2020,MUS038,LOW BACK PAIN,ADM021,"ADMINISTRATION OF THERAPEUTIC SUBSTANCES, NEC",347,"OTHER BACK & NECK DISORDERS, FRACTURES & INJURIES",08,DISEASES AND DISORDERS OF THE MUSCULOSKELETAL SYSTEM AND CONNECTIVE TISSUE,1,Minor,Minor,Medical,Medicare,Medicaid,,,,Y,35399.03,20357.42
New York City,Manhattan,7002001,001438,Bellevue Hospital Center,50 to 69,OOS,M,Other Race,Spanish/Hispanic,1,Emergency,Home or Self Care,2020,INJ002,"FRACTURE OF THE SPINE AND BACK, INITIAL ENCOUNTER",ADM021,"ADMINISTRATION OF THERAPEUTIC SUBSTANCES, NEC",347,"OTHER BACK & NECK DISORDERS, FRACTURES & INJURIES",08,DISEASES AND DISORDERS OF THE MUSCULOSKELETAL SYSTEM AND CONNECTIVE TISSUE,2,Moderate,Minor,Medical,Self-Pay,,,,,Y,21289.65,12243.34
New York City,Manhattan,7002001,001438,Bellevue Hospital Center,50 to 69,100,M,Other Race,Unknown,1,Urgent,Short-term Hospital,2020,MUS011,SPONDYLOPATHIES/SPONDYLOARTHROPATHY (INCLUDING INFECTIVE),ADM021,"ADMINISTRATION OF THERAPEUTIC SUBSTANCES, NEC",347,"OTHER BACK & NECK DISORDERS, FRACTURES & INJURIES",08,DISEASES AND DISORDERS OF THE MUSCULOSKELETAL SYSTEM AND CONNECTIVE TISSUE,1,Minor,Minor,Medical,Medicaid,,,,,N,8850.9,5090.01
New York City,Manhattan,7002001,001438,Bellevue Hospital Center,50 to 69,100,F,Black/African American,Not Span/Hispanic,1,Urgent,Home or Self Care,2020,MUS011,SPONDYLOPATHIES/SPONDYLOARTHROPATHY (INCLUDING INFECTIVE),ADM016,ADMINISTRATION OF ANTI-INFLAMMATORY AGENTS,347,"OTHER BACK & NECK DISORDERS, FRACTURES & INJURIES",08,DISEASES AND DISORDERS OF THE MUSCULOSKELETAL SYSTEM AND CONNECTIVE TISSUE,1,Minor,Minor,Medical,Medicare,Medicaid,,,,N,8406.72,4834.57
New York City,Manhattan,7002001,001438,Bellevue Hospital Center,30 to 49,112,M,Other Race,Unknown,2,Emergency,Home or Self Care,2020,INJ002,"FRACTURE OF THE SPINE AND BACK, INITIAL ENCOUNTER",ADM017,ADMINISTRATION OF NUTRITIONAL AND ELECTROLYTIC SUBSTANCES,347,"OTHER BACK & NECK DISORDERS, FRACTURES & INJURIES",08,DISEASES AND DISORDERS OF THE MUSCULOSKELETAL SYSTEM AND CONNECTIVE TISSUE,1,Minor,Minor,Medical,Miscellaneous/Other,,,,,Y,19159.47,11018.3
New York City,Manhattan,7002001,001438,Bellevue Hospital Center,70 or Older,100,F,Black/African American,Not Span/Hispanic,7,Emergency,Skilled Nursing Home,2020,MUS011,SPONDYLOPATHIES/SPONDYLOARTHROPATHY (INCLUDING INFECTIVE),IMG005,MAGNETIC RESONANCE IMAGING (MRI),347,"OTHER BACK & NECK DISORDERS, FRACTURES & INJURIES",08,DISEASES AND DISORDERS OF THE MUSCULOSKELETAL SYSTEM AND CONNECTIVE TISSUE,2,Moderate,Major,Medical,Medicare,,,,,Y,59245.79,34071.31
New York City,Manhattan,7002001,001438,Bellevue Hospital Center,30 to 49,112,M,Other Race,Not Span/Hispanic,1,Emergency,Home or Self Care,2020,INJ002,"FRACTURE OF THE SPINE AND BACK, INITIAL ENCOUNTER",ADM014,REGIONAL ANESTHESIA,347,"OTHER BACK & NECK DISORDERS, FRACTURES & INJURIES",08,DISEASES AND DISORDERS OF THE MUSCULOSKELETAL SYSTEM AND CONNECTIVE TISSUE,1,Minor,Minor,Medical,Miscellaneous/Other,,,,,Y,12321.57,7085.94
New York City,Manhattan,7002001,001438,Bellevue Hospital Center,30 to 49,100,F,Other Race,Not Span/Hispanic,1,Emergency,Home or Self Care,2020,MUS011,SPONDYLOPATHIES/SPONDYLOARTHROPATHY (INCLUDING INFECTIVE),IMG007,COMPUTERIZED TOMOGRAPHY (CT) WITHOUT CONTRAST,347,"OTHER BACK & NECK DISORDERS, FRACTURES & INJURIES",08,DISEASES AND DISORDERS OF THE MUSCULOSKELETAL SYSTEM AND CONNECTIVE TISSUE,1,Minor,Minor,Medical,Self-Pay,,,,,Y,29754.47,17111.32
New York City,Manhattan,7002001,001438,Bellevue Hospital Center,30 to 49,112,F,White,Not Span/Hispanic,5,Urgent,Inpatient Rehabilitation Facility,2020,MUS011,SPONDYLOPATHIES/SPONDYLOARTHROPATHY (INCLUDING INFECTIVE),ADM017,ADMINISTRATION OF NUTRITIONAL AND ELECTROLYTIC SUBSTANCES,347,"OTHER BACK & NECK DISORDERS, FRACTURES & INJURIES",08,DISEASES AND DISORDERS OF THE MUSCULOSKELETAL SYSTEM AND CONNECTIVE TISSUE,2,Moderate,Moderate,Medical,Medicaid,,,,,N,37486.81,21558.06
New York City,Manhattan,7002001,001438,Bellevue Hospital Center,50 to 69,100,F,Other Race,Unknown,3,Emergency,Home w/ Home Health Services,2020,INJ002,"FRACTURE OF THE SPINE AND BACK, INITIAL ENCOUNTER",IMG007,COMPUTERIZED TOMOGRAPHY (CT) WITHOUT CONTRAST,347,"OTHER BACK & NECK DISORDERS, FRACTURES & INJURIES",08,DISEASES AND DISORDERS OF THE MUSCULOSKELETAL SYSTEM AND CONNECTIVE TISSUE,2,Moderate,Moderate,Medical,Medicare,,,,,Y,47589.54,27367.98
New York City,Manhattan,7002001,001438,Bellevue Hospital Center,50 to 69,112,M,Other Race,Spanish/Hispanic,4,Emergency,Home or Self Care,2020,MUS011,SPONDYLOPATHIES/SPONDYLOARTHROPATHY (INCLUDING INFECTIVE),ADM021,"ADMINISTRATION OF THERAPEUTIC SUBSTANCES, NEC",347,"OTHER BACK & NECK DISORDERS, FRACTURES & INJURIES",08,DISEASES AND DISORDERS OF THE MUSCULOSKELETAL SYSTEM AND CONNECTIVE TISSUE,1,Minor,Moderate,Medical,Medicare,Medicaid,,,,Y,36747.82,21133.08
New York City,Manhattan,7002001,001438,Bellevue Hospital Center,30 to 49,112,M,Black/African American,Not Span/Hispanic,1,Emergency,Home or Self Care,2020,INJ002,"FRACTURE OF THE SPINE AND BACK, INITIAL ENCOUNTER",ADM021,"ADMINISTRATION OF THERAPEUTIC SUBSTANCES, NEC",347,"OTHER BACK & NECK DISORDERS, FRACTURES & INJURIES",08,DISEASES AND DISORDERS OF THE MUSCULOSKELETAL SYSTEM AND CONNECTIVE TISSUE,2,Moderate,Minor,Medical,Medicaid,,,,,Y,26674.66,15340.17
New York City,Manhattan,7002001,001438,Bellevue Hospital Center,0 to 17,100,M,Black/African American,Not Span/Hispanic,2,Emergency,Home or Self Care,2020,INJ002,"FRACTURE OF THE SPINE AND BACK, INITIAL ENCOUNTER",PLC001,IMMOBILIZATION BY SPLINT OR OTHER EXTERNAL DEVICE,347,"OTHER BACK & NECK DISORDERS, FRACTURES & INJURIES",08,DISEASES AND DISORDERS OF THE MUSCULOSKELETAL SYSTEM AND CONNECTIVE TISSUE,2,Moderate,Minor,Medical,Self-Pay,,,,,Y,33186.69,19085.13
New York City,Manhattan,7002001,001438,Bellevue Hospital Center,70 or Older,100,F,Other Race,Unknown,3,Emergency,Skilled Nursing Home,2020,INJ002,"FRACTURE OF THE SPINE AND BACK, INITIAL ENCOUNTER",ADM021,"ADMINISTRATION OF THERAPEUTIC SUBSTANCES, NEC",347,"OTHER BACK & NECK DISORDERS, FRACTURES & INJURIES",08,DISEASES AND DISORDERS OF THE MUSCULOSKELETAL SYSTEM AND CONNECTIVE TISSUE,2,Moderate,Minor,Medical,Medicare,Medicare,,,,Y,22591.56,12992.04
New York City,Manhattan,7002001,001438,Bellevue Hospital Center,70 or Older,112,M,White,Not Span/Hispanic,3,Emergency,Left Against Medical Advice,2020,MUS011,SPONDYLOPATHIES/SPONDYLOARTHROPATHY (INCLUDING INFECTIVE),MAM008,CARDIAC MONITORING,347,"OTHER BACK & NECK DISORDERS, FRACTURES & INJURIES",08,DISEASES AND DISORDERS OF THE MUSCULOSKELETAL SYSTEM AND CONNECTIVE TISSUE,2,Moderate,Moderate,Medical,Medicare,Medicaid,,,,Y,35097.08,20183.77
New York City,Manhattan,7002001,001438,Bellevue Hospital Center,30 to 49,100,M,White,Not Span/Hispanic,1,Emergency,Left Against Medical Advice,2020,INJ002,"FRACTURE OF THE SPINE AND BACK, INITIAL ENCOUNTER",SKB006,SKIN LACERATION REPAIR (EXCLUDING PERINEUM),347,"OTHER BACK & NECK DISORDERS, FRACTURES & INJURIES",08,DISEASES AND DISORDERS OF THE MUSCULOSKELETAL SYSTEM AND CONNECTIVE TISSUE,2,Moderate,Minor,Medical,Medicaid,,,,,Y,22841.98,13136.06
New York City,Manhattan,7002001,001438,Bellevue Hospital Center,30 to 49,104,F,Other Race,Spanish/Hispanic,2,Elective,Home or Self Care,2020,MUS011,SPONDYLOPATHIES/SPONDYLOARTHROPATHY (INCLUDING INFECTIVE),IMG005,MAGNETIC RESONANCE IMAGING (MRI),347,"OTHER BACK & NECK DISORDERS, FRACTURES & INJURIES",08,DISEASES AND DISORDERS OF THE MUSCULOSKELETAL SYSTEM AND CONNECTIVE TISSUE,1,Minor,Minor,Medical,Medicaid,,,,,Y,19994.24,11498.37
New York City,Manhattan,7002001,001438,Bellevue Hospital Center,70 or Older,100,F,Other Race,Spanish/Hispanic,3,Emergency,Home or Self Care,2020,MUS011,SPONDYLOPATHIES/SPONDYLOARTHROPATHY (INCLUDING INFECTIVE),IMG005,MAGNETIC RESONANCE IMAGING (MRI),347,"OTHER BACK & NECK DISORDERS, FRACTURES & INJURIES",08,DISEASES AND DISORDERS OF THE MUSCULOSKELETAL SYSTEM AND CONNECTIVE TISSUE,2,Moderate,Moderate,Medical,Medicare,Medicaid,,,,Y,25527.23,14680.3
New York City,Manhattan,7002001,001438,Bellevue Hospital Center,30 to 49,104,M,Other Race,Spanish/Hispanic,5,Emergency,Home or Self Care,2020,MUS038,LOW BACK PAIN,ADM021,"ADMINISTRATION OF THERAPEUTIC SUBSTANCES, NEC",347,"OTHER BACK & NECK DISORDERS, FRACTURES & INJURIES",08,DISEASES AND DISORDERS OF THE MUSCULOSKELETAL SYSTEM AND CONNECTIVE TISSUE,1,Minor,Minor,Medical,Medicaid,,,,,Y,36498.37,20989.63
New York City,Manhattan,7002001,001438,Bellevue Hospital Center,70 or Older,100,F,Other Race,Not Span/Hispanic,3,Emergency,Home or Self Care,2020,MUS013,OSTEOPOROSIS,IMG006,COMPUTERIZED TOMOGRAPHY (CT) WITH CONTRAST,347,"OTHER BACK & NECK DISORDERS, FRACTURES & INJURIES",08,DISEASES AND DISORDERS OF THE MUSCULOSKELETAL SYSTEM AND CONNECTIVE TISSUE,1,Minor,Minor,Medical,Medicaid,,,,,Y,31056.12,17859.88
New York City,Manhattan,7002001,001438,Bellevue Hospital Center,70 or Older,100,F,White,Not Span/Hispanic,1,Emergency,Home or Self Care,2020,INJ002,"FRACTURE OF THE SPINE AND BACK, INITIAL ENCOUNTER",IMG007,COMPUTERIZED TOMOGRAPHY (CT) WITHOUT CONTRAST,347,"OTHER BACK & NECK DISORDERS, FRACTURES & INJURIES",08,DISEASES AND DISORDERS OF THE MUSCULOSKELETAL SYSTEM AND CONNECTIVE TISSUE,1,Minor,Minor,Medical,Medicare,Private Health Insurance,,,,Y,24085.84,13851.38
New York City,Manhattan,7002001,001438,Bellevue Hospital Center,18 to 29,100,M,Other Race,Not Span/Hispanic,1,Emergency,Left Against Medical Advice,2020,INJ002,"FRACTURE OF THE SPINE AND BACK, INITIAL ENCOUNTER",ADM014,REGIONAL ANESTHESIA,347,"OTHER BACK & NECK DISORDERS, FRACTURES & INJURIES",08,DISEASES AND DISORDERS OF THE MUSCULOSKELETAL SYSTEM AND CONNECTIVE TISSUE,2,Moderate,Minor,Medical,Medicaid,,,,,Y,17521.99,10076.62
New York City,Manhattan,7002001,001438,Bellevue Hospital Center,30 to 49,112,F,Other Race,Not Span/Hispanic,10,Emergency,Skilled Nursing Home,2020,MUS011,SPONDYLOPATHIES/SPONDYLOARTHROPATHY (INCLUDING INFECTIVE),IMG005,MAGNETIC RESONANCE IMAGING (MRI),347,"OTHER BACK & NECK DISORDERS, FRACTURES & INJURIES",08,DISEASES AND DISORDERS OF THE MUSCULOSKELETAL SYSTEM AND CONNECTIVE TISSUE,1,Minor,Minor,Medical,Medicaid,,,,,Y,78982.14,45421.36
New York City,Manhattan,7002001,001438,Bellevue Hospital Center,50 to 69,100,M,White,Not Span/Hispanic,5,Emergency,Home or Self Care,2020,INJ002,"FRACTURE OF THE SPINE AND BACK, INITIAL ENCOUNTER",PLC001,IMMOBILIZATION BY SPLINT OR OTHER EXTERNAL DEVICE,347,"OTHER BACK & NECK DISORDERS, FRACTURES & INJURIES",08,DISEASES AND DISORDERS OF THE MUSCULOSKELETAL SYSTEM AND CONNECTIVE TISSUE,2,Moderate,Moderate,Medical,Self-Pay,,,,,Y,52822.82,30377.56
New York City,Manhattan,7002001,001438,Bellevue Hospital Center,30 to 49,100,F,Other Race,Spanish/Hispanic,3,Emergency,Home or Self Care,2020,MUS011,SPONDYLOPATHIES/SPONDYLOARTHROPATHY (INCLUDING INFECTIVE),IMG005,MAGNETIC RESONANCE IMAGING (MRI),347,"OTHER BACK & NECK DISORDERS, FRACTURES & INJURIES",08,DISEASES AND DISORDERS OF THE MUSCULOSKELETAL SYSTEM AND CONNECTIVE TISSUE,1,Minor,Minor,Medical,Medicaid,,,,,Y,35708.02,20535.11
New York City,Manhattan,7002001,001438,Bellevue Hospital Center,70 or Older,100,M,White,Not Span/Hispanic,4,Emergency,Home or Self Care,2020,INJ002,"FRACTURE OF THE SPINE AND BACK, INITIAL ENCOUNTER",SKB006,SKIN LACERATION REPAIR (EXCLUDING PERINEUM),347,"OTHER BACK & NECK DISORDERS, FRACTURES & INJURIES",08,DISEASES AND DISORDERS OF THE MUSCULOSKELETAL SYSTEM AND CONNECTIVE TISSUE,3,Major,Moderate,Medical,Private Health Insurance,,,,,Y,60581.9,34839.68
New York City,Manhattan,7002001,001438,Bellevue Hospital Center,50 to 69,100,M,Other Race,Spanish/Hispanic,1,Urgent,Home or Self Care,2020,MUS011,SPONDYLOPATHIES/SPONDYLOARTHROPATHY (INCLUDING INFECTIVE),ADM021,"ADMINISTRATION OF THERAPEUTIC SUBSTANCES, NEC",347,"OTHER BACK & NECK DISORDERS, FRACTURES & INJURIES",08,DISEASES AND DISORDERS OF THE MUSCULOSKELETAL SYSTEM AND CONNECTIVE TISSUE,1,Minor,Moderate,Medical,Medicaid,,,,,N,7486.76,4305.52
New York City,Manhattan,7002001,001438,Bellevue Hospital Center,50 to 69,100,M,White,Not Span/Hispanic,8,Emergency,Home or Self Care,2020,MUS011,SPONDYLOPATHIES/SPONDYLOARTHROPATHY (INCLUDING INFECTIVE),ADM021,"ADMINISTRATION OF THERAPEUTIC SUBSTANCES, NEC",347,"OTHER BACK & NECK DISORDERS, FRACTURES & INJURIES",08,DISEASES AND DISORDERS OF THE MUSCULOSKELETAL SYSTEM AND CONNECTIVE TISSUE,2,Moderate,Minor,Medical,Medicaid,,,,,Y,57503.36,33069.26
New York City,Manhattan,7002001,001438,Bellevue Hospital Center,70 or Older,114,M,Other Race,Not Span/Hispanic,1,Urgent,Home or Self Care,2020,MUS011,SPONDYLOPATHIES/SPONDYLOARTHROPATHY (INCLUDING INFECTIVE),IMG005,MAGNETIC RESONANCE IMAGING (MRI),347,"OTHER BACK & NECK DISORDERS, FRACTURES & INJURIES",08,DISEASES AND DISORDERS OF THE MUSCULOSKELETAL SYSTEM AND CONNECTIVE TISSUE,2,Moderate,Moderate,Medical,Medicaid,,,,,N,9376.6,5392.33