Hospital Service Area,Hospital County,Operating Certificate Number,Permanent Facility Id,Facility Name,Age Group,Zip Code - 3 digits,Gender,Race,Ethnicity,Length of Stay,Type of Admission,Patient Disposition,Discharge Year,CCS Diagnosis Code,CCS Diagnosis Description,CCS Procedure Code,CCS Procedure Description,APR DRG Code,APR DRG Description,APR MDC Code,APR MDC Description,APR Severity of Illness Code,APR Severity of Illness Description,APR Risk of Mortality,APR Medical Surgical Description,Payment Typology 1,Payment Typology 2,Payment Typology 3,Birth Weight,Abortion Edit Indicator,Emergency Department Indicator,Total Charges,Total Costs
New York City,Kings,7002002,001324,Mount Sinai Brooklyn,70 or Older,112,F,Other Race,Not Span/Hispanic,3,Emergency,Skilled Nursing Home,2017,237,Complication of device; implant or graft,163,OT NON-OR THER PRC MUSC,349,"Malfunction, reaction, complic of orthopedic device or procedure",08,Diseases and Disorders of the Musculoskeletal System and Conn Tissue,1,Minor,Minor,Medical,Medicare,Medicaid,Self-Pay,,N,Y,35300.96,7009.78
Central NY,Onondaga,3301008,000636,Crouse Hospital,30 to 49,136,M,Other Race,Not Span/Hispanic,4,Emergency,Facility w/ Custodial/Supportive Care,2017,238,Complications of surgical procedures or medical care,231,OTHER THERAPEUTIC PRCS,349,"Malfunction, reaction, complic of orthopedic device or procedure",08,Diseases and Disorders of the Musculoskeletal System and Conn Tissue,2,Moderate,Moderate,Medical,Medicare,Medicare,Medicaid,,N,Y,14754.07,6961.69
New York City,Kings,7002002,001324,Mount Sinai Brooklyn,50 to 69,112,M,Black/African American,Not Span/Hispanic,8,Emergency,Home w/ Home Health Services,2017,238,Complications of surgical procedures or medical care,175,OT OR THER PRC SKN/BRST,349,"Malfunction, reaction, complic of orthopedic device or procedure",08,Diseases and Disorders of the Musculoskeletal System and Conn Tissue,2,Moderate,Minor,Medical,Medicare,Medicaid,Self-Pay,,N,Y,72005.01,16402.60
New York City,Kings,7002002,001324,Mount Sinai Brooklyn,70 or Older,112,F,White,Not Span/Hispanic,5,Emergency,Skilled Nursing Home,2017,237,Complication of device; implant or graft,146,"TRTMNT,FRAC HIP/FEMUR",349,"Malfunction, reaction, complic of orthopedic device or procedure",08,Diseases and Disorders of the Musculoskeletal System and Conn Tissue,2,Moderate,Minor,Medical,Medicare,Miscellaneous/Other,Self-Pay,,N,N,46068.12,10461.08
Hudson Valley,Orange,3523000,000699,Orange Regional Medical Center,70 or Older,109,M,Other Race,Spanish/Hispanic,8,Emergency,Home or Self Care,2017,238,Complications of surgical procedures or medical care,000,NO PROC,349,"Malfunction, reaction, complic of orthopedic device or procedure",08,Diseases and Disorders of the Musculoskeletal System and Conn Tissue,2,Moderate,Moderate,Medical,Medicare,,,,N,Y,60453.15,15763.33
New York City,Bronx,7000006,001169,Montefiore Medical Center - Henry & Lucy Moses Div,30 to 49,104,F,Other Race,Spanish/Hispanic,9,Emergency,Home w/ Home Health Services,2017,238,Complications of surgical procedures or medical care,231,OTHER THERAPEUTIC PRCS,349,"Malfunction, reaction, complic of orthopedic device or procedure",08,Diseases and Disorders of the Musculoskeletal System and Conn Tissue,3,Major,Moderate,Medical,Medicaid,,,,N,Y,89500.23,19052.86
New York City,Manhattan,7002002,001439,Mount Sinai Beth Israel,50 to 69,112,F,White,Not Span/Hispanic,1,Elective,Home w/ Home Health Services,2017,237,Complication of device; implant or graft,213,"PHYS THER EXER, MANIPUL",349,"Malfunction, reaction, complic of orthopedic device or procedure",08,Diseases and Disorders of the Musculoskeletal System and Conn Tissue,1,Minor,Minor,Medical,Private Health Insurance,Self-Pay,,,N,N,11683.60,4201.28
New York City,Manhattan,7002024,001456,Mount Sinai Hospital,70 or Older,104,M,Other Race,Not Span/Hispanic,2,Emergency,Home w/ Home Health Services,2017,238,Complications of surgical procedures or medical care,000,NO PROC,349,"Malfunction, reaction, complic of orthopedic device or procedure",08,Diseases and Disorders of the Musculoskeletal System and Conn Tissue,2,Moderate,Minor,Medical,Medicare,Medicare,Medicaid,,N,Y,16449.86,5475.89
New York City,Manhattan,7002024,001456,Mount Sinai Hospital,50 to 69,100,M,Other Race,Not Span/Hispanic,3,Emergency,Home w/ Home Health Services,2017,238,Complications of surgical procedures or medical care,180,OTHER CT SCAN,349,"Malfunction, reaction, complic of orthopedic device or procedure",08,Diseases and Disorders of the Musculoskeletal System and Conn Tissue,3,Major,Moderate,Medical,Medicare,Medicaid,Self-Pay,,N,Y,25744.33,8224.21
New York City,Bronx,7000006,001168,Montefiore Medical Center-Wakefield Hospital,70 or Older,104,F,White,Not Span/Hispanic,6,Emergency,Skilled Nursing Home,2017,237,Complication of device; implant or graft,146,"TRTMNT,FRAC HIP/FEMUR",349,"Malfunction, reaction, complic of orthopedic device or procedure",08,Diseases and Disorders of the Musculoskeletal System and Conn Tissue,3,Major,Moderate,Medical,Medicare,Private Health Insurance,,,N,Y,67841.93,12486.94
Long Island,Nassau,2950002,000528,Nassau University Medical Center,50 to 69,117,M,White,Not Span/Hispanic,3,Emergency,Home w/ Home Health Services,2017,238,Complications of surgical procedures or medical care,214,"TRACTN, SPLNT, OT WOUND",349,"Malfunction, reaction, complic of orthopedic device or procedure",08,Diseases and Disorders of the Musculoskeletal System and Conn Tissue,2,Moderate,Minor,Medical,Medicaid,Self-Pay,,,N,N,16089.20,6001.94
New York City,Kings,7001021,001306,New York - Presbyterian Brooklyn Methodist Hospital,50 to 69,112,M,White,Not Span/Hispanic,3,Emergency,Home or Self Care,2017,237,Complication of device; implant or graft,213,"PHYS THER EXER, MANIPUL",349,"Malfunction, reaction, complic of orthopedic device or procedure",08,Diseases and Disorders of the Musculoskeletal System and Conn Tissue,1,Minor,Minor,Medical,Medicare,Medicaid,Self-Pay,,N,N,25864.85,10596.35
New York City,Manhattan,7002024,001456,Mount Sinai Hospital,70 or Older,104,M,Other Race,Not Span/Hispanic,15,Emergency,Home w/ Home Health Services,2017,237,Complication of device; implant or graft,054,OT VASC CATH; NOT HEART,349,"Malfunction, reaction, complic of orthopedic device or procedure",08,Diseases and Disorders of the Musculoskeletal System and Conn Tissue,3,Major,Major,Medical,Medicare,Medicaid,Self-Pay,,N,Y,112373.22,37751.64
New York City,Manhattan,7002054,001458,New York Presbyterian Hospital - New York Weill Cornell Center,30 to 49,100,M,Multi-racial,Not Span/Hispanic,4,Emergency,Left Against Medical Advice,2017,238,Complications of surgical procedures or medical care,168,"INCIS/DRAIN, SKIN/SUBCU",349,"Malfunction, reaction, complic of orthopedic device or procedure",08,Diseases and Disorders of the Musculoskeletal System and Conn Tissue,3,Major,Minor,Medical,Private Health Insurance,Self-Pay,,,N,Y,58486.71,21324.60
New York City,Manhattan,7002054,001464,New York Presbyterian Hospital - Columbia Presbyterian Center,30 to 49,100,F,Other Race,Multi-ethnic,12,Urgent,Home w/ Home Health Services,2017,238,Complications of surgical procedures or medical care,175,OT OR THER PRC SKN/BRST,349,"Malfunction, reaction, complic of orthopedic device or procedure",08,Diseases and Disorders of the Musculoskeletal System and Conn Tissue,2,Moderate,Moderate,Medical,Medicaid,Medicaid,Self-Pay,,N,N,115393.10,31039.19
New York City,Manhattan,7002054,001464,New York Presbyterian Hospital - Columbia Presbyterian Center,70 or Older,104,F,White,Not Span/Hispanic,3,Emergency,Skilled Nursing Home,2017,237,Complication of device; implant or graft,163,OT NON-OR THER PRC MUSC,349,"Malfunction, reaction, complic of orthopedic device or procedure",08,Diseases and Disorders of the Musculoskeletal System and Conn Tissue,1,Minor,Minor,Medical,Medicare,Medicare,Medicaid,,N,Y,36202.06,9926.79
New York City,Queens,7003010,001637,New York - Presbyterian/Queens,70 or Older,113,F,Other Race,Spanish/Hispanic,8,Elective,Skilled Nursing Home,2017,237,Complication of device; implant or graft,163,OT NON-OR THER PRC MUSC,349,"Malfunction, reaction, complic of orthopedic device or procedure",08,Diseases and Disorders of the Musculoskeletal System and Conn Tissue,2,Moderate,Minor,Medical,Medicare,Medicare,Medicaid,,N,N,68968.81,24853.82
New York City,Queens,7003010,001637,New York - Presbyterian/Queens,70 or Older,113,M,Other Race,Not Span/Hispanic,3,Emergency,Home w/ Home Health Services,2017,237,Complication of device; implant or graft,054,OT VASC CATH; NOT HEART,349,"Malfunction, reaction, complic of orthopedic device or procedure",08,Diseases and Disorders of the Musculoskeletal System and Conn Tissue,2,Moderate,Moderate,Medical,Medicare,Medicaid,Self-Pay,,N,Y,19597.22,5939.92
New York City,Queens,7003010,001637,New York - Presbyterian/Queens,50 to 69,113,F,Other Race,Not Span/Hispanic,2,Emergency,Home or Self Care,2017,237,Complication of device; implant or graft,197,OTHER DX ULTRASOUND,349,"Malfunction, reaction, complic of orthopedic device or procedure",08,Diseases and Disorders of the Musculoskeletal System and Conn Tissue,2,Moderate,Minor,Medical,Private Health Insurance,,,,N,Y,15772.82,4786.56
Central NY,Onondaga,3301008,000636,Crouse Hospital,50 to 69,132,M,Black/African American,Not Span/Hispanic,1,Elective,Home or Self Care,2017,237,Complication of device; implant or graft,213,"PHYS THER EXER, MANIPUL",349,"Malfunction, reaction, complic of orthopedic device or procedure",08,Diseases and Disorders of the Musculoskeletal System and Conn Tissue,1,Minor,Minor,Medical,Medicaid,,,,N,N,6982.45,2670.53
Central NY,Onondaga,3301008,000636,Crouse Hospital,70 or Older,130,M,White,Not Span/Hispanic,3,Urgent,Skilled Nursing Home,2017,238,Complications of surgical procedures or medical care,214,"TRACTN, SPLNT, OT WOUND",349,"Malfunction, reaction, complic of orthopedic device or procedure",08,Diseases and Disorders of the Musculoskeletal System and Conn Tissue,1,Minor,Moderate,Medical,Medicare,Medicare,Blue Cross/Blue Shield,,N,N,8584.82,3613.55
Capital/Adirond,Columbia,1001000,000146,Columbia Memorial Hospital,70 or Older,125,M,White,Not Span/Hispanic,2,Emergency,Home or Self Care,2017,237,Complication of device; implant or graft,159,OT DX PRCS ON MUSC/SKEL,349,"Malfunction, reaction, complic of orthopedic device or procedure",08,Diseases and Disorders of the Musculoskeletal System and Conn Tissue,1,Minor,Minor,Medical,Medicare,,,,N,N,5895.50,2755.74
Hudson Valley,Sullivan,5263000,000971,Catskill Regional Medical Center,50 to 69,127,M,White,Not Span/Hispanic,5,Emergency,Home or Self Care,2017,238,Complications of surgical procedures or medical care,000,NO PROC,349,"Malfunction, reaction, complic of orthopedic device or procedure",08,Diseases and Disorders of the Musculoskeletal System and Conn Tissue,3,Major,Moderate,Medical,Medicare,Medicaid,,,N,Y,29008.69,8901.04
New York City,Kings,7002002,001324,Mount Sinai Brooklyn,70 or Older,112,F,White,Not Span/Hispanic,2,Emergency,Skilled Nursing Home,2017,237,Complication of device; implant or graft,146,"TRTMNT,FRAC HIP/FEMUR",349,"Malfunction, reaction, complic of orthopedic device or procedure",08,Diseases and Disorders of the Musculoskeletal System and Conn Tissue,2,Moderate,Moderate,Medical,Medicare,Miscellaneous/Other,Self-Pay,,N,N,24140.55,6463.65
New York City,Manhattan,7002002,001439,Mount Sinai Beth Israel,50 to 69,100,M,Black/African American,Not Span/Hispanic,4,Emergency,Home w/ Home Health Services,2017,237,Complication of device; implant or graft,214,"TRACTN, SPLNT, OT WOUND",349,"Malfunction, reaction, complic of orthopedic device or procedure",08,Diseases and Disorders of the Musculoskeletal System and Conn Tissue,2,Moderate,Minor,Medical,Medicaid,Medicaid,Self-Pay,,N,Y,34840.14,10492.80
New York City,Manhattan,7002053,001463,NYU Langone Hospitals,0 to 17,112,F,Other Race,Not Span/Hispanic,2,Emergency,Home or Self Care,2017,237,Complication of device; implant or graft,168,"INCIS/DRAIN, SKIN/SUBCU",349,"Malfunction, reaction, complic of orthopedic device or procedure",08,Diseases and Disorders of the Musculoskeletal System and Conn Tissue,3,Major,Minor,Medical,Medicaid,,,,N,Y,19833.96,5937.33
Long Island,Suffolk,5123000,000885,Brookhaven Memorial Hospital Medical Center Inc,70 or Older,117,F,White,Not Span/Hispanic,4,Emergency,Skilled Nursing Home,2017,238,Complications of surgical procedures or medical care,000,NO PROC,349,"Malfunction, reaction, complic of orthopedic device or procedure",08,Diseases and Disorders of the Musculoskeletal System and Conn Tissue,2,Moderate,Major,Medical,Medicare,Medicare,Blue Cross/Blue Shield,,N,Y,36865.78,5647.96
Western NY,Erie,1401014,000207,Buffalo General Medical Center,70 or Older,143,F,Black/African American,Not Span/Hispanic,6,Emergency,Home or Self Care,2017,237,Complication of device; implant or graft,159,OT DX PRCS ON MUSC/SKEL,349,"Malfunction, reaction, complic of orthopedic device or procedure",08,Diseases and Disorders of the Musculoskeletal System and Conn Tissue,2,Moderate,Moderate,Medical,Medicare,Blue Cross/Blue Shield,Self-Pay,,N,Y,14628.07,8690.47
Western NY,Erie,1401005,000210,Erie County Medical Center,50 to 69,140,F,White,Not Span/Hispanic,9,Urgent,Home w/ Home Health Services,2017,237,Complication of device; implant or graft,175,OT OR THER PRC SKN/BRST,349,"Malfunction, reaction, complic of orthopedic device or procedure",08,Diseases and Disorders of the Musculoskeletal System and Conn Tissue,2,Moderate,Minor,Medical,Self-Pay,Self-Pay,,,N,N,20597.01,14610.56
Western NY,Erie,1401005,000210,Erie County Medical Center,70 or Older,142,F,White,Not Span/Hispanic,8,Emergency,Home or Self Care,2017,237,Complication of device; implant or graft,163,OT NON-OR THER PRC MUSC,349,"Malfunction, reaction, complic of orthopedic device or procedure",08,Diseases and Disorders of the Musculoskeletal System and Conn Tissue,3,Major,Major,Medical,Medicare,Blue Cross/Blue Shield,,,N,Y,24649.10,14070.53
Western NY,Erie,1401014,003067,Millard Fillmore Suburban Hospital,70 or Older,142,F,White,Not Span/Hispanic,1,Emergency,Short-term Hospital,2017,237,Complication of device; implant or graft,000,NO PROC,349,"Malfunction, reaction, complic of orthopedic device or procedure",08,Diseases and Disorders of the Musculoskeletal System and Conn Tissue,2,Moderate,Minor,Medical,Medicare,Self-Pay,,,N,Y,3409.64,1560.97
Capital/Adirond,Albany,0101003,000004,Albany Memorial Hospital,30 to 49,121,M,Other Race,Spanish/Hispanic,2,Emergency,Home or Self Care,2017,238,Complications of surgical procedures or medical care,000,NO PROC,349,"Malfunction, reaction, complic of orthopedic device or procedure",08,Diseases and Disorders of the Musculoskeletal System and Conn Tissue,2,Moderate,Moderate,Medical,Medicare,Medicaid,Self-Pay,,N,Y,6744.79,3020.86
Capital/Adirond,Albany,0101003,000004,Albany Memorial Hospital,70 or Older,122,M,Black/African American,Not Span/Hispanic,1,Emergency,Short-term Hospital,2017,238,Complications of surgical procedures or medical care,000,NO PROC,349,"Malfunction, reaction, complic of orthopedic device or procedure",08,Diseases and Disorders of the Musculoskeletal System and Conn Tissue,2,Moderate,Minor,Medical,Miscellaneous/Other,Medicare,Self-Pay,,N,Y,3305.20,1580.14
Capital/Adirond,Rensselaer,4102002,000756,Samaritan Hospital,50 to 69,121,M,White,Not Span/Hispanic,5,Emergency,Home or Self Care,2017,238,Complications of surgical procedures or medical care,000,NO PROC,349,"Malfunction, reaction, complic of orthopedic device or procedure",08,Diseases and Disorders of the Musculoskeletal System and Conn Tissue,2,Moderate,Minor,Medical,Medicaid,Self-Pay,Self-Pay,,N,Y,10202.70,4785.81
Hudson Valley,Orange,3523000,000699,Orange Regional Medical Center,70 or Older,109,M,White,Not Span/Hispanic,15,Emergency,Home or Self Care,2017,237,Complication of device; implant or graft,193,DX ULTRASOUND HEART,349,"Malfunction, reaction, complic of orthopedic device or procedure",08,Diseases and Disorders of the Musculoskeletal System and Conn Tissue,3,Major,Major,Medical,Medicare,Private Health Insurance,,,N,Y,106419.94,38289.87
Hudson Valley,Orange,3523000,000699,Orange Regional Medical Center,50 to 69,109,F,White,Not Span/Hispanic,3,Emergency,Home or Self Care,2017,238,Complications of surgical procedures or medical care,222,BLOOD TRANSFUSION,349,"Malfunction, reaction, complic of orthopedic device or procedure",08,Diseases and Disorders of the Musculoskeletal System and Conn Tissue,3,Major,Moderate,Medical,Medicare,Medicaid,,,N,Y,33792.27,8070.14
Hudson Valley,Orange,3523000,000699,Orange Regional Medical Center,70 or Older,127,M,White,Not Span/Hispanic,4,Emergency,Skilled Nursing Home,2017,237,Complication of device; implant or graft,000,NO PROC,349,"Malfunction, reaction, complic of orthopedic device or procedure",08,Diseases and Disorders of the Musculoskeletal System and Conn Tissue,2,Moderate,Minor,Medical,Medicare,Blue Cross/Blue Shield,Federal/State/Local/VA,,N,Y,27095.47,7108.47
Hudson Valley,Westchester,5901000,001039,NewYork-Presbyterian/Hudson Valley Hospital,50 to 69,105,M,White,Not Span/Hispanic,5,Emergency,Skilled Nursing Home,2017,238,Complications of surgical procedures or medical care,058,HEMODIALYSIS,349,"Malfunction, reaction, complic of orthopedic device or procedure",08,Diseases and Disorders of the Musculoskeletal System and Conn Tissue,3,Major,Major,Medical,Medicare,Private Health Insurance,,,N,Y,64871.53,14059.49
Hudson Valley,Westchester,5901000,001039,NewYork-Presbyterian/Hudson Valley Hospital,70 or Older,105,M,White,Not Span/Hispanic,7,Emergency,Skilled Nursing Home,2017,237,Complication of device; implant or graft,163,OT NON-OR THER PRC MUSC,349,"Malfunction, reaction, complic of orthopedic device or procedure",08,Diseases and Disorders of the Musculoskeletal System and Conn Tissue,3,Major,Major,Medical,Medicare,,,,N,Y,68155.73,25294.91
New York City,Bronx,7000006,001168,Montefiore Medical Center-Wakefield Hospital,50 to 69,104,F,Other Race,Spanish/Hispanic,2,Elective,Home w/ Home Health Services,2017,237,Complication of device; implant or graft,163,OT NON-OR THER PRC MUSC,349,"Malfunction, reaction, complic of orthopedic device or procedure",08,Diseases and Disorders of the Musculoskeletal System and Conn Tissue,1,Minor,Minor,Medical,Medicare,,,,N,N,45309.77,9452.10
New York City,Bronx,7000006,003058,Montefiore Med Center - Jack D Weiler Hosp of A Einstein College Div,50 to 69,104,M,Other Race,Spanish/Hispanic,30,Emergency,Expired,2017,238,Complications of surgical procedures or medical care,216,RESP INTUB/MECH VENTIL,349,"Malfunction, reaction, complic of orthopedic device or procedure",08,Diseases and Disorders of the Musculoskeletal System and Conn Tissue,4,Extreme,Extreme,Medical,Medicare,Medicaid,,,N,Y,637151.87,146538.56
New York City,Richmond,7004003,001740,Staten Island University Hosp-North,70 or Older,103,F,White,Not Span/Hispanic,1,Emergency,Short-term Hospital,2017,237,Complication of device; implant or graft,159,OT DX PRCS ON MUSC/SKEL,349,"Malfunction, reaction, complic of orthopedic device or procedure",08,Diseases and Disorders of the Musculoskeletal System and Conn Tissue,3,Major,Moderate,Medical,Medicare,Private Health Insurance,,,N,Y,9452.61,2046.20
New York City,Richmond,7004003,001740,Staten Island University Hosp-North,50 to 69,100,M,Black/African American,Spanish/Hispanic,9,Emergency,Skilled Nursing Home,2017,237,Complication of device; implant or graft,054,OT VASC CATH; NOT HEART,349,"Malfunction, reaction, complic of orthopedic device or procedure",08,Diseases and Disorders of the Musculoskeletal System and Conn Tissue,2,Moderate,Moderate,Medical,Medicaid,Medicaid,,,N,Y,60895.35,13962.07
Finger Lakes,Livingston,2527000,000393,Nicholas H Noyes Memorial Hospital,70 or Older,148,M,White,Not Span/Hispanic,2,Emergency,Short-term Hospital,2017,237,Complication of device; implant or graft,159,OT DX PRCS ON MUSC/SKEL,349,"Malfunction, reaction, complic of orthopedic device or procedure",08,Diseases and Disorders of the Musculoskeletal System and Conn Tissue,2,Moderate,Moderate,Medical,Medicare,,,,N,Y,4972.22,2573.40
Central NY,Jefferson,2201000,000367,Samaritan Medical Center,50 to 69,136,M,White,Not Span/Hispanic,6,Emergency,Home or Self Care,2017,238,Complications of surgical procedures or medical care,000,NO PROC,349,"Malfunction, reaction, complic of orthopedic device or procedure",08,Diseases and Disorders of the Musculoskeletal System and Conn Tissue,4,Extreme,Major,Medical,Blue Cross/Blue Shield,Medicare,Self-Pay,,N,Y,37255.91,9359.88
Central NY,Oneida,3202002,000598,St Elizabeth Medical Center,50 to 69,135,M,White,Not Span/Hispanic,3,Emergency,Left Against Medical Advice,2017,238,Complications of surgical procedures or medical care,175,OT OR THER PRC SKN/BRST,349,"Malfunction, reaction, complic of orthopedic device or procedure",08,Diseases and Disorders of the Musculoskeletal System and Conn Tissue,2,Moderate,Moderate,Medical,Medicare,Medicaid,,,N,N,14573.85,6068.69
Capital/Adirond,Schenectady,4601001,000829,Ellis Hospital,70 or Older,120,M,White,Not Span/Hispanic,6,Emergency,Skilled Nursing Home,2017,238,Complications of surgical procedures or medical care,000,NO PROC,349,"Malfunction, reaction, complic of orthopedic device or procedure",08,Diseases and Disorders of the Musculoskeletal System and Conn Tissue,3,Major,Major,Medical,Medicare,Medicare,,,N,N,30987.40,8528.25
New York City,Kings,7001037,001320,University Hospital of Brooklyn,50 to 69,112,M,Black/African American,Not Span/Hispanic,22,Emergency,Home or Self Care,2017,238,Complications of surgical procedures or medical care,231,OTHER THERAPEUTIC PRCS,349,"Malfunction, reaction, complic of orthopedic device or procedure",08,Diseases and Disorders of the Musculoskeletal System and Conn Tissue,3,Major,Major,Medical,Medicare,Medicare,Medicaid,,N,Y,108527.00,87748.30
New York City,Kings,7002002,001324,Mount Sinai Brooklyn,30 to 49,112,M,Black/African American,Spanish/Hispanic,11,Emergency,Skilled Nursing Home,2017,238,Complications of surgical procedures or medical care,174,OT NON-OR THER PRC SKIN,349,"Malfunction, reaction, complic of orthopedic device or procedure",08,Diseases and Disorders of the Musculoskeletal System and Conn Tissue,3,Major,Moderate,Medical,Medicaid,Medicaid,Self-Pay,,N,Y,103275.70,25988.20
New York City,Manhattan,7002024,001456,Mount Sinai Hospital,70 or Older,111,F,Other Race,Not Span/Hispanic,21,Emergency,Hospice - Medical Facility,2017,238,Complications of surgical procedures or medical care,216,RESP INTUB/MECH VENTIL,349,"Malfunction, reaction, complic of orthopedic device or procedure",08,Diseases and Disorders of the Musculoskeletal System and Conn Tissue,4,Extreme,Extreme,Medical,Medicare,Medicare,Medicaid,,N,Y,222274.81,77510.01
New York City,Manhattan,7002024,001456,Mount Sinai Hospital,50 to 69,100,F,Black/African American,Not Span/Hispanic,8,Emergency,Home w/ Home Health Services,2017,237,Complication of device; implant or graft,223,ENTERAL/PARENTERAL NUTR,349,"Malfunction, reaction, complic of orthopedic device or procedure",08,Diseases and Disorders of the Musculoskeletal System and Conn Tissue,3,Major,Moderate,Medical,Medicare,Medicare,Self-Pay,,N,Y,82463.26,28864.06
Long Island,Nassau,2952006,000551,St. Joseph Hospital,70 or Older,117,F,White,Not Span/Hispanic,2,Emergency,Short-term Hospital,2017,237,Complication of device; implant or graft,159,OT DX PRCS ON MUSC/SKEL,349,"Malfunction, reaction, complic of orthopedic device or procedure",08,Diseases and Disorders of the Musculoskeletal System and Conn Tissue,3,Major,Major,Medical,Medicare,Private Health Insurance,,,N,Y,27602.09,5431.94